hotspot_runtime_0
[2025-11-20T00:31:30.722Z] Running test hotspot_runtime_0 ...
[2025-11-20T00:31:30.722Z] ===============================================
[2025-11-20T00:31:30.722Z] hotspot_runtime_0 Start Time: Thu Nov 20 00:31:29 2025 Epoch Time (ms): 1763598689785
[2025-11-20T00:31:30.722Z] variation: NoOptions
[2025-11-20T00:31:30.722Z] JVM_OPTIONS:
[2025-11-20T00:31:30.722Z] { \
[2025-11-20T00:31:30.722Z] echo ""; echo "TEST SETUP:"; \
[2025-11-20T00:31:30.722Z] echo "Nothing to be done for setup."; \
[2025-11-20T00:31:30.722Z] mkdir -p "/home/jenkins/workspace/Test_openjdk21_hs_extended.openjdk_aarch64_linux_testList_5/aqa-tests/TKG/../TKG/output_17635986894292/hotspot_runtime_0"; \
[2025-11-20T00:31:30.722Z] cd "/home/jenkins/workspace/Test_openjdk21_hs_extended.openjdk_aarch64_linux_testList_5/aqa-tests/TKG/../TKG/output_17635986894292/hotspot_runtime_0"; \
[2025-11-20T00:31:30.722Z] echo ""; echo "TESTING:"; \
[2025-11-20T00:31:30.722Z] "/home/jenkins/workspace/Test_openjdk21_hs_extended.openjdk_aarch64_linux_testList_5/jdkbinary/j2sdk-image/bin/java" -Xmx512m -jar "/home/jenkins/workspace/Test_openjdk21_hs_extended.openjdk_aarch64_linux_testList_5/aqa-tests/TKG/../../jvmtest/openjdk/jtreg/lib/jtreg.jar" \
[2025-11-20T00:31:30.722Z] -agentvm -a -ea -esa -v:fail,error,time,nopass -retain:fail,error,*.dmp,javacore.*,heapdump.*,*.trc -ignore:quiet -timeoutFactor:12 -xml:verify -concurrency:3 -nativepath:"/home/jenkins/workspace/Test_openjdk21_hs_extended.openjdk_aarch64_linux_testList_5/jdkbinary/openjdk-test-image/hotspot/jtreg/native" -vmoptions:"-Xmx512m " \
[2025-11-20T00:31:30.722Z] -w ""/home/jenkins/workspace/Test_openjdk21_hs_extended.openjdk_aarch64_linux_testList_5/aqa-tests/TKG/../TKG/output_17635986894292/hotspot_runtime_0"/work" \
[2025-11-20T00:31:30.722Z] -r ""/home/jenkins/workspace/Test_openjdk21_hs_extended.openjdk_aarch64_linux_testList_5/aqa-tests/TKG/../TKG/output_17635986894292/hotspot_runtime_0"/report" \
[2025-11-20T00:31:30.722Z] -jdk:"/home/jenkins/workspace/Test_openjdk21_hs_extended.openjdk_aarch64_linux_testList_5/jdkbinary/j2sdk-image" \
[2025-11-20T00:31:30.722Z] -exclude:"/home/jenkins/workspace/Test_openjdk21_hs_extended.openjdk_aarch64_linux_testList_5/aqa-tests/TKG/../openjdk/openjdk-jdk/test/hotspot/jtreg/ProblemList.txt" \
[2025-11-20T00:31:30.722Z] -exclude:"/home/jenkins/workspace/Test_openjdk21_hs_extended.openjdk_aarch64_linux_testList_5/aqa-tests/TKG/../../jvmtest/openjdk/excludes/ProblemList_openjdk21.txt" \
[2025-11-20T00:31:30.722Z] \
[2025-11-20T00:31:30.722Z] -exclude:"/home/jenkins/workspace/Test_openjdk21_hs_extended.openjdk_aarch64_linux_testList_5/aqa-tests/TKG/../openjdk/excludes/vendors/eclipse/ProblemList_openjdk21.txt" \
[2025-11-20T00:31:30.722Z] "/home/jenkins/workspace/Test_openjdk21_hs_extended.openjdk_aarch64_linux_testList_5/aqa-tests/TKG/../openjdk/openjdk-jdk/test/hotspot/jtreg:hotspot_runtime"; \
[2025-11-20T00:31:30.722Z] if [ $? -eq 0 ]; then echo "-----------------------------------"; echo "hotspot_runtime_0""_PASSED"; echo "-----------------------------------"; cd /home/jenkins/workspace/Test_openjdk21_hs_extended.openjdk_aarch64_linux_testList_5/aqa-tests/TKG/..; else echo "-----------------------------------"; echo "hotspot_runtime_0""_FAILED"; echo "-----------------------------------"; fi; \
[2025-11-20T00:31:30.722Z] echo ""; echo "TEST TEARDOWN:"; \
[2025-11-20T00:31:30.722Z] echo "Nothing to be done for teardown."; \
[2025-11-20T00:31:30.722Z] } 2>&1 | tee -a "/home/jenkins/workspace/Test_openjdk21_hs_extended.openjdk_aarch64_linux_testList_5/aqa-tests/TKG/../TKG/output_17635986894292/TestTargetResult";
[2025-11-20T00:31:30.722Z]
[2025-11-20T00:31:30.722Z] TEST SETUP:
[2025-11-20T00:31:30.722Z] Nothing to be done for setup.
[2025-11-20T00:31:30.722Z]
[2025-11-20T00:31:30.722Z] TESTING:
[2025-11-20T00:31:32.666Z] Directory "/home/jenkins/workspace/Test_openjdk21_hs_extended.openjdk_aarch64_linux_testList_5/aqa-tests/TKG/../TKG/output_17635986894292/hotspot_runtime_0/work" not found: creating
[2025-11-20T00:31:32.666Z] Directory "/home/jenkins/workspace/Test_openjdk21_hs_extended.openjdk_aarch64_linux_testList_5/aqa-tests/TKG/../TKG/output_17635986894292/hotspot_runtime_0/report" not found: creating
[2025-11-20T00:31:39.339Z] XML output with verification to /home/jenkins/workspace/Test_openjdk21_hs_extended.openjdk_aarch64_linux_testList_5/aqa-tests/TKG/output_17635986894292/hotspot_runtime_0/work
[2025-11-20T00:46:26.515Z] --------------------------------------------------
[2025-11-20T00:46:26.515Z] TEST: runtime/CommandLine/OptionsValidation/TestOptionsWithRanges.java#id4
[2025-11-20T00:46:26.515Z] TEST JDK: /home/jenkins/workspace/Test_openjdk21_hs_extended.openjdk_aarch64_linux_testList_5/jdkbinary/j2sdk-image
[2025-11-20T00:46:26.515Z]
[2025-11-20T00:46:26.515Z] ACTION: build -- Passed. Build successful
[2025-11-20T00:46:26.515Z] REASON: Named class compiled on demand
[2025-11-20T00:46:26.515Z] TIME: 0.132 seconds
[2025-11-20T00:46:26.515Z] messages:
[2025-11-20T00:46:26.515Z] command: build TestOptionsWithRanges
[2025-11-20T00:46:26.515Z] reason: Named class compiled on demand
[2025-11-20T00:46:26.515Z] started: Thu Nov 20 00:46:03 UTC 2025
[2025-11-20T00:46:26.515Z] Test directory:
[2025-11-20T00:46:26.515Z] compile: TestOptionsWithRanges
[2025-11-20T00:46:26.515Z] finished: Thu Nov 20 00:46:03 UTC 2025
[2025-11-20T00:46:26.515Z] elapsed time (seconds): 0.132
[2025-11-20T00:46:26.515Z]
[2025-11-20T00:46:26.515Z] ACTION: compile -- Passed. Compilation successful
[2025-11-20T00:46:26.515Z] REASON: .class file out of date or does not exist
[2025-11-20T00:46:26.515Z] TIME: 0.132 seconds
[2025-11-20T00:46:26.515Z] messages:
[2025-11-20T00:46:26.515Z] command: compile /home/jenkins/workspace/Test_openjdk21_hs_extended.openjdk_aarch64_linux_testList_5/aqa-tests/openjdk/openjdk-jdk/test/hotspot/jtreg/runtime/CommandLine/OptionsValidation/TestOptionsWithRanges.java
[2025-11-20T00:46:26.515Z] reason: .class file out of date or does not exist
[2025-11-20T00:46:26.515Z] started: Thu Nov 20 00:46:03 UTC 2025
[2025-11-20T00:46:26.515Z] Additional options from @modules: --add-modules java.base,java.management,jdk.attach,jdk.internal.jvmstat --add-exports java.base/jdk.internal.misc=ALL-UNNAMED --add-exports jdk.attach/sun.tools.attach=ALL-UNNAMED --add-exports jdk.internal.jvmstat/sun.jvmstat.monitor=ALL-UNNAMED
[2025-11-20T00:46:26.515Z] Mode: agentvm
[2025-11-20T00:46:26.515Z] Agent id: 2
[2025-11-20T00:46:26.515Z] finished: Thu Nov 20 00:46:03 UTC 2025
[2025-11-20T00:46:26.515Z] elapsed time (seconds): 0.132
[2025-11-20T00:46:26.515Z] configuration:
[2025-11-20T00:46:26.515Z] Boot Layer (javac runtime environment)
[2025-11-20T00:46:26.515Z] class path: /home/jenkins/workspace/Test_openjdk21_hs_extended.openjdk_aarch64_linux_testList_5/jvmtest/openjdk/jtreg/lib/javatest.jar
[2025-11-20T00:46:26.515Z] /home/jenkins/workspace/Test_openjdk21_hs_extended.openjdk_aarch64_linux_testList_5/jvmtest/openjdk/jtreg/lib/jtreg.jar
[2025-11-20T00:46:26.515Z] patch: java.base /home/jenkins/workspace/Test_openjdk21_hs_extended.openjdk_aarch64_linux_testList_5/aqa-tests/TKG/output_17635986894292/hotspot_runtime_0/work/patches/java.base
[2025-11-20T00:46:26.515Z]
[2025-11-20T00:46:26.515Z] javac compilation environment
[2025-11-20T00:46:26.515Z] add modules: java.base java.management jdk.attach jdk.internal.jvmstat
[2025-11-20T00:46:26.515Z] add exports: java.base/jdk.internal.misc ALL-UNNAMED
[2025-11-20T00:46:26.515Z] jdk.attach/sun.tools.attach ALL-UNNAMED
[2025-11-20T00:46:26.515Z] jdk.internal.jvmstat/sun.jvmstat.monitor ALL-UNNAMED
[2025-11-20T00:46:26.515Z] source path: /home/jenkins/workspace/Test_openjdk21_hs_extended.openjdk_aarch64_linux_testList_5/aqa-tests/openjdk/openjdk-jdk/test/hotspot/jtreg/runtime/CommandLine/OptionsValidation
[2025-11-20T00:46:26.515Z] /home/jenkins/workspace/Test_openjdk21_hs_extended.openjdk_aarch64_linux_testList_5/aqa-tests/openjdk/openjdk-jdk/test/lib
[2025-11-20T00:46:26.515Z] /home/jenkins/workspace/Test_openjdk21_hs_extended.openjdk_aarch64_linux_testList_5/aqa-tests/openjdk/openjdk-jdk/test/hotspot/jtreg/runtime/CommandLine/OptionsValidation/common
[2025-11-20T00:46:26.515Z] class path: /home/jenkins/workspace/Test_openjdk21_hs_extended.openjdk_aarch64_linux_testList_5/aqa-tests/openjdk/openjdk-jdk/test/hotspot/jtreg/runtime/CommandLine/OptionsValidation
[2025-11-20T00:46:26.515Z] /home/jenkins/workspace/Test_openjdk21_hs_extended.openjdk_aarch64_linux_testList_5/aqa-tests/TKG/output_17635986894292/hotspot_runtime_0/work/classes/2/runtime/CommandLine/OptionsValidation/TestOptionsWithRanges_id4.d
[2025-11-20T00:46:26.515Z] /home/jenkins/workspace/Test_openjdk21_hs_extended.openjdk_aarch64_linux_testList_5/aqa-tests/TKG/output_17635986894292/hotspot_runtime_0/work/classes/2/test/lib
[2025-11-20T00:46:26.515Z] /home/jenkins/workspace/Test_openjdk21_hs_extended.openjdk_aarch64_linux_testList_5/aqa-tests/TKG/output_17635986894292/hotspot_runtime_0/work/classes/2/runtime/CommandLine/OptionsValidation/common
[2025-11-20T00:46:26.515Z]
[2025-11-20T00:46:26.515Z] rerun:
[2025-11-20T00:46:26.515Z] cd /home/jenkins/workspace/Test_openjdk21_hs_extended.openjdk_aarch64_linux_testList_5/aqa-tests/TKG/output_17635986894292/hotspot_runtime_0/work/scratch/0 && \
[2025-11-20T00:46:26.515Z] DISPLAY=:0 \
[2025-11-20T00:46:26.515Z] HOME=/home/jenkins \
[2025-11-20T00:46:26.515Z] LANG=C.UTF-8 \
[2025-11-20T00:46:26.515Z] PATH=/bin:/usr/bin:/usr/sbin \
[2025-11-20T00:46:26.515Z] /home/jenkins/workspace/Test_openjdk21_hs_extended.openjdk_aarch64_linux_testList_5/jdkbinary/j2sdk-image/bin/javac \
[2025-11-20T00:46:26.515Z] -J-ea \
[2025-11-20T00:46:26.515Z] -J-esa \
[2025-11-20T00:46:26.515Z] -J-Xmx512m \
[2025-11-20T00:46:26.515Z] -J-Dtest.vm.opts='-ea -esa -Xmx512m' \
[2025-11-20T00:46:26.515Z] -J-Dtest.tool.vm.opts='-J-ea -J-esa -J-Xmx512m' \
[2025-11-20T00:46:26.515Z] -J-Dtest.compiler.opts= \
[2025-11-20T00:46:26.515Z] -J-Dtest.java.opts= \
[2025-11-20T00:46:26.515Z] -J-Dtest.jdk=/home/jenkins/workspace/Test_openjdk21_hs_extended.openjdk_aarch64_linux_testList_5/jdkbinary/j2sdk-image \
[2025-11-20T00:46:26.515Z] -J-Dcompile.jdk=/home/jenkins/workspace/Test_openjdk21_hs_extended.openjdk_aarch64_linux_testList_5/jdkbinary/j2sdk-image \
[2025-11-20T00:46:26.515Z] -J-Dtest.timeout.factor=12.0 \
[2025-11-20T00:46:26.515Z] -J-Dtest.nativepath=/home/jenkins/workspace/Test_openjdk21_hs_extended.openjdk_aarch64_linux_testList_5/jdkbinary/openjdk-test-image/hotspot/jtreg/native \
[2025-11-20T00:46:26.515Z] -J-Dtest.root=/home/jenkins/workspace/Test_openjdk21_hs_extended.openjdk_aarch64_linux_testList_5/aqa-tests/openjdk/openjdk-jdk/test/hotspot/jtreg \
[2025-11-20T00:46:26.515Z] -J-Dtest.name=runtime/CommandLine/OptionsValidation/TestOptionsWithRanges.java#id4 \
[2025-11-20T00:46:26.515Z] -J-Dtest.file=/home/jenkins/workspace/Test_openjdk21_hs_extended.openjdk_aarch64_linux_testList_5/aqa-tests/openjdk/openjdk-jdk/test/hotspot/jtreg/runtime/CommandLine/OptionsValidation/TestOptionsWithRanges.java \
[2025-11-20T00:46:26.515Z] -J-Dtest.src=/home/jenkins/workspace/Test_openjdk21_hs_extended.openjdk_aarch64_linux_testList_5/aqa-tests/openjdk/openjdk-jdk/test/hotspot/jtreg/runtime/CommandLine/OptionsValidation \
[2025-11-20T00:46:26.516Z] -J-Dtest.src.path=/home/jenkins/workspace/Test_openjdk21_hs_extended.openjdk_aarch64_linux_testList_5/aqa-tests/openjdk/openjdk-jdk/test/hotspot/jtreg/runtime/CommandLine/OptionsValidation:/home/jenkins/workspace/Test_openjdk21_hs_extended.openjdk_aarch64_linux_testList_5/aqa-tests/openjdk/openjdk-jdk/test/lib:/home/jenkins/workspace/Test_openjdk21_hs_extended.openjdk_aarch64_linux_testList_5/aqa-tests/openjdk/openjdk-jdk/test/hotspot/jtreg/runtime/CommandLine/OptionsValidation/common \
[2025-11-20T00:46:26.516Z] -J-Dtest.classes=/home/jenkins/workspace/Test_openjdk21_hs_extended.openjdk_aarch64_linux_testList_5/aqa-tests/TKG/output_17635986894292/hotspot_runtime_0/work/classes/2/runtime/CommandLine/OptionsValidation/TestOptionsWithRanges_id4.d \
[2025-11-20T00:46:26.516Z] -J-Dtest.class.path=/home/jenkins/workspace/Test_openjdk21_hs_extended.openjdk_aarch64_linux_testList_5/aqa-tests/TKG/output_17635986894292/hotspot_runtime_0/work/classes/2/runtime/CommandLine/OptionsValidation/TestOptionsWithRanges_id4.d:/home/jenkins/workspace/Test_openjdk21_hs_extended.openjdk_aarch64_linux_testList_5/aqa-tests/TKG/output_17635986894292/hotspot_runtime_0/work/classes/2/test/lib:/home/jenkins/workspace/Test_openjdk21_hs_extended.openjdk_aarch64_linux_testList_5/aqa-tests/TKG/output_17635986894292/hotspot_runtime_0/work/classes/2/runtime/CommandLine/OptionsValidation/common \
[2025-11-20T00:46:26.516Z] -J-Dtest.class.path.prefix=/home/jenkins/workspace/Test_openjdk21_hs_extended.openjdk_aarch64_linux_testList_5/aqa-tests/TKG/output_17635986894292/hotspot_runtime_0/work/classes/2/runtime/CommandLine/OptionsValidation/TestOptionsWithRanges_id4.d:/home/jenkins/workspace/Test_openjdk21_hs_extended.openjdk_aarch64_linux_testList_5/aqa-tests/openjdk/openjdk-jdk/test/hotspot/jtreg/runtime/CommandLine/OptionsValidation:/home/jenkins/workspace/Test_openjdk21_hs_extended.openjdk_aarch64_linux_testList_5/aqa-tests/TKG/output_17635986894292/hotspot_runtime_0/work/classes/2/test/lib:/home/jenkins/workspace/Test_openjdk21_hs_extended.openjdk_aarch64_linux_testList_5/aqa-tests/TKG/output_17635986894292/hotspot_runtime_0/work/classes/2/runtime/CommandLine/OptionsValidation/common \
[2025-11-20T00:46:26.516Z] -J-Dtest.modules='java.base/jdk.internal.misc java.management jdk.attach/sun.tools.attach jdk.internal.jvmstat/sun.jvmstat.monitor' \
[2025-11-20T00:46:26.516Z] --add-modules java.base,java.management,jdk.attach,jdk.internal.jvmstat \
[2025-11-20T00:46:26.516Z] --add-exports java.base/jdk.internal.misc=ALL-UNNAMED \
[2025-11-20T00:46:26.516Z] --add-exports jdk.attach/sun.tools.attach=ALL-UNNAMED \
[2025-11-20T00:46:26.516Z] --add-exports jdk.internal.jvmstat/sun.jvmstat.monitor=ALL-UNNAMED \
[2025-11-20T00:46:26.516Z] -d /home/jenkins/workspace/Test_openjdk21_hs_extended.openjdk_aarch64_linux_testList_5/aqa-tests/TKG/output_17635986894292/hotspot_runtime_0/work/classes/2/runtime/CommandLine/OptionsValidation/TestOptionsWithRanges_id4.d \
[2025-11-20T00:46:26.516Z] -sourcepath /home/jenkins/workspace/Test_openjdk21_hs_extended.openjdk_aarch64_linux_testList_5/aqa-tests/openjdk/openjdk-jdk/test/hotspot/jtreg/runtime/CommandLine/OptionsValidation:/home/jenkins/workspace/Test_openjdk21_hs_extended.openjdk_aarch64_linux_testList_5/aqa-tests/openjdk/openjdk-jdk/test/lib:/home/jenkins/workspace/Test_openjdk21_hs_extended.openjdk_aarch64_linux_testList_5/aqa-tests/openjdk/openjdk-jdk/test/hotspot/jtreg/runtime/CommandLine/OptionsValidation/common \
[2025-11-20T00:46:26.516Z] -classpath /home/jenkins/workspace/Test_openjdk21_hs_extended.openjdk_aarch64_linux_testList_5/aqa-tests/openjdk/openjdk-jdk/test/hotspot/jtreg/runtime/CommandLine/OptionsValidation:/home/jenkins/workspace/Test_openjdk21_hs_extended.openjdk_aarch64_linux_testList_5/aqa-tests/TKG/output_17635986894292/hotspot_runtime_0/work/classes/2/runtime/CommandLine/OptionsValidation/TestOptionsWithRanges_id4.d:/home/jenkins/workspace/Test_openjdk21_hs_extended.openjdk_aarch64_linux_testList_5/aqa-tests/TKG/output_17635986894292/hotspot_runtime_0/work/classes/2/test/lib:/home/jenkins/workspace/Test_openjdk21_hs_extended.openjdk_aarch64_linux_testList_5/aqa-tests/TKG/output_17635986894292/hotspot_runtime_0/work/classes/2/runtime/CommandLine/OptionsValidation/common /home/jenkins/workspace/Test_openjdk21_hs_extended.openjdk_aarch64_linux_testList_5/aqa-tests/openjdk/openjdk-jdk/test/hotspot/jtreg/runtime/CommandLine/OptionsValidation/TestOptionsWithRanges.java
[2025-11-20T00:46:26.516Z]
[2025-11-20T00:46:26.516Z] ACTION: driver -- Failed. Execution failed: `main' threw exception: java.lang.RuntimeException: 1 tests failed! (Error processing option LogEventsBufferEntries with valid value '-server -XX:+UseG1GC -XX:LogEventsBufferEntries=1048576'! JVM exited with unexpected error code = 137 [0x89]) expected: 1 but was: 0
[2025-11-20T00:46:26.516Z] REASON: User specified action: run driver/timeout=1800 TestOptionsWithRanges 5 of 10
[2025-11-20T00:46:26.516Z] TIME: 17.277 seconds
[2025-11-20T00:46:26.516Z] messages:
[2025-11-20T00:46:26.516Z] command: driver TestOptionsWithRanges 5 of 10
[2025-11-20T00:46:26.516Z] reason: User specified action: run driver/timeout=1800 TestOptionsWithRanges 5 of 10
[2025-11-20T00:46:26.516Z] started: Thu Nov 20 00:46:03 UTC 2025
[2025-11-20T00:46:26.516Z] Mode: agentvm
[2025-11-20T00:46:26.516Z] Agent id: 9
[2025-11-20T00:46:26.516Z] Additional exports to unnamed modules from @modules: java.base/jdk.internal.misc jdk.attach/sun.tools.attach jdk.internal.jvmstat/sun.jvmstat.monitor
[2025-11-20T00:46:26.516Z] finished: Thu Nov 20 00:46:20 UTC 2025
[2025-11-20T00:46:26.516Z] elapsed time (seconds): 17.277
[2025-11-20T00:46:26.516Z] configuration:
[2025-11-20T00:46:26.516Z] Boot Layer
[2025-11-20T00:46:26.516Z] class path: /home/jenkins/workspace/Test_openjdk21_hs_extended.openjdk_aarch64_linux_testList_5/jvmtest/openjdk/jtreg/lib/javatest.jar
[2025-11-20T00:46:26.516Z] /home/jenkins/workspace/Test_openjdk21_hs_extended.openjdk_aarch64_linux_testList_5/jvmtest/openjdk/jtreg/lib/jtreg.jar
[2025-11-20T00:46:26.516Z] /home/jenkins/workspace/Test_openjdk21_hs_extended.openjdk_aarch64_linux_testList_5/jvmtest/openjdk/jtreg/lib/junit-platform-console-standalone-1.9.2.jar
[2025-11-20T00:46:26.516Z] /home/jenkins/workspace/Test_openjdk21_hs_extended.openjdk_aarch64_linux_testList_5/jvmtest/openjdk/jtreg/lib/testng-7.3.0.jar
[2025-11-20T00:46:26.516Z] /home/jenkins/workspace/Test_openjdk21_hs_extended.openjdk_aarch64_linux_testList_5/jvmtest/openjdk/jtreg/lib/guice-5.1.0.jar
[2025-11-20T00:46:26.516Z] /home/jenkins/workspace/Test_openjdk21_hs_extended.openjdk_aarch64_linux_testList_5/jvmtest/openjdk/jtreg/lib/jcommander-1.82.jar
[2025-11-20T00:46:26.516Z] patch: java.base /home/jenkins/workspace/Test_openjdk21_hs_extended.openjdk_aarch64_linux_testList_5/aqa-tests/TKG/output_17635986894292/hotspot_runtime_0/work/patches/java.base
[2025-11-20T00:46:26.516Z]
[2025-11-20T00:46:26.516Z] Test Layer
[2025-11-20T00:46:26.516Z] add exports: java.base/jdk.internal.misc ALL-UNNAMED
[2025-11-20T00:46:26.516Z] jdk.attach/sun.tools.attach ALL-UNNAMED
[2025-11-20T00:46:26.516Z] jdk.internal.jvmstat/sun.jvmstat.monitor ALL-UNNAMED
[2025-11-20T00:46:26.516Z] class path: /home/jenkins/workspace/Test_openjdk21_hs_extended.openjdk_aarch64_linux_testList_5/aqa-tests/TKG/output_17635986894292/hotspot_runtime_0/work/classes/2/runtime/CommandLine/OptionsValidation/TestOptionsWithRanges_id4.d
[2025-11-20T00:46:26.516Z] /home/jenkins/workspace/Test_openjdk21_hs_extended.openjdk_aarch64_linux_testList_5/aqa-tests/openjdk/openjdk-jdk/test/hotspot/jtreg/runtime/CommandLine/OptionsValidation
[2025-11-20T00:46:26.516Z] /home/jenkins/workspace/Test_openjdk21_hs_extended.openjdk_aarch64_linux_testList_5/aqa-tests/TKG/output_17635986894292/hotspot_runtime_0/work/classes/2/test/lib
[2025-11-20T00:46:26.516Z] /home/jenkins/workspace/Test_openjdk21_hs_extended.openjdk_aarch64_linux_testList_5/aqa-tests/openjdk/openjdk-jdk/test/lib
[2025-11-20T00:46:26.516Z] /home/jenkins/workspace/Test_openjdk21_hs_extended.openjdk_aarch64_linux_testList_5/aqa-tests/TKG/output_17635986894292/hotspot_runtime_0/work/classes/2/runtime/CommandLine/OptionsValidation/common
[2025-11-20T00:46:26.516Z] /home/jenkins/workspace/Test_openjdk21_hs_extended.openjdk_aarch64_linux_testList_5/aqa-tests/openjdk/openjdk-jdk/test/hotspot/jtreg/runtime/CommandLine/OptionsValidation/common
[2025-11-20T00:46:26.516Z]
[2025-11-20T00:46:26.516Z] rerun:
[2025-11-20T00:46:26.516Z] cd /home/jenkins/workspace/Test_openjdk21_hs_extended.openjdk_aarch64_linux_testList_5/aqa-tests/TKG/output_17635986894292/hotspot_runtime_0/work/scratch/0 && \
[2025-11-20T00:46:26.516Z] DISPLAY=:0 \
[2025-11-20T00:46:26.516Z] HOME=/home/jenkins \
[2025-11-20T00:46:26.516Z] LANG=C.UTF-8 \
[2025-11-20T00:46:26.516Z] PATH=/bin:/usr/bin:/usr/sbin \
[2025-11-20T00:46:26.516Z] /home/jenkins/workspace/Test_openjdk21_hs_extended.openjdk_aarch64_linux_testList_5/jdkbinary/j2sdk-image/bin/java \
[2025-11-20T00:46:26.516Z] -Dtest.vm.opts='-ea -esa -Xmx512m' \
[2025-11-20T00:46:26.516Z] -Dtest.tool.vm.opts='-J-ea -J-esa -J-Xmx512m' \
[2025-11-20T00:46:26.516Z] -Dtest.compiler.opts= \
[2025-11-20T00:46:26.516Z] -Dtest.java.opts= \
[2025-11-20T00:46:26.516Z] -Dtest.jdk=/home/jenkins/workspace/Test_openjdk21_hs_extended.openjdk_aarch64_linux_testList_5/jdkbinary/j2sdk-image \
[2025-11-20T00:46:26.516Z] -Dcompile.jdk=/home/jenkins/workspace/Test_openjdk21_hs_extended.openjdk_aarch64_linux_testList_5/jdkbinary/j2sdk-image \
[2025-11-20T00:46:26.516Z] -Dtest.timeout.factor=12.0 \
[2025-11-20T00:46:26.516Z] -Dtest.nativepath=/home/jenkins/workspace/Test_openjdk21_hs_extended.openjdk_aarch64_linux_testList_5/jdkbinary/openjdk-test-image/hotspot/jtreg/native \
[2025-11-20T00:46:26.516Z] -Dtest.root=/home/jenkins/workspace/Test_openjdk21_hs_extended.openjdk_aarch64_linux_testList_5/aqa-tests/openjdk/openjdk-jdk/test/hotspot/jtreg \
[2025-11-20T00:46:26.516Z] -Dtest.name=runtime/CommandLine/OptionsValidation/TestOptionsWithRanges.java#id4 \
[2025-11-20T00:46:26.516Z] -Dtest.file=/home/jenkins/workspace/Test_openjdk21_hs_extended.openjdk_aarch64_linux_testList_5/aqa-tests/openjdk/openjdk-jdk/test/hotspot/jtreg/runtime/CommandLine/OptionsValidation/TestOptionsWithRanges.java \
[2025-11-20T00:46:26.516Z] -Dtest.src=/home/jenkins/workspace/Test_openjdk21_hs_extended.openjdk_aarch64_linux_testList_5/aqa-tests/openjdk/openjdk-jdk/test/hotspot/jtreg/runtime/CommandLine/OptionsValidation \
[2025-11-20T00:46:26.516Z] -Dtest.src.path=/home/jenkins/workspace/Test_openjdk21_hs_extended.openjdk_aarch64_linux_testList_5/aqa-tests/openjdk/openjdk-jdk/test/hotspot/jtreg/runtime/CommandLine/OptionsValidation:/home/jenkins/workspace/Test_openjdk21_hs_extended.openjdk_aarch64_linux_testList_5/aqa-tests/openjdk/openjdk-jdk/test/lib:/home/jenkins/workspace/Test_openjdk21_hs_extended.openjdk_aarch64_linux_testList_5/aqa-tests/openjdk/openjdk-jdk/test/hotspot/jtreg/runtime/CommandLine/OptionsValidation/common \
[2025-11-20T00:46:26.516Z] -Dtest.classes=/home/jenkins/workspace/Test_openjdk21_hs_extended.openjdk_aarch64_linux_testList_5/aqa-tests/TKG/output_17635986894292/hotspot_runtime_0/work/classes/2/runtime/CommandLine/OptionsValidation/TestOptionsWithRanges_id4.d \
[2025-11-20T00:46:26.516Z] -Dtest.class.path=/home/jenkins/workspace/Test_openjdk21_hs_extended.openjdk_aarch64_linux_testList_5/aqa-tests/TKG/output_17635986894292/hotspot_runtime_0/work/classes/2/runtime/CommandLine/OptionsValidation/TestOptionsWithRanges_id4.d:/home/jenkins/workspace/Test_openjdk21_hs_extended.openjdk_aarch64_linux_testList_5/aqa-tests/TKG/output_17635986894292/hotspot_runtime_0/work/classes/2/test/lib:/home/jenkins/workspace/Test_openjdk21_hs_extended.openjdk_aarch64_linux_testList_5/aqa-tests/TKG/output_17635986894292/hotspot_runtime_0/work/classes/2/runtime/CommandLine/OptionsValidation/common \
[2025-11-20T00:46:26.516Z] -Dtest.class.path.prefix=/home/jenkins/workspace/Test_openjdk21_hs_extended.openjdk_aarch64_linux_testList_5/aqa-tests/TKG/output_17635986894292/hotspot_runtime_0/work/classes/2/runtime/CommandLine/OptionsValidation/TestOptionsWithRanges_id4.d:/home/jenkins/workspace/Test_openjdk21_hs_extended.openjdk_aarch64_linux_testList_5/aqa-tests/openjdk/openjdk-jdk/test/hotspot/jtreg/runtime/CommandLine/OptionsValidation:/home/jenkins/workspace/Test_openjdk21_hs_extended.openjdk_aarch64_linux_testList_5/aqa-tests/TKG/output_17635986894292/hotspot_runtime_0/work/classes/2/test/lib:/home/jenkins/workspace/Test_openjdk21_hs_extended.openjdk_aarch64_linux_testList_5/aqa-tests/TKG/output_17635986894292/hotspot_runtime_0/work/classes/2/runtime/CommandLine/OptionsValidation/common \
[2025-11-20T00:46:26.516Z] -Dtest.modules='java.base/jdk.internal.misc java.management jdk.attach/sun.tools.attach jdk.internal.jvmstat/sun.jvmstat.monitor' \
[2025-11-20T00:46:26.516Z] -classpath /home/jenkins/workspace/Test_openjdk21_hs_extended.openjdk_aarch64_linux_testList_5/aqa-tests/TKG/output_17635986894292/hotspot_runtime_0/work/classes/2/runtime/CommandLine/OptionsValidation/TestOptionsWithRanges_id4.d:/home/jenkins/workspace/Test_openjdk21_hs_extended.openjdk_aarch64_linux_testList_5/aqa-tests/openjdk/openjdk-jdk/test/hotspot/jtreg/runtime/CommandLine/OptionsValidation:/home/jenkins/workspace/Test_openjdk21_hs_extended.openjdk_aarch64_linux_testList_5/aqa-tests/TKG/output_17635986894292/hotspot_runtime_0/work/classes/2/test/lib:/home/jenkins/workspace/Test_openjdk21_hs_extended.openjdk_aarch64_linux_testList_5/aqa-tests/openjdk/openjdk-jdk/test/lib:/home/jenkins/workspace/Test_openjdk21_hs_extended.openjdk_aarch64_linux_testList_5/aqa-tests/TKG/output_17635986894292/hotspot_runtime_0/work/classes/2/runtime/CommandLine/OptionsValidation/common:/home/jenkins/workspace/Test_openjdk21_hs_extended.openjdk_aarch64_linux_testList_5/aqa-tests/openjdk/openjdk-jdk/test/hotspot/jtreg/runtime/CommandLine/OptionsValidation/common:/home/jenkins/workspace/Test_openjdk21_hs_extended.openjdk_aarch64_linux_testList_5/jvmtest/openjdk/jtreg/lib/javatest.jar:/home/jenkins/workspace/Test_openjdk21_hs_extended.openjdk_aarch64_linux_testList_5/jvmtest/openjdk/jtreg/lib/jtreg.jar \
[2025-11-20T00:46:26.516Z] TestOptionsWithRanges 5 of 10
[2025-11-20T00:46:26.516Z] STDOUT:
[2025-11-20T00:46:26.516Z] Command line: [/home/jenkins/workspace/Test_openjdk21_hs_extended.openjdk_aarch64_linux_testList_5/jdkbinary/j2sdk-image/bin/java -cp /home/jenkins/workspace/Test_openjdk21_hs_extended.openjdk_aarch64_linux_testList_5/aqa-tests/TKG/output_17635986894292/hotspot_runtime_0/work/classes/2/runtime/CommandLine/OptionsValidation/TestOptionsWithRanges_id4.d:/home/jenkins/workspace/Test_openjdk21_hs_extended.openjdk_aarch64_linux_testList_5/aqa-tests/openjdk/openjdk-jdk/test/hotspot/jtreg/runtime/CommandLine/OptionsValidation:/home/jenkins/workspace/Test_openjdk21_hs_extended.openjdk_aarch64_linux_testList_5/aqa-tests/TKG/output_17635986894292/hotspot_runtime_0/work/classes/2/test/lib:/home/jenkins/workspace/Test_openjdk21_hs_extended.openjdk_aarch64_linux_testList_5/aqa-tests/TKG/output_17635986894292/hotspot_runtime_0/work/classes/2/runtime/CommandLine/OptionsValidation/common:/home/jenkins/workspace/Test_openjdk21_hs_extended.openjdk_aarch64_linux_testList_5/jvmtest/openjdk/jtreg/lib/javatest.jar:/home/jenkins/workspace/Test_openjdk21_hs_extended.openjdk_aarch64_linux_testList_5/jvmtest/openjdk/jtreg/lib/jtreg.jar:/home/jenkins/workspace/Test_openjdk21_hs_extended.openjdk_aarch64_linux_testList_5/jvmtest/openjdk/jtreg/lib/junit-platform-console-standalone-1.9.2.jar:/home/jenkins/workspace/Test_openjdk21_hs_extended.openjdk_aarch64_linux_testList_5/jvmtest/openjdk/jtreg/lib/testng-7.3.0.jar:/home/jenkins/workspace/Test_openjdk21_hs_extended.openjdk_aarch64_linux_testList_5/jvmtest/openjdk/jtreg/lib/guice-5.1.0.jar:/home/jenkins/workspace/Test_openjdk21_hs_extended.openjdk_aarch64_linux_testList_5/jvmtest/openjdk/jtreg/lib/jcommander-1.82.jar -server -XX:+UseG1GC -XX:+UnlockDiagnosticVMOptions -XX:+UnlockExperimentalVMOptions -XX:+PrintFlagsRanges -version ]
[2025-11-20T00:46:26.516Z] Generating subset [140 ... 176) of 36 tests out of 352 total tests
[2025-11-20T00:46:26.516Z] Parsed 36 options with ranges. Start test!
[2025-11-20T00:46:26.516Z] Testing valid LogEventsBufferEntries values.
[2025-11-20T00:46:26.516Z] Command line: [/home/jenkins/workspace/Test_openjdk21_hs_extended.openjdk_aarch64_linux_testList_5/jdkbinary/j2sdk-image/bin/java -cp /home/jenkins/workspace/Test_openjdk21_hs_extended.openjdk_aarch64_linux_testList_5/aqa-tests/TKG/output_17635986894292/hotspot_runtime_0/work/classes/2/runtime/CommandLine/OptionsValidation/TestOptionsWithRanges_id4.d:/home/jenkins/workspace/Test_openjdk21_hs_extended.openjdk_aarch64_linux_testList_5/aqa-tests/openjdk/openjdk-jdk/test/hotspot/jtreg/runtime/CommandLine/OptionsValidation:/home/jenkins/workspace/Test_openjdk21_hs_extended.openjdk_aarch64_linux_testList_5/aqa-tests/TKG/output_17635986894292/hotspot_runtime_0/work/classes/2/test/lib:/home/jenkins/workspace/Test_openjdk21_hs_extended.openjdk_aarch64_linux_testList_5/aqa-tests/TKG/output_17635986894292/hotspot_runtime_0/work/classes/2/runtime/CommandLine/OptionsValidation/common:/home/jenkins/workspace/Test_openjdk21_hs_extended.openjdk_aarch64_linux_testList_5/jvmtest/openjdk/jtreg/lib/javatest.jar:/home/jenkins/workspace/Test_openjdk21_hs_extended.openjdk_aarch64_linux_testList_5/jvmtest/openjdk/jtreg/lib/jtreg.jar:/home/jenkins/workspace/Test_openjdk21_hs_extended.openjdk_aarch64_linux_testList_5/jvmtest/openjdk/jtreg/lib/junit-platform-console-standalone-1.9.2.jar:/home/jenkins/workspace/Test_openjdk21_hs_extended.openjdk_aarch64_linux_testList_5/jvmtest/openjdk/jtreg/lib/testng-7.3.0.jar:/home/jenkins/workspace/Test_openjdk21_hs_extended.openjdk_aarch64_linux_testList_5/jvmtest/openjdk/jtreg/lib/guice-5.1.0.jar:/home/jenkins/workspace/Test_openjdk21_hs_extended.openjdk_aarch64_linux_testList_5/jvmtest/openjdk/jtreg/lib/jcommander-1.82.jar -server -Xmx1024m -XX:+UseG1GC -XX:+UnlockDiagnosticVMOptions -XX:+UnlockExperimentalVMOptions -XX:LogEventsBufferEntries=1 optionsvalidation.JVMStartup ]
[2025-11-20T00:46:26.516Z] [2025-11-20T00:46:03.392729916Z] Gathering output for process 3558422
[2025-11-20T00:46:26.516Z] [2025-11-20T00:46:03.395203928Z] Waiting for completion for process 3558422
[2025-11-20T00:46:26.516Z] [2025-11-20T00:46:03.472522978Z] Waiting for completion finished for process 3558422
[2025-11-20T00:46:26.516Z]
[2025-11-20T00:46:26.516Z] Command line: [/home/jenkins/workspace/Test_openjdk21_hs_extended.openjdk_aarch64_linux_testList_5/jdkbinary/j2sdk-image/bin/java -cp /home/jenkins/workspace/Test_openjdk21_hs_extended.openjdk_aarch64_linux_testList_5/aqa-tests/TKG/output_17635986894292/hotspot_runtime_0/work/classes/2/runtime/CommandLine/OptionsValidation/TestOptionsWithRanges_id4.d:/home/jenkins/workspace/Test_openjdk21_hs_extended.openjdk_aarch64_linux_testList_5/aqa-tests/openjdk/openjdk-jdk/test/hotspot/jtreg/runtime/CommandLine/OptionsValidation:/home/jenkins/workspace/Test_openjdk21_hs_extended.openjdk_aarch64_linux_testList_5/aqa-tests/TKG/output_17635986894292/hotspot_runtime_0/work/classes/2/test/lib:/home/jenkins/workspace/Test_openjdk21_hs_extended.openjdk_aarch64_linux_testList_5/aqa-tests/TKG/output_17635986894292/hotspot_runtime_0/work/classes/2/runtime/CommandLine/OptionsValidation/common:/home/jenkins/workspace/Test_openjdk21_hs_extended.openjdk_aarch64_linux_testList_5/jvmtest/openjdk/jtreg/lib/javatest.jar:/home/jenkins/workspace/Test_openjdk21_hs_extended.openjdk_aarch64_linux_testList_5/jvmtest/openjdk/jtreg/lib/jtreg.jar:/home/jenkins/workspace/Test_openjdk21_hs_extended.openjdk_aarch64_linux_testList_5/jvmtest/openjdk/jtreg/lib/junit-platform-console-standalone-1.9.2.jar:/home/jenkins/workspace/Test_openjdk21_hs_extended.openjdk_aarch64_linux_testList_5/jvmtest/openjdk/jtreg/lib/testng-7.3.0.jar:/home/jenkins/workspace/Test_openjdk21_hs_extended.openjdk_aarch64_linux_testList_5/jvmtest/openjdk/jtreg/lib/guice-5.1.0.jar:/home/jenkins/workspace/Test_openjdk21_hs_extended.openjdk_aarch64_linux_testList_5/jvmtest/openjdk/jtreg/lib/jcommander-1.82.jar -server -Xmx1024m -XX:+UseG1GC -XX:+UnlockDiagnosticVMOptions -XX:+UnlockExperimentalVMOptions -XX:LogEventsBufferEntries=1048576 optionsvalidation.JVMStartup ]
[2025-11-20T00:46:26.516Z] [2025-11-20T00:46:03.475052790Z] Gathering output for process 3558465
[2025-11-20T00:46:26.516Z] [2025-11-20T00:46:03.475645513Z] Waiting for completion for process 3558465
[2025-11-20T00:46:26.516Z] [2025-11-20T00:46:09.448810490Z] Waiting for completion finished for process 3558465
[2025-11-20T00:46:26.516Z]
[2025-11-20T00:46:26.516Z] Testing invalid LogEventsBufferEntries values.
[2025-11-20T00:46:26.516Z] Command line: [/home/jenkins/workspace/Test_openjdk21_hs_extended.openjdk_aarch64_linux_testList_5/jdkbinary/j2sdk-image/bin/java -cp /home/jenkins/workspace/Test_openjdk21_hs_extended.openjdk_aarch64_linux_testList_5/aqa-tests/TKG/output_17635986894292/hotspot_runtime_0/work/classes/2/runtime/CommandLine/OptionsValidation/TestOptionsWithRanges_id4.d:/home/jenkins/workspace/Test_openjdk21_hs_extended.openjdk_aarch64_linux_testList_5/aqa-tests/openjdk/openjdk-jdk/test/hotspot/jtreg/runtime/CommandLine/OptionsValidation:/home/jenkins/workspace/Test_openjdk21_hs_extended.openjdk_aarch64_linux_testList_5/aqa-tests/TKG/output_17635986894292/hotspot_runtime_0/work/classes/2/test/lib:/home/jenkins/workspace/Test_openjdk21_hs_extended.openjdk_aarch64_linux_testList_5/aqa-tests/TKG/output_17635986894292/hotspot_runtime_0/work/classes/2/runtime/CommandLine/OptionsValidation/common:/home/jenkins/workspace/Test_openjdk21_hs_extended.openjdk_aarch64_linux_testList_5/jvmtest/openjdk/jtreg/lib/javatest.jar:/home/jenkins/workspace/Test_openjdk21_hs_extended.openjdk_aarch64_linux_testList_5/jvmtest/openjdk/jtreg/lib/jtreg.jar:/home/jenkins/workspace/Test_openjdk21_hs_extended.openjdk_aarch64_linux_testList_5/jvmtest/openjdk/jtreg/lib/junit-platform-console-standalone-1.9.2.jar:/home/jenkins/workspace/Test_openjdk21_hs_extended.openjdk_aarch64_linux_testList_5/jvmtest/openjdk/jtreg/lib/testng-7.3.0.jar:/home/jenkins/workspace/Test_openjdk21_hs_extended.openjdk_aarch64_linux_testList_5/jvmtest/openjdk/jtreg/lib/guice-5.1.0.jar:/home/jenkins/workspace/Test_openjdk21_hs_extended.openjdk_aarch64_linux_testList_5/jvmtest/openjdk/jtreg/lib/jcommander-1.82.jar -server -Xmx1024m -XX:+UseG1GC -XX:+UnlockDiagnosticVMOptions -XX:+UnlockExperimentalVMOptions -XX:LogEventsBufferEntries=0 optionsvalidation.JVMStartup ]
[2025-11-20T00:46:26.516Z] [2025-11-20T00:46:09.633440935Z] Gathering output for process 3559118
[2025-11-20T00:46:26.516Z] [2025-11-20T00:46:09.634174298Z] Waiting for completion for process 3559118
[2025-11-20T00:46:26.516Z] [2025-11-20T00:46:10.170509628Z] Waiting for completion finished for process 3559118
[2025-11-20T00:46:26.516Z]
[2025-11-20T00:46:26.516Z] Command line: [/home/jenkins/workspace/Test_openjdk21_hs_extended.openjdk_aarch64_linux_testList_5/jdkbinary/j2sdk-image/bin/java -cp /home/jenkins/workspace/Test_openjdk21_hs_extended.openjdk_aarch64_linux_testList_5/aqa-tests/TKG/output_17635986894292/hotspot_runtime_0/work/classes/2/runtime/CommandLine/OptionsValidation/TestOptionsWithRanges_id4.d:/home/jenkins/workspace/Test_openjdk21_hs_extended.openjdk_aarch64_linux_testList_5/aqa-tests/openjdk/openjdk-jdk/test/hotspot/jtreg/runtime/CommandLine/OptionsValidation:/home/jenkins/workspace/Test_openjdk21_hs_extended.openjdk_aarch64_linux_testList_5/aqa-tests/TKG/output_17635986894292/hotspot_runtime_0/work/classes/2/test/lib:/home/jenkins/workspace/Test_openjdk21_hs_extended.openjdk_aarch64_linux_testList_5/aqa-tests/TKG/output_17635986894292/hotspot_runtime_0/work/classes/2/runtime/CommandLine/OptionsValidation/common:/home/jenkins/workspace/Test_openjdk21_hs_extended.openjdk_aarch64_linux_testList_5/jvmtest/openjdk/jtreg/lib/javatest.jar:/home/jenkins/workspace/Test_openjdk21_hs_extended.openjdk_aarch64_linux_testList_5/jvmtest/openjdk/jtreg/lib/jtreg.jar:/home/jenkins/workspace/Test_openjdk21_hs_extended.openjdk_aarch64_linux_testList_5/jvmtest/openjdk/jtreg/lib/junit-platform-console-standalone-1.9.2.jar:/home/jenkins/workspace/Test_openjdk21_hs_extended.openjdk_aarch64_linux_testList_5/jvmtest/openjdk/jtreg/lib/testng-7.3.0.jar:/home/jenkins/workspace/Test_openjdk21_hs_extended.openjdk_aarch64_linux_testList_5/jvmtest/openjdk/jtreg/lib/guice-5.1.0.jar:/home/jenkins/workspace/Test_openjdk21_hs_extended.openjdk_aarch64_linux_testList_5/jvmtest/openjdk/jtreg/lib/jcommander-1.82.jar -server -Xmx1024m -XX:+UseG1GC -XX:+UnlockDiagnosticVMOptions -XX:+UnlockExperimentalVMOptions -XX:LogEventsBufferEntries=1048577 optionsvalidation.JVMStartup ]
[2025-11-20T00:46:26.516Z] [2025-11-20T00:46:10.172362957Z] Gathering output for process 3559132
[2025-11-20T00:46:26.516Z] [2025-11-20T00:46:10.172935400Z] Waiting for completion for process 3559132
[2025-11-20T00:46:26.516Z] [2025-11-20T00:46:10.179417151Z] Waiting for completion finished for process 3559132
[2025-11-20T00:46:26.516Z]
[2025-11-20T00:46:26.516Z] Testing valid LoopMaxUnroll values.
[2025-11-20T00:46:26.516Z] Command line: [/home/jenkins/workspace/Test_openjdk21_hs_extended.openjdk_aarch64_linux_testList_5/jdkbinary/j2sdk-image/bin/java -cp /home/jenkins/workspace/Test_openjdk21_hs_extended.openjdk_aarch64_linux_testList_5/aqa-tests/TKG/output_17635986894292/hotspot_runtime_0/work/classes/2/runtime/CommandLine/OptionsValidation/TestOptionsWithRanges_id4.d:/home/jenkins/workspace/Test_openjdk21_hs_extended.openjdk_aarch64_linux_testList_5/aqa-tests/openjdk/openjdk-jdk/test/hotspot/jtreg/runtime/CommandLine/OptionsValidation:/home/jenkins/workspace/Test_openjdk21_hs_extended.openjdk_aarch64_linux_testList_5/aqa-tests/TKG/output_17635986894292/hotspot_runtime_0/work/classes/2/test/lib:/home/jenkins/workspace/Test_openjdk21_hs_extended.openjdk_aarch64_linux_testList_5/aqa-tests/TKG/output_17635986894292/hotspot_runtime_0/work/classes/2/runtime/CommandLine/OptionsValidation/common:/home/jenkins/workspace/Test_openjdk21_hs_extended.openjdk_aarch64_linux_testList_5/jvmtest/openjdk/jtreg/lib/javatest.jar:/home/jenkins/workspace/Test_openjdk21_hs_extended.openjdk_aarch64_linux_testList_5/jvmtest/openjdk/jtreg/lib/jtreg.jar:/home/jenkins/workspace/Test_openjdk21_hs_extended.openjdk_aarch64_linux_testList_5/jvmtest/openjdk/jtreg/lib/junit-platform-console-standalone-1.9.2.jar:/home/jenkins/workspace/Test_openjdk21_hs_extended.openjdk_aarch64_linux_testList_5/jvmtest/openjdk/jtreg/lib/testng-7.3.0.jar:/home/jenkins/workspace/Test_openjdk21_hs_extended.openjdk_aarch64_linux_testList_5/jvmtest/openjdk/jtreg/lib/guice-5.1.0.jar:/home/jenkins/workspace/Test_openjdk21_hs_extended.openjdk_aarch64_linux_testList_5/jvmtest/openjdk/jtreg/lib/jcommander-1.82.jar -server -Xmx1024m -XX:+UseG1GC -XX:+UnlockDiagnosticVMOptions -XX:+UnlockExperimentalVMOptions -XX:LoopMaxUnroll=0 optionsvalidation.JVMStartup ]
[2025-11-20T00:46:26.516Z] [2025-11-20T00:46:10.181178359Z] Gathering output for process 3559137
[2025-11-20T00:46:26.516Z] [2025-11-20T00:46:10.181672881Z] Waiting for completion for process 3559137
[2025-11-20T00:46:26.516Z] [2025-11-20T00:46:10.523240798Z] Waiting for completion finished for process 3559137
[2025-11-20T00:46:26.516Z]
[2025-11-20T00:46:26.516Z] Command line: [/home/jenkins/workspace/Test_openjdk21_hs_extended.openjdk_aarch64_linux_testList_5/jdkbinary/j2sdk-image/bin/java -cp /home/jenkins/workspace/Test_openjdk21_hs_extended.openjdk_aarch64_linux_testList_5/aqa-tests/TKG/output_17635986894292/hotspot_runtime_0/work/classes/2/runtime/CommandLine/OptionsValidation/TestOptionsWithRanges_id4.d:/home/jenkins/workspace/Test_openjdk21_hs_extended.openjdk_aarch64_linux_testList_5/aqa-tests/openjdk/openjdk-jdk/test/hotspot/jtreg/runtime/CommandLine/OptionsValidation:/home/jenkins/workspace/Test_openjdk21_hs_extended.openjdk_aarch64_linux_testList_5/aqa-tests/TKG/output_17635986894292/hotspot_runtime_0/work/classes/2/test/lib:/home/jenkins/workspace/Test_openjdk21_hs_extended.openjdk_aarch64_linux_testList_5/aqa-tests/TKG/output_17635986894292/hotspot_runtime_0/work/classes/2/runtime/CommandLine/OptionsValidation/common:/home/jenkins/workspace/Test_openjdk21_hs_extended.openjdk_aarch64_linux_testList_5/jvmtest/openjdk/jtreg/lib/javatest.jar:/home/jenkins/workspace/Test_openjdk21_hs_extended.openjdk_aarch64_linux_testList_5/jvmtest/openjdk/jtreg/lib/jtreg.jar:/home/jenkins/workspace/Test_openjdk21_hs_extended.openjdk_aarch64_linux_testList_5/jvmtest/openjdk/jtreg/lib/junit-platform-console-standalone-1.9.2.jar:/home/jenkins/workspace/Test_openjdk21_hs_extended.openjdk_aarch64_linux_testList_5/jvmtest/openjdk/jtreg/lib/testng-7.3.0.jar:/home/jenkins/workspace/Test_openjdk21_hs_extended.openjdk_aarch64_linux_testList_5/jvmtest/openjdk/jtreg/lib/guice-5.1.0.jar:/home/jenkins/workspace/Test_openjdk21_hs_extended.openjdk_aarch64_linux_testList_5/jvmtest/openjdk/jtreg/lib/jcommander-1.82.jar -server -Xmx1024m -XX:+UseG1GC -XX:+UnlockDiagnosticVMOptions -XX:+UnlockExperimentalVMOptions -XX:LoopMaxUnroll=2147483647 optionsvalidation.JVMStartup ]
[2025-11-20T00:46:26.516Z] [2025-11-20T00:46:10.527480258Z] Gathering output for process 3559196
[2025-11-20T00:46:26.516Z] [2025-11-20T00:46:10.527979701Z] Waiting for completion for process 3559196
[2025-11-20T00:46:26.517Z] [2025-11-20T00:46:10.609531131Z] Waiting for completion finished for process 3559196
[2025-11-20T00:46:26.517Z]
[2025-11-20T00:46:26.517Z] Command line: [/home/jenkins/workspace/Test_openjdk21_hs_extended.openjdk_aarch64_linux_testList_5/jdkbinary/j2sdk-image/bin/java -cp /home/jenkins/workspace/Test_openjdk21_hs_extended.openjdk_aarch64_linux_testList_5/aqa-tests/TKG/output_17635986894292/hotspot_runtime_0/work/classes/2/runtime/CommandLine/OptionsValidation/TestOptionsWithRanges_id4.d:/home/jenkins/workspace/Test_openjdk21_hs_extended.openjdk_aarch64_linux_testList_5/aqa-tests/openjdk/openjdk-jdk/test/hotspot/jtreg/runtime/CommandLine/OptionsValidation:/home/jenkins/workspace/Test_openjdk21_hs_extended.openjdk_aarch64_linux_testList_5/aqa-tests/TKG/output_17635986894292/hotspot_runtime_0/work/classes/2/test/lib:/home/jenkins/workspace/Test_openjdk21_hs_extended.openjdk_aarch64_linux_testList_5/aqa-tests/TKG/output_17635986894292/hotspot_runtime_0/work/classes/2/runtime/CommandLine/OptionsValidation/common:/home/jenkins/workspace/Test_openjdk21_hs_extended.openjdk_aarch64_linux_testList_5/jvmtest/openjdk/jtreg/lib/javatest.jar:/home/jenkins/workspace/Test_openjdk21_hs_extended.openjdk_aarch64_linux_testList_5/jvmtest/openjdk/jtreg/lib/jtreg.jar:/home/jenkins/workspace/Test_openjdk21_hs_extended.openjdk_aarch64_linux_testList_5/jvmtest/openjdk/jtreg/lib/junit-platform-console-standalone-1.9.2.jar:/home/jenkins/workspace/Test_openjdk21_hs_extended.openjdk_aarch64_linux_testList_5/jvmtest/openjdk/jtreg/lib/testng-7.3.0.jar:/home/jenkins/workspace/Test_openjdk21_hs_extended.openjdk_aarch64_linux_testList_5/jvmtest/openjdk/jtreg/lib/guice-5.1.0.jar:/home/jenkins/workspace/Test_openjdk21_hs_extended.openjdk_aarch64_linux_testList_5/jvmtest/openjdk/jtreg/lib/jcommander-1.82.jar -server -Xmx1024m -XX:+UseG1GC -XX:+UnlockDiagnosticVMOptions -XX:+UnlockExperimentalVMOptions -XX:LoopMaxUnroll=1 optionsvalidation.JVMStartup ]
[2025-11-20T00:46:26.517Z] [2025-11-20T00:46:10.611337380Z] Gathering output for process 3559251
[2025-11-20T00:46:26.517Z] [2025-11-20T00:46:10.611891583Z] Waiting for completion for process 3559251
[2025-11-20T00:46:26.517Z] [2025-11-20T00:46:10.713782111Z] Waiting for completion finished for process 3559251
[2025-11-20T00:46:26.517Z]
[2025-11-20T00:46:26.517Z] Testing invalid LoopMaxUnroll values.
[2025-11-20T00:46:26.517Z] Command line: [/home/jenkins/workspace/Test_openjdk21_hs_extended.openjdk_aarch64_linux_testList_5/jdkbinary/j2sdk-image/bin/java -cp /home/jenkins/workspace/Test_openjdk21_hs_extended.openjdk_aarch64_linux_testList_5/aqa-tests/TKG/output_17635986894292/hotspot_runtime_0/work/classes/2/runtime/CommandLine/OptionsValidation/TestOptionsWithRanges_id4.d:/home/jenkins/workspace/Test_openjdk21_hs_extended.openjdk_aarch64_linux_testList_5/aqa-tests/openjdk/openjdk-jdk/test/hotspot/jtreg/runtime/CommandLine/OptionsValidation:/home/jenkins/workspace/Test_openjdk21_hs_extended.openjdk_aarch64_linux_testList_5/aqa-tests/TKG/output_17635986894292/hotspot_runtime_0/work/classes/2/test/lib:/home/jenkins/workspace/Test_openjdk21_hs_extended.openjdk_aarch64_linux_testList_5/aqa-tests/TKG/output_17635986894292/hotspot_runtime_0/work/classes/2/runtime/CommandLine/OptionsValidation/common:/home/jenkins/workspace/Test_openjdk21_hs_extended.openjdk_aarch64_linux_testList_5/jvmtest/openjdk/jtreg/lib/javatest.jar:/home/jenkins/workspace/Test_openjdk21_hs_extended.openjdk_aarch64_linux_testList_5/jvmtest/openjdk/jtreg/lib/jtreg.jar:/home/jenkins/workspace/Test_openjdk21_hs_extended.openjdk_aarch64_linux_testList_5/jvmtest/openjdk/jtreg/lib/junit-platform-console-standalone-1.9.2.jar:/home/jenkins/workspace/Test_openjdk21_hs_extended.openjdk_aarch64_linux_testList_5/jvmtest/openjdk/jtreg/lib/testng-7.3.0.jar:/home/jenkins/workspace/Test_openjdk21_hs_extended.openjdk_aarch64_linux_testList_5/jvmtest/openjdk/jtreg/lib/guice-5.1.0.jar:/home/jenkins/workspace/Test_openjdk21_hs_extended.openjdk_aarch64_linux_testList_5/jvmtest/openjdk/jtreg/lib/jcommander-1.82.jar -server -Xmx1024m -XX:+UseG1GC -XX:+UnlockDiagnosticVMOptions -XX:+UnlockExperimentalVMOptions -XX:LoopMaxUnroll=-1 optionsvalidation.JVMStartup ]
[2025-11-20T00:46:26.517Z] [2025-11-20T00:46:10.715703800Z] Gathering output for process 3559299
[2025-11-20T00:46:26.517Z] [2025-11-20T00:46:10.716127362Z] Waiting for completion for process 3559299
[2025-11-20T00:46:26.517Z] [2025-11-20T00:46:10.724430402Z] Waiting for completion finished for process 3559299
[2025-11-20T00:46:26.517Z]
[2025-11-20T00:46:26.517Z] Command line: [/home/jenkins/workspace/Test_openjdk21_hs_extended.openjdk_aarch64_linux_testList_5/jdkbinary/j2sdk-image/bin/java -cp /home/jenkins/workspace/Test_openjdk21_hs_extended.openjdk_aarch64_linux_testList_5/aqa-tests/TKG/output_17635986894292/hotspot_runtime_0/work/classes/2/runtime/CommandLine/OptionsValidation/TestOptionsWithRanges_id4.d:/home/jenkins/workspace/Test_openjdk21_hs_extended.openjdk_aarch64_linux_testList_5/aqa-tests/openjdk/openjdk-jdk/test/hotspot/jtreg/runtime/CommandLine/OptionsValidation:/home/jenkins/workspace/Test_openjdk21_hs_extended.openjdk_aarch64_linux_testList_5/aqa-tests/TKG/output_17635986894292/hotspot_runtime_0/work/classes/2/test/lib:/home/jenkins/workspace/Test_openjdk21_hs_extended.openjdk_aarch64_linux_testList_5/aqa-tests/TKG/output_17635986894292/hotspot_runtime_0/work/classes/2/runtime/CommandLine/OptionsValidation/common:/home/jenkins/workspace/Test_openjdk21_hs_extended.openjdk_aarch64_linux_testList_5/jvmtest/openjdk/jtreg/lib/javatest.jar:/home/jenkins/workspace/Test_openjdk21_hs_extended.openjdk_aarch64_linux_testList_5/jvmtest/openjdk/jtreg/lib/jtreg.jar:/home/jenkins/workspace/Test_openjdk21_hs_extended.openjdk_aarch64_linux_testList_5/jvmtest/openjdk/jtreg/lib/junit-platform-console-standalone-1.9.2.jar:/home/jenkins/workspace/Test_openjdk21_hs_extended.openjdk_aarch64_linux_testList_5/jvmtest/openjdk/jtreg/lib/testng-7.3.0.jar:/home/jenkins/workspace/Test_openjdk21_hs_extended.openjdk_aarch64_linux_testList_5/jvmtest/openjdk/jtreg/lib/guice-5.1.0.jar:/home/jenkins/workspace/Test_openjdk21_hs_extended.openjdk_aarch64_linux_testList_5/jvmtest/openjdk/jtreg/lib/jcommander-1.82.jar -server -Xmx1024m -XX:+UseG1GC -XX:+UnlockDiagnosticVMOptions -XX:+UnlockExperimentalVMOptions -XX:LoopMaxUnroll=2147483648 optionsvalidation.JVMStartup ]
[2025-11-20T00:46:26.517Z] [2025-11-20T00:46:10.726155130Z] Gathering output for process 3559303
[2025-11-20T00:46:26.517Z] [2025-11-20T00:46:10.726584692Z] Waiting for completion for process 3559303
[2025-11-20T00:46:26.517Z] [2025-11-20T00:46:10.732887962Z] Waiting for completion finished for process 3559303
[2025-11-20T00:46:26.517Z]
[2025-11-20T00:46:26.517Z] Testing valid LoopOptsCount values.
[2025-11-20T00:46:26.517Z] Command line: [/home/jenkins/workspace/Test_openjdk21_hs_extended.openjdk_aarch64_linux_testList_5/jdkbinary/j2sdk-image/bin/java -cp /home/jenkins/workspace/Test_openjdk21_hs_extended.openjdk_aarch64_linux_testList_5/aqa-tests/TKG/output_17635986894292/hotspot_runtime_0/work/classes/2/runtime/CommandLine/OptionsValidation/TestOptionsWithRanges_id4.d:/home/jenkins/workspace/Test_openjdk21_hs_extended.openjdk_aarch64_linux_testList_5/aqa-tests/openjdk/openjdk-jdk/test/hotspot/jtreg/runtime/CommandLine/OptionsValidation:/home/jenkins/workspace/Test_openjdk21_hs_extended.openjdk_aarch64_linux_testList_5/aqa-tests/TKG/output_17635986894292/hotspot_runtime_0/work/classes/2/test/lib:/home/jenkins/workspace/Test_openjdk21_hs_extended.openjdk_aarch64_linux_testList_5/aqa-tests/TKG/output_17635986894292/hotspot_runtime_0/work/classes/2/runtime/CommandLine/OptionsValidation/common:/home/jenkins/workspace/Test_openjdk21_hs_extended.openjdk_aarch64_linux_testList_5/jvmtest/openjdk/jtreg/lib/javatest.jar:/home/jenkins/workspace/Test_openjdk21_hs_extended.openjdk_aarch64_linux_testList_5/jvmtest/openjdk/jtreg/lib/jtreg.jar:/home/jenkins/workspace/Test_openjdk21_hs_extended.openjdk_aarch64_linux_testList_5/jvmtest/openjdk/jtreg/lib/junit-platform-console-standalone-1.9.2.jar:/home/jenkins/workspace/Test_openjdk21_hs_extended.openjdk_aarch64_linux_testList_5/jvmtest/openjdk/jtreg/lib/testng-7.3.0.jar:/home/jenkins/workspace/Test_openjdk21_hs_extended.openjdk_aarch64_linux_testList_5/jvmtest/openjdk/jtreg/lib/guice-5.1.0.jar:/home/jenkins/workspace/Test_openjdk21_hs_extended.openjdk_aarch64_linux_testList_5/jvmtest/openjdk/jtreg/lib/jcommander-1.82.jar -server -Xmx1024m -XX:+UseG1GC -XX:+UnlockDiagnosticVMOptions -XX:+UnlockExperimentalVMOptions -XX:LoopOptsCount=5 optionsvalidation.JVMStartup ]
[2025-11-20T00:46:26.517Z] [2025-11-20T00:46:10.734612211Z] Gathering output for process 3559308
[2025-11-20T00:46:26.517Z] [2025-11-20T00:46:10.734999412Z] Waiting for completion for process 3559308
[2025-11-20T00:46:26.517Z] [2025-11-20T00:46:10.818271771Z] Waiting for completion finished for process 3559308
[2025-11-20T00:46:26.517Z]
[2025-11-20T00:46:26.517Z] Command line: [/home/jenkins/workspace/Test_openjdk21_hs_extended.openjdk_aarch64_linux_testList_5/jdkbinary/j2sdk-image/bin/java -cp /home/jenkins/workspace/Test_openjdk21_hs_extended.openjdk_aarch64_linux_testList_5/aqa-tests/TKG/output_17635986894292/hotspot_runtime_0/work/classes/2/runtime/CommandLine/OptionsValidation/TestOptionsWithRanges_id4.d:/home/jenkins/workspace/Test_openjdk21_hs_extended.openjdk_aarch64_linux_testList_5/aqa-tests/openjdk/openjdk-jdk/test/hotspot/jtreg/runtime/CommandLine/OptionsValidation:/home/jenkins/workspace/Test_openjdk21_hs_extended.openjdk_aarch64_linux_testList_5/aqa-tests/TKG/output_17635986894292/hotspot_runtime_0/work/classes/2/test/lib:/home/jenkins/workspace/Test_openjdk21_hs_extended.openjdk_aarch64_linux_testList_5/aqa-tests/TKG/output_17635986894292/hotspot_runtime_0/work/classes/2/runtime/CommandLine/OptionsValidation/common:/home/jenkins/workspace/Test_openjdk21_hs_extended.openjdk_aarch64_linux_testList_5/jvmtest/openjdk/jtreg/lib/javatest.jar:/home/jenkins/workspace/Test_openjdk21_hs_extended.openjdk_aarch64_linux_testList_5/jvmtest/openjdk/jtreg/lib/jtreg.jar:/home/jenkins/workspace/Test_openjdk21_hs_extended.openjdk_aarch64_linux_testList_5/jvmtest/openjdk/jtreg/lib/junit-platform-console-standalone-1.9.2.jar:/home/jenkins/workspace/Test_openjdk21_hs_extended.openjdk_aarch64_linux_testList_5/jvmtest/openjdk/jtreg/lib/testng-7.3.0.jar:/home/jenkins/workspace/Test_openjdk21_hs_extended.openjdk_aarch64_linux_testList_5/jvmtest/openjdk/jtreg/lib/guice-5.1.0.jar:/home/jenkins/workspace/Test_openjdk21_hs_extended.openjdk_aarch64_linux_testList_5/jvmtest/openjdk/jtreg/lib/jcommander-1.82.jar -server -Xmx1024m -XX:+UseG1GC -XX:+UnlockDiagnosticVMOptions -XX:+UnlockExperimentalVMOptions -XX:LoopOptsCount=43 optionsvalidation.JVMStartup ]
[2025-11-20T00:46:26.517Z] [2025-11-20T00:46:10.822583752Z] Gathering output for process 3559357
[2025-11-20T00:46:26.517Z] [2025-11-20T00:46:10.823214995Z] Waiting for completion for process 3559357
[2025-11-20T00:46:26.517Z] [2025-11-20T00:46:10.899645361Z] Waiting for completion finished for process 3559357
[2025-11-20T00:46:26.517Z]
[2025-11-20T00:46:26.517Z] Testing invalid LoopOptsCount values.
[2025-11-20T00:46:26.517Z] Command line: [/home/jenkins/workspace/Test_openjdk21_hs_extended.openjdk_aarch64_linux_testList_5/jdkbinary/j2sdk-image/bin/java -cp /home/jenkins/workspace/Test_openjdk21_hs_extended.openjdk_aarch64_linux_testList_5/aqa-tests/TKG/output_17635986894292/hotspot_runtime_0/work/classes/2/runtime/CommandLine/OptionsValidation/TestOptionsWithRanges_id4.d:/home/jenkins/workspace/Test_openjdk21_hs_extended.openjdk_aarch64_linux_testList_5/aqa-tests/openjdk/openjdk-jdk/test/hotspot/jtreg/runtime/CommandLine/OptionsValidation:/home/jenkins/workspace/Test_openjdk21_hs_extended.openjdk_aarch64_linux_testList_5/aqa-tests/TKG/output_17635986894292/hotspot_runtime_0/work/classes/2/test/lib:/home/jenkins/workspace/Test_openjdk21_hs_extended.openjdk_aarch64_linux_testList_5/aqa-tests/TKG/output_17635986894292/hotspot_runtime_0/work/classes/2/runtime/CommandLine/OptionsValidation/common:/home/jenkins/workspace/Test_openjdk21_hs_extended.openjdk_aarch64_linux_testList_5/jvmtest/openjdk/jtreg/lib/javatest.jar:/home/jenkins/workspace/Test_openjdk21_hs_extended.openjdk_aarch64_linux_testList_5/jvmtest/openjdk/jtreg/lib/jtreg.jar:/home/jenkins/workspace/Test_openjdk21_hs_extended.openjdk_aarch64_linux_testList_5/jvmtest/openjdk/jtreg/lib/junit-platform-console-standalone-1.9.2.jar:/home/jenkins/workspace/Test_openjdk21_hs_extended.openjdk_aarch64_linux_testList_5/jvmtest/openjdk/jtreg/lib/testng-7.3.0.jar:/home/jenkins/workspace/Test_openjdk21_hs_extended.openjdk_aarch64_linux_testList_5/jvmtest/openjdk/jtreg/lib/guice-5.1.0.jar:/home/jenkins/workspace/Test_openjdk21_hs_extended.openjdk_aarch64_linux_testList_5/jvmtest/openjdk/jtreg/lib/jcommander-1.82.jar -server -Xmx1024m -XX:+UseG1GC -XX:+UnlockDiagnosticVMOptions -XX:+UnlockExperimentalVMOptions -XX:LoopOptsCount=4 optionsvalidation.JVMStartup ]
[2025-11-20T00:46:26.517Z] [2025-11-20T00:46:10.902574375Z] Gathering output for process 3559388
[2025-11-20T00:46:26.517Z] [2025-11-20T00:46:10.903446939Z] Waiting for completion for process 3559388
[2025-11-20T00:46:26.517Z] [2025-11-20T00:46:10.910782255Z] Waiting for completion finished for process 3559388
[2025-11-20T00:46:26.517Z]
[2025-11-20T00:46:26.517Z] Command line: [/home/jenkins/workspace/Test_openjdk21_hs_extended.openjdk_aarch64_linux_testList_5/jdkbinary/j2sdk-image/bin/java -cp /home/jenkins/workspace/Test_openjdk21_hs_extended.openjdk_aarch64_linux_testList_5/aqa-tests/TKG/output_17635986894292/hotspot_runtime_0/work/classes/2/runtime/CommandLine/OptionsValidation/TestOptionsWithRanges_id4.d:/home/jenkins/workspace/Test_openjdk21_hs_extended.openjdk_aarch64_linux_testList_5/aqa-tests/openjdk/openjdk-jdk/test/hotspot/jtreg/runtime/CommandLine/OptionsValidation:/home/jenkins/workspace/Test_openjdk21_hs_extended.openjdk_aarch64_linux_testList_5/aqa-tests/TKG/output_17635986894292/hotspot_runtime_0/work/classes/2/test/lib:/home/jenkins/workspace/Test_openjdk21_hs_extended.openjdk_aarch64_linux_testList_5/aqa-tests/TKG/output_17635986894292/hotspot_runtime_0/work/classes/2/runtime/CommandLine/OptionsValidation/common:/home/jenkins/workspace/Test_openjdk21_hs_extended.openjdk_aarch64_linux_testList_5/jvmtest/openjdk/jtreg/lib/javatest.jar:/home/jenkins/workspace/Test_openjdk21_hs_extended.openjdk_aarch64_linux_testList_5/jvmtest/openjdk/jtreg/lib/jtreg.jar:/home/jenkins/workspace/Test_openjdk21_hs_extended.openjdk_aarch64_linux_testList_5/jvmtest/openjdk/jtreg/lib/junit-platform-console-standalone-1.9.2.jar:/home/jenkins/workspace/Test_openjdk21_hs_extended.openjdk_aarch64_linux_testList_5/jvmtest/openjdk/jtreg/lib/testng-7.3.0.jar:/home/jenkins/workspace/Test_openjdk21_hs_extended.openjdk_aarch64_linux_testList_5/jvmtest/openjdk/jtreg/lib/guice-5.1.0.jar:/home/jenkins/workspace/Test_openjdk21_hs_extended.openjdk_aarch64_linux_testList_5/jvmtest/openjdk/jtreg/lib/jcommander-1.82.jar -server -Xmx1024m -XX:+UseG1GC -XX:+UnlockDiagnosticVMOptions -XX:+UnlockExperimentalVMOptions -XX:LoopOptsCount=44 optionsvalidation.JVMStartup ]
[2025-11-20T00:46:26.517Z] [2025-11-20T00:46:10.912881105Z] Gathering output for process 3559393
[2025-11-20T00:46:26.517Z] [2025-11-20T00:46:10.914418672Z] Waiting for completion for process 3559393
[2025-11-20T00:46:26.517Z] [2025-11-20T00:46:10.922955313Z] Waiting for completion finished for process 3559393
[2025-11-20T00:46:26.517Z]
[2025-11-20T00:46:26.517Z] Testing valid LoopPercentProfileLimit values.
[2025-11-20T00:46:26.517Z] Command line: [/home/jenkins/workspace/Test_openjdk21_hs_extended.openjdk_aarch64_linux_testList_5/jdkbinary/j2sdk-image/bin/java -cp /home/jenkins/workspace/Test_openjdk21_hs_extended.openjdk_aarch64_linux_testList_5/aqa-tests/TKG/output_17635986894292/hotspot_runtime_0/work/classes/2/runtime/CommandLine/OptionsValidation/TestOptionsWithRanges_id4.d:/home/jenkins/workspace/Test_openjdk21_hs_extended.openjdk_aarch64_linux_testList_5/aqa-tests/openjdk/openjdk-jdk/test/hotspot/jtreg/runtime/CommandLine/OptionsValidation:/home/jenkins/workspace/Test_openjdk21_hs_extended.openjdk_aarch64_linux_testList_5/aqa-tests/TKG/output_17635986894292/hotspot_runtime_0/work/classes/2/test/lib:/home/jenkins/workspace/Test_openjdk21_hs_extended.openjdk_aarch64_linux_testList_5/aqa-tests/TKG/output_17635986894292/hotspot_runtime_0/work/classes/2/runtime/CommandLine/OptionsValidation/common:/home/jenkins/workspace/Test_openjdk21_hs_extended.openjdk_aarch64_linux_testList_5/jvmtest/openjdk/jtreg/lib/javatest.jar:/home/jenkins/workspace/Test_openjdk21_hs_extended.openjdk_aarch64_linux_testList_5/jvmtest/openjdk/jtreg/lib/jtreg.jar:/home/jenkins/workspace/Test_openjdk21_hs_extended.openjdk_aarch64_linux_testList_5/jvmtest/openjdk/jtreg/lib/junit-platform-console-standalone-1.9.2.jar:/home/jenkins/workspace/Test_openjdk21_hs_extended.openjdk_aarch64_linux_testList_5/jvmtest/openjdk/jtreg/lib/testng-7.3.0.jar:/home/jenkins/workspace/Test_openjdk21_hs_extended.openjdk_aarch64_linux_testList_5/jvmtest/openjdk/jtreg/lib/guice-5.1.0.jar:/home/jenkins/workspace/Test_openjdk21_hs_extended.openjdk_aarch64_linux_testList_5/jvmtest/openjdk/jtreg/lib/jcommander-1.82.jar -server -Xmx1024m -XX:+UseG1GC -XX:+UnlockDiagnosticVMOptions -XX:+UnlockExperimentalVMOptions -XX:LoopPercentProfileLimit=10 optionsvalidation.JVMStartup ]
[2025-11-20T00:46:26.517Z] [2025-11-20T00:46:10.926861692Z] Gathering output for process 3559399
[2025-11-20T00:46:26.517Z] [2025-11-20T00:46:10.929497704Z] Waiting for completion for process 3559399
[2025-11-20T00:46:26.517Z] [2025-11-20T00:46:11.011561857Z] Waiting for completion finished for process 3559399
[2025-11-20T00:46:26.517Z]
[2025-11-20T00:46:26.517Z] Command line: [/home/jenkins/workspace/Test_openjdk21_hs_extended.openjdk_aarch64_linux_testList_5/jdkbinary/j2sdk-image/bin/java -cp /home/jenkins/workspace/Test_openjdk21_hs_extended.openjdk_aarch64_linux_testList_5/aqa-tests/TKG/output_17635986894292/hotspot_runtime_0/work/classes/2/runtime/CommandLine/OptionsValidation/TestOptionsWithRanges_id4.d:/home/jenkins/workspace/Test_openjdk21_hs_extended.openjdk_aarch64_linux_testList_5/aqa-tests/openjdk/openjdk-jdk/test/hotspot/jtreg/runtime/CommandLine/OptionsValidation:/home/jenkins/workspace/Test_openjdk21_hs_extended.openjdk_aarch64_linux_testList_5/aqa-tests/TKG/output_17635986894292/hotspot_runtime_0/work/classes/2/test/lib:/home/jenkins/workspace/Test_openjdk21_hs_extended.openjdk_aarch64_linux_testList_5/aqa-tests/TKG/output_17635986894292/hotspot_runtime_0/work/classes/2/runtime/CommandLine/OptionsValidation/common:/home/jenkins/workspace/Test_openjdk21_hs_extended.openjdk_aarch64_linux_testList_5/jvmtest/openjdk/jtreg/lib/javatest.jar:/home/jenkins/workspace/Test_openjdk21_hs_extended.openjdk_aarch64_linux_testList_5/jvmtest/openjdk/jtreg/lib/jtreg.jar:/home/jenkins/workspace/Test_openjdk21_hs_extended.openjdk_aarch64_linux_testList_5/jvmtest/openjdk/jtreg/lib/junit-platform-console-standalone-1.9.2.jar:/home/jenkins/workspace/Test_openjdk21_hs_extended.openjdk_aarch64_linux_testList_5/jvmtest/openjdk/jtreg/lib/testng-7.3.0.jar:/home/jenkins/workspace/Test_openjdk21_hs_extended.openjdk_aarch64_linux_testList_5/jvmtest/openjdk/jtreg/lib/guice-5.1.0.jar:/home/jenkins/workspace/Test_openjdk21_hs_extended.openjdk_aarch64_linux_testList_5/jvmtest/openjdk/jtreg/lib/jcommander-1.82.jar -server -Xmx1024m -XX:+UseG1GC -XX:+UnlockDiagnosticVMOptions -XX:+UnlockExperimentalVMOptions -XX:LoopPercentProfileLimit=100 optionsvalidation.JVMStartup ]
[2025-11-20T00:46:26.517Z] [2025-11-20T00:46:11.014220990Z] Gathering output for process 3559441
[2025-11-20T00:46:26.517Z] [2025-11-20T00:46:11.015664517Z] Waiting for completion for process 3559441
[2025-11-20T00:46:26.517Z] [2025-11-20T00:46:11.088189905Z] Waiting for completion finished for process 3559441
[2025-11-20T00:46:26.517Z]
[2025-11-20T00:46:26.517Z] Testing invalid LoopPercentProfileLimit values.
[2025-11-20T00:46:26.517Z] Command line: [/home/jenkins/workspace/Test_openjdk21_hs_extended.openjdk_aarch64_linux_testList_5/jdkbinary/j2sdk-image/bin/java -cp /home/jenkins/workspace/Test_openjdk21_hs_extended.openjdk_aarch64_linux_testList_5/aqa-tests/TKG/output_17635986894292/hotspot_runtime_0/work/classes/2/runtime/CommandLine/OptionsValidation/TestOptionsWithRanges_id4.d:/home/jenkins/workspace/Test_ope
[2025-11-20T00:46:26.517Z]
[2025-11-20T00:46:26.517Z] ...
[2025-11-20T00:46:26.517Z] Output overflow:
[2025-11-20T00:46:26.517Z] JT Harness has limited the test output to the text
[2025-11-20T00:46:26.517Z] at the beginning and the end, so that you can see how the
[2025-11-20T00:46:26.517Z] test began, and how it completed.
[2025-11-20T00:46:26.517Z]
[2025-11-20T00:46:26.517Z] If you need to see more of the output from the test,
[2025-11-20T00:46:26.517Z] set the system property javatest.maxOutputSize to a higher
[2025-11-20T00:46:26.517Z] value. The current value is 100000
[2025-11-20T00:46:26.517Z] ...
[2025-11-20T00:46:26.517Z]
[2025-11-20T00:46:26.517Z] jtreg/lib/guice-5.1.0.jar:/home/jenkins/workspace/Test_openjdk21_hs_extended.openjdk_aarch64_linux_testList_5/jvmtest/openjdk/jtreg/lib/jcommander-1.82.jar -server -Xmx1024m -XX:+UseG1GC -XX:+UnlockDiagnosticVMOptions -XX:+UnlockExperimentalVMOptions -XX:MaxMetaspaceSize=4294967296 optionsvalidation.JVMStartup ]
[2025-11-20T00:46:26.517Z] [2025-11-20T00:46:18.936691946Z] Gathering output for process 3563368
[2025-11-20T00:46:26.517Z] [2025-11-20T00:46:18.937590871Z] Waiting for completion for process 3563368
[2025-11-20T00:46:26.517Z] [2025-11-20T00:46:19.006055079Z] Waiting for completion finished for process 3563368
[2025-11-20T00:46:26.517Z]
[2025-11-20T00:46:26.517Z] Testing valid MaxNewSize values.
[2025-11-20T00:46:26.518Z] Command line: [/home/jenkins/workspace/Test_openjdk21_hs_extended.openjdk_aarch64_linux_testList_5/jdkbinary/j2sdk-image/bin/java -cp /home/jenkins/workspace/Test_openjdk21_hs_extended.openjdk_aarch64_linux_testList_5/aqa-tests/TKG/output_17635986894292/hotspot_runtime_0/work/classes/2/runtime/CommandLine/OptionsValidation/TestOptionsWithRanges_id4.d:/home/jenkins/workspace/Test_openjdk21_hs_extended.openjdk_aarch64_linux_testList_5/aqa-tests/openjdk/openjdk-jdk/test/hotspot/jtreg/runtime/CommandLine/OptionsValidation:/home/jenkins/workspace/Test_openjdk21_hs_extended.openjdk_aarch64_linux_testList_5/aqa-tests/TKG/output_17635986894292/hotspot_runtime_0/work/classes/2/test/lib:/home/jenkins/workspace/Test_openjdk21_hs_extended.openjdk_aarch64_linux_testList_5/aqa-tests/TKG/output_17635986894292/hotspot_runtime_0/work/classes/2/runtime/CommandLine/OptionsValidation/common:/home/jenkins/workspace/Test_openjdk21_hs_extended.openjdk_aarch64_linux_testList_5/jvmtest/openjdk/jtreg/lib/javatest.jar:/home/jenkins/workspace/Test_openjdk21_hs_extended.openjdk_aarch64_linux_testList_5/jvmtest/openjdk/jtreg/lib/jtreg.jar:/home/jenkins/workspace/Test_openjdk21_hs_extended.openjdk_aarch64_linux_testList_5/jvmtest/openjdk/jtreg/lib/junit-platform-console-standalone-1.9.2.jar:/home/jenkins/workspace/Test_openjdk21_hs_extended.openjdk_aarch64_linux_testList_5/jvmtest/openjdk/jtreg/lib/testng-7.3.0.jar:/home/jenkins/workspace/Test_openjdk21_hs_extended.openjdk_aarch64_linux_testList_5/jvmtest/openjdk/jtreg/lib/guice-5.1.0.jar:/home/jenkins/workspace/Test_openjdk21_hs_extended.openjdk_aarch64_linux_testList_5/jvmtest/openjdk/jtreg/lib/jcommander-1.82.jar -server -Xmx1024m -XX:+UseG1GC -XX:+UnlockDiagnosticVMOptions -XX:+UnlockExperimentalVMOptions -XX:MaxNewSize=0 optionsvalidation.JVMStartup ]
[2025-11-20T00:46:26.518Z] [2025-11-20T00:46:19.008056208Z] Gathering output for process 3563409
[2025-11-20T00:46:26.518Z] [2025-11-20T00:46:19.008515411Z] Waiting for completion for process 3563409
[2025-11-20T00:46:26.518Z] [2025-11-20T00:46:19.081960082Z] Waiting for completion finished for process 3563409
[2025-11-20T00:46:26.518Z]
[2025-11-20T00:46:26.518Z] Command line: [/home/jenkins/workspace/Test_openjdk21_hs_extended.openjdk_aarch64_linux_testList_5/jdkbinary/j2sdk-image/bin/java -cp /home/jenkins/workspace/Test_openjdk21_hs_extended.openjdk_aarch64_linux_testList_5/aqa-tests/TKG/output_17635986894292/hotspot_runtime_0/work/classes/2/runtime/CommandLine/OptionsValidation/TestOptionsWithRanges_id4.d:/home/jenkins/workspace/Test_openjdk21_hs_extended.openjdk_aarch64_linux_testList_5/aqa-tests/openjdk/openjdk-jdk/test/hotspot/jtreg/runtime/CommandLine/OptionsValidation:/home/jenkins/workspace/Test_openjdk21_hs_extended.openjdk_aarch64_linux_testList_5/aqa-tests/TKG/output_17635986894292/hotspot_runtime_0/work/classes/2/test/lib:/home/jenkins/workspace/Test_openjdk21_hs_extended.openjdk_aarch64_linux_testList_5/aqa-tests/TKG/output_17635986894292/hotspot_runtime_0/work/classes/2/runtime/CommandLine/OptionsValidation/common:/home/jenkins/workspace/Test_openjdk21_hs_extended.openjdk_aarch64_linux_testList_5/jvmtest/openjdk/jtreg/lib/javatest.jar:/home/jenkins/workspace/Test_openjdk21_hs_extended.openjdk_aarch64_linux_testList_5/jvmtest/openjdk/jtreg/lib/jtreg.jar:/home/jenkins/workspace/Test_openjdk21_hs_extended.openjdk_aarch64_linux_testList_5/jvmtest/openjdk/jtreg/lib/junit-platform-console-standalone-1.9.2.jar:/home/jenkins/workspace/Test_openjdk21_hs_extended.openjdk_aarch64_linux_testList_5/jvmtest/openjdk/jtreg/lib/testng-7.3.0.jar:/home/jenkins/workspace/Test_openjdk21_hs_extended.openjdk_aarch64_linux_testList_5/jvmtest/openjdk/jtreg/lib/guice-5.1.0.jar:/home/jenkins/workspace/Test_openjdk21_hs_extended.openjdk_aarch64_linux_testList_5/jvmtest/openjdk/jtreg/lib/jcommander-1.82.jar -server -Xmx1024m -XX:+UseG1GC -XX:+UnlockDiagnosticVMOptions -XX:+UnlockExperimentalVMOptions -XX:MaxNewSize=18446744073709551615 optionsvalidation.JVMStartup ]
[2025-11-20T00:46:26.518Z] [2025-11-20T00:46:19.083919732Z] Gathering output for process 3563452
[2025-11-20T00:46:26.518Z] [2025-11-20T00:46:19.084522975Z] Waiting for completion for process 3563452
[2025-11-20T00:46:26.518Z] [2025-11-20T00:46:19.158635810Z] Waiting for completion finished for process 3563452
[2025-11-20T00:46:26.518Z]
[2025-11-20T00:46:26.518Z] Command line: [/home/jenkins/workspace/Test_openjdk21_hs_extended.openjdk_aarch64_linux_testList_5/jdkbinary/j2sdk-image/bin/java -cp /home/jenkins/workspace/Test_openjdk21_hs_extended.openjdk_aarch64_linux_testList_5/aqa-tests/TKG/output_17635986894292/hotspot_runtime_0/work/classes/2/runtime/CommandLine/OptionsValidation/TestOptionsWithRanges_id4.d:/home/jenkins/workspace/Test_openjdk21_hs_extended.openjdk_aarch64_linux_testList_5/aqa-tests/openjdk/openjdk-jdk/test/hotspot/jtreg/runtime/CommandLine/OptionsValidation:/home/jenkins/workspace/Test_openjdk21_hs_extended.openjdk_aarch64_linux_testList_5/aqa-tests/TKG/output_17635986894292/hotspot_runtime_0/work/classes/2/test/lib:/home/jenkins/workspace/Test_openjdk21_hs_extended.openjdk_aarch64_linux_testList_5/aqa-tests/TKG/output_17635986894292/hotspot_runtime_0/work/classes/2/runtime/CommandLine/OptionsValidation/common:/home/jenkins/workspace/Test_openjdk21_hs_extended.openjdk_aarch64_linux_testList_5/jvmtest/openjdk/jtreg/lib/javatest.jar:/home/jenkins/workspace/Test_openjdk21_hs_extended.openjdk_aarch64_linux_testList_5/jvmtest/openjdk/jtreg/lib/jtreg.jar:/home/jenkins/workspace/Test_openjdk21_hs_extended.openjdk_aarch64_linux_testList_5/jvmtest/openjdk/jtreg/lib/junit-platform-console-standalone-1.9.2.jar:/home/jenkins/workspace/Test_openjdk21_hs_extended.openjdk_aarch64_linux_testList_5/jvmtest/openjdk/jtreg/lib/testng-7.3.0.jar:/home/jenkins/workspace/Test_openjdk21_hs_extended.openjdk_aarch64_linux_testList_5/jvmtest/openjdk/jtreg/lib/guice-5.1.0.jar:/home/jenkins/workspace/Test_openjdk21_hs_extended.openjdk_aarch64_linux_testList_5/jvmtest/openjdk/jtreg/lib/jcommander-1.82.jar -server -Xmx1024m -XX:+UseG1GC -XX:+UnlockDiagnosticVMOptions -XX:+UnlockExperimentalVMOptions -XX:MaxNewSize=1 optionsvalidation.JVMStartup ]
[2025-11-20T00:46:26.518Z] [2025-11-20T00:46:19.160334498Z] Gathering output for process 3563504
[2025-11-20T00:46:26.518Z] [2025-11-20T00:46:19.160840780Z] Waiting for completion for process 3563504
[2025-11-20T00:46:26.518Z] [2025-11-20T00:46:19.233032926Z] Waiting for completion finished for process 3563504
[2025-11-20T00:46:26.518Z]
[2025-11-20T00:46:26.524Z] Command line: [/home/jenkins/workspace/Test_openjdk21_hs_extended.openjdk_aarch64_linux_testList_5/jdkbinary/j2sdk-image/bin/java -cp /home/jenkins/workspace/Test_openjdk21_hs_extended.openjdk_aarch64_linux_testList_5/aqa-tests/TKG/output_17635986894292/hotspot_runtime_0/work/classes/2/runtime/CommandLine/OptionsValidation/TestOptionsWithRanges_id4.d:/home/jenkins/workspace/Test_openjdk21_hs_extended.openjdk_aarch64_linux_testList_5/aqa-tests/openjdk/openjdk-jdk/test/hotspot/jtreg/runtime/CommandLine/OptionsValidation:/home/jenkins/workspace/Test_openjdk21_hs_extended.openjdk_aarch64_linux_testList_5/aqa-tests/TKG/output_17635986894292/hotspot_runtime_0/work/classes/2/test/lib:/home/jenkins/workspace/Test_openjdk21_hs_extended.openjdk_aarch64_linux_testList_5/aqa-tests/TKG/output_17635986894292/hotspot_runtime_0/work/classes/2/runtime/CommandLine/OptionsValidation/common:/home/jenkins/workspace/Test_openjdk21_hs_extended.openjdk_aarch64_linux_testList_5/jvmtest/openjdk/jtreg/lib/javatest.jar:/home/jenkins/workspace/Test_openjdk21_hs_extended.openjdk_aarch64_linux_testList_5/jvmtest/openjdk/jtreg/lib/jtreg.jar:/home/jenkins/workspace/Test_openjdk21_hs_extended.openjdk_aarch64_linux_testList_5/jvmtest/openjdk/jtreg/lib/junit-platform-console-standalone-1.9.2.jar:/home/jenkins/workspace/Test_openjdk21_hs_extended.openjdk_aarch64_linux_testList_5/jvmtest/openjdk/jtreg/lib/testng-7.3.0.jar:/home/jenkins/workspace/Test_openjdk21_hs_extended.openjdk_aarch64_linux_testList_5/jvmtest/openjdk/jtreg/lib/guice-5.1.0.jar:/home/jenkins/workspace/Test_openjdk21_hs_extended.openjdk_aarch64_linux_testList_5/jvmtest/openjdk/jtreg/lib/jcommander-1.82.jar -server -Xmx1024m -XX:+UseG1GC -XX:+UnlockDiagnosticVMOptions -XX:+UnlockExperimentalVMOptions -XX:MaxNewSize=2147483648 optionsvalidation.JVMStartup ]
[2025-11-20T00:46:26.524Z] [2025-11-20T00:46:19.234821375Z] Gathering output for process 3563557
[2025-11-20T00:46:26.524Z] [2025-11-20T00:46:19.235424978Z] Waiting for completion for process 3563557
[2025-11-20T00:46:26.524Z] [2025-11-20T00:46:19.301276773Z] Waiting for completion finished for process 3563557
[2025-11-20T00:46:26.524Z]
[2025-11-20T00:46:26.524Z] Command line: [/home/jenkins/workspace/Test_openjdk21_hs_extended.openjdk_aarch64_linux_testList_5/jdkbinary/j2sdk-image/bin/java -cp /home/jenkins/workspace/Test_openjdk21_hs_extended.openjdk_aarch64_linux_testList_5/aqa-tests/TKG/output_17635986894292/hotspot_runtime_0/work/classes/2/runtime/CommandLine/OptionsValidation/TestOptionsWithRanges_id4.d:/home/jenkins/workspace/Test_openjdk21_hs_extended.openjdk_aarch64_linux_testList_5/aqa-tests/openjdk/openjdk-jdk/test/hotspot/jtreg/runtime/CommandLine/OptionsValidation:/home/jenkins/workspace/Test_openjdk21_hs_extended.openjdk_aarch64_linux_testList_5/aqa-tests/TKG/output_17635986894292/hotspot_runtime_0/work/classes/2/test/lib:/home/jenkins/workspace/Test_openjdk21_hs_extended.openjdk_aarch64_linux_testList_5/aqa-tests/TKG/output_17635986894292/hotspot_runtime_0/work/classes/2/runtime/CommandLine/OptionsValidation/common:/home/jenkins/workspace/Test_openjdk21_hs_extended.openjdk_aarch64_linux_testList_5/jvmtest/openjdk/jtreg/lib/javatest.jar:/home/jenkins/workspace/Test_openjdk21_hs_extended.openjdk_aarch64_linux_testList_5/jvmtest/openjdk/jtreg/lib/jtreg.jar:/home/jenkins/workspace/Test_openjdk21_hs_extended.openjdk_aarch64_linux_testList_5/jvmtest/openjdk/jtreg/lib/junit-platform-console-standalone-1.9.2.jar:/home/jenkins/workspace/Test_openjdk21_hs_extended.openjdk_aarch64_linux_testList_5/jvmtest/openjdk/jtreg/lib/testng-7.3.0.jar:/home/jenkins/workspace/Test_openjdk21_hs_extended.openjdk_aarch64_linux_testList_5/jvmtest/openjdk/jtreg/lib/guice-5.1.0.jar:/home/jenkins/workspace/Test_openjdk21_hs_extended.openjdk_aarch64_linux_testList_5/jvmtest/openjdk/jtreg/lib/jcommander-1.82.jar -server -Xmx1024m -XX:+UseG1GC -XX:+UnlockDiagnosticVMOptions -XX:+UnlockExperimentalVMOptions -XX:MaxNewSize=4294967296 optionsvalidation.JVMStartup ]
[2025-11-20T00:46:26.524Z] [2025-11-20T00:46:19.303167262Z] Gathering output for process 3563599
[2025-11-20T00:46:26.524Z] [2025-11-20T00:46:19.303765185Z] Waiting for completion for process 3563599
[2025-11-20T00:46:26.524Z] [2025-11-20T00:46:19.375401968Z] Waiting for completion finished for process 3563599
[2025-11-20T00:46:26.524Z]
[2025-11-20T00:46:26.524Z] Testing valid MaxNodeLimit values.
[2025-11-20T00:46:26.524Z] Command line: [/home/jenkins/workspace/Test_openjdk21_hs_extended.openjdk_aarch64_linux_testList_5/jdkbinary/j2sdk-image/bin/java -cp /home/jenkins/workspace/Test_openjdk21_hs_extended.openjdk_aarch64_linux_testList_5/aqa-tests/TKG/output_17635986894292/hotspot_runtime_0/work/classes/2/runtime/CommandLine/OptionsValidation/TestOptionsWithRanges_id4.d:/home/jenkins/workspace/Test_openjdk21_hs_extended.openjdk_aarch64_linux_testList_5/aqa-tests/openjdk/openjdk-jdk/test/hotspot/jtreg/runtime/CommandLine/OptionsValidation:/home/jenkins/workspace/Test_openjdk21_hs_extended.openjdk_aarch64_linux_testList_5/aqa-tests/TKG/output_17635986894292/hotspot_runtime_0/work/classes/2/test/lib:/home/jenkins/workspace/Test_openjdk21_hs_extended.openjdk_aarch64_linux_testList_5/aqa-tests/TKG/output_17635986894292/hotspot_runtime_0/work/classes/2/runtime/CommandLine/OptionsValidation/common:/home/jenkins/workspace/Test_openjdk21_hs_extended.openjdk_aarch64_linux_testList_5/jvmtest/openjdk/jtreg/lib/javatest.jar:/home/jenkins/workspace/Test_openjdk21_hs_extended.openjdk_aarch64_linux_testList_5/jvmtest/openjdk/jtreg/lib/jtreg.jar:/home/jenkins/workspace/Test_openjdk21_hs_extended.openjdk_aarch64_linux_testList_5/jvmtest/openjdk/jtreg/lib/junit-platform-console-standalone-1.9.2.jar:/home/jenkins/workspace/Test_openjdk21_hs_extended.openjdk_aarch64_linux_testList_5/jvmtest/openjdk/jtreg/lib/testng-7.3.0.jar:/home/jenkins/workspace/Test_openjdk21_hs_extended.openjdk_aarch64_linux_testList_5/jvmtest/openjdk/jtreg/lib/guice-5.1.0.jar:/home/jenkins/workspace/Test_openjdk21_hs_extended.openjdk_aarch64_linux_testList_5/jvmtest/openjdk/jtreg/lib/jcommander-1.82.jar -server -Xmx1024m -XX:+UseG1GC -XX:+UnlockDiagnosticVMOptions -XX:+UnlockExperimentalVMOptions -XX:MaxNodeLimit=1000 optionsvalidation.JVMStartup ]
[2025-11-20T00:46:26.524Z] [2025-11-20T00:46:19.377559659Z] Gathering output for process 3563642
[2025-11-20T00:46:26.524Z] [2025-11-20T00:46:19.378110301Z] Waiting for completion for process 3563642
[2025-11-20T00:46:26.524Z] [2025-11-20T00:46:19.385035654Z] Waiting for completion finished for process 3563642
[2025-11-20T00:46:26.524Z]
[2025-11-20T00:46:26.524Z] Command line: [/home/jenkins/workspace/Test_openjdk21_hs_extended.openjdk_aarch64_linux_testList_5/jdkbinary/j2sdk-image/bin/java -cp /home/jenkins/workspace/Test_openjdk21_hs_extended.openjdk_aarch64_linux_testList_5/aqa-tests/TKG/output_17635986894292/hotspot_runtime_0/work/classes/2/runtime/CommandLine/OptionsValidation/TestOptionsWithRanges_id4.d:/home/jenkins/workspace/Test_openjdk21_hs_extended.openjdk_aarch64_linux_testList_5/aqa-tests/openjdk/openjdk-jdk/test/hotspot/jtreg/runtime/CommandLine/OptionsValidation:/home/jenkins/workspace/Test_openjdk21_hs_extended.openjdk_aarch64_linux_testList_5/aqa-tests/TKG/output_17635986894292/hotspot_runtime_0/work/classes/2/test/lib:/home/jenkins/workspace/Test_openjdk21_hs_extended.openjdk_aarch64_linux_testList_5/aqa-tests/TKG/output_17635986894292/hotspot_runtime_0/work/classes/2/runtime/CommandLine/OptionsValidation/common:/home/jenkins/workspace/Test_openjdk21_hs_extended.openjdk_aarch64_linux_testList_5/jvmtest/openjdk/jtreg/lib/javatest.jar:/home/jenkins/workspace/Test_openjdk21_hs_extended.openjdk_aarch64_linux_testList_5/jvmtest/openjdk/jtreg/lib/jtreg.jar:/home/jenkins/workspace/Test_openjdk21_hs_extended.openjdk_aarch64_linux_testList_5/jvmtest/openjdk/jtreg/lib/junit-platform-console-standalone-1.9.2.jar:/home/jenkins/workspace/Test_openjdk21_hs_extended.openjdk_aarch64_linux_testList_5/jvmtest/openjdk/jtreg/lib/testng-7.3.0.jar:/home/jenkins/workspace/Test_openjdk21_hs_extended.openjdk_aarch64_linux_testList_5/jvmtest/openjdk/jtreg/lib/guice-5.1.0.jar:/home/jenkins/workspace/Test_openjdk21_hs_extended.openjdk_aarch64_linux_testList_5/jvmtest/openjdk/jtreg/lib/jcommander-1.82.jar -server -Xmx1024m -XX:+UseG1GC -XX:+UnlockDiagnosticVMOptions -XX:+UnlockExperimentalVMOptions -XX:MaxNodeLimit=715827882 optionsvalidation.JVMStartup ]
[2025-11-20T00:46:26.524Z] [2025-11-20T00:46:19.387125504Z] Gathering output for process 3563653
[2025-11-20T00:46:26.524Z] [2025-11-20T00:46:19.388256310Z] Waiting for completion for process 3563653
[2025-11-20T00:46:26.524Z] [2025-11-20T00:46:19.395185783Z] Waiting for completion finished for process 3563653
[2025-11-20T00:46:26.524Z]
[2025-11-20T00:46:26.524Z] Testing invalid MaxNodeLimit values.
[2025-11-20T00:46:26.524Z] Command line: [/home/jenkins/workspace/Test_openjdk21_hs_extended.openjdk_aarch64_linux_testList_5/jdkbinary/j2sdk-image/bin/java -cp /home/jenkins/workspace/Test_openjdk21_hs_extended.openjdk_aarch64_linux_testList_5/aqa-tests/TKG/output_17635986894292/hotspot_runtime_0/work/classes/2/runtime/CommandLine/OptionsValidation/TestOptionsWithRanges_id4.d:/home/jenkins/workspace/Test_openjdk21_hs_extended.openjdk_aarch64_linux_testList_5/aqa-tests/openjdk/openjdk-jdk/test/hotspot/jtreg/runtime/CommandLine/OptionsValidation:/home/jenkins/workspace/Test_openjdk21_hs_extended.openjdk_aarch64_linux_testList_5/aqa-tests/TKG/output_17635986894292/hotspot_runtime_0/work/classes/2/test/lib:/home/jenkins/workspace/Test_openjdk21_hs_extended.openjdk_aarch64_linux_testList_5/aqa-tests/TKG/output_17635986894292/hotspot_runtime_0/work/classes/2/runtime/CommandLine/OptionsValidation/common:/home/jenkins/workspace/Test_openjdk21_hs_extended.openjdk_aarch64_linux_testList_5/jvmtest/openjdk/jtreg/lib/javatest.jar:/home/jenkins/workspace/Test_openjdk21_hs_extended.openjdk_aarch64_linux_testList_5/jvmtest/openjdk/jtreg/lib/jtreg.jar:/home/jenkins/workspace/Test_openjdk21_hs_extended.openjdk_aarch64_linux_testList_5/jvmtest/openjdk/jtreg/lib/junit-platform-console-standalone-1.9.2.jar:/home/jenkins/workspace/Test_openjdk21_hs_extended.openjdk_aarch64_linux_testList_5/jvmtest/openjdk/jtreg/lib/testng-7.3.0.jar:/home/jenkins/workspace/Test_openjdk21_hs_extended.openjdk_aarch64_linux_testList_5/jvmtest/openjdk/jtreg/lib/guice-5.1.0.jar:/home/jenkins/workspace/Test_openjdk21_hs_extended.openjdk_aarch64_linux_testList_5/jvmtest/openjdk/jtreg/lib/jcommander-1.82.jar -server -Xmx1024m -XX:+UseG1GC -XX:+UnlockDiagnosticVMOptions -XX:+UnlockExperimentalVMOptions -XX:MaxNodeLimit=999 optionsvalidation.JVMStartup ]
[2025-11-20T00:46:26.524Z] [2025-11-20T00:46:19.398005757Z] Gathering output for process 3563660
[2025-11-20T00:46:26.524Z] [2025-11-20T00:46:19.400163367Z] Waiting for completion for process 3563660
[2025-11-20T00:46:26.524Z] [2025-11-20T00:46:19.412732747Z] Waiting for completion finished for process 3563660
[2025-11-20T00:46:26.524Z]
[2025-11-20T00:46:26.524Z] Command line: [/home/jenkins/workspace/Test_openjdk21_hs_extended.openjdk_aarch64_linux_testList_5/jdkbinary/j2sdk-image/bin/java -cp /home/jenkins/workspace/Test_openjdk21_hs_extended.openjdk_aarch64_linux_testList_5/aqa-tests/TKG/output_17635986894292/hotspot_runtime_0/work/classes/2/runtime/CommandLine/OptionsValidation/TestOptionsWithRanges_id4.d:/home/jenkins/workspace/Test_openjdk21_hs_extended.openjdk_aarch64_linux_testList_5/aqa-tests/openjdk/openjdk-jdk/test/hotspot/jtreg/runtime/CommandLine/OptionsValidation:/home/jenkins/workspace/Test_openjdk21_hs_extended.openjdk_aarch64_linux_testList_5/aqa-tests/TKG/output_17635986894292/hotspot_runtime_0/work/classes/2/test/lib:/home/jenkins/workspace/Test_openjdk21_hs_extended.openjdk_aarch64_linux_testList_5/aqa-tests/TKG/output_17635986894292/hotspot_runtime_0/work/classes/2/runtime/CommandLine/OptionsValidation/common:/home/jenkins/workspace/Test_openjdk21_hs_extended.openjdk_aarch64_linux_testList_5/jvmtest/openjdk/jtreg/lib/javatest.jar:/home/jenkins/workspace/Test_openjdk21_hs_extended.openjdk_aarch64_linux_testList_5/jvmtest/openjdk/jtreg/lib/jtreg.jar:/home/jenkins/workspace/Test_openjdk21_hs_extended.openjdk_aarch64_linux_testList_5/jvmtest/openjdk/jtreg/lib/junit-platform-console-standalone-1.9.2.jar:/home/jenkins/workspace/Test_openjdk21_hs_extended.openjdk_aarch64_linux_testList_5/jvmtest/openjdk/jtreg/lib/testng-7.3.0.jar:/home/jenkins/workspace/Test_openjdk21_hs_extended.openjdk_aarch64_linux_testList_5/jvmtest/openjdk/jtreg/lib/guice-5.1.0.jar:/home/jenkins/workspace/Test_openjdk21_hs_extended.openjdk_aarch64_linux_testList_5/jvmtest/openjdk/jtreg/lib/jcommander-1.82.jar -server -Xmx1024m -XX:+UseG1GC -XX:+UnlockDiagnosticVMOptions -XX:+UnlockExperimentalVMOptions -XX:MaxNodeLimit=715827883 optionsvalidation.JVMStartup ]
[2025-11-20T00:46:26.524Z] [2025-11-20T00:46:19.415187959Z] Gathering output for process 3563664
[2025-11-20T00:46:26.524Z] [2025-11-20T00:46:19.416207724Z] Waiting for completion for process 3563664
[2025-11-20T00:46:26.524Z] [2025-11-20T00:46:19.422850276Z] Waiting for completion finished for process 3563664
[2025-11-20T00:46:26.524Z]
[2025-11-20T00:46:26.524Z] Testing valid MaxRAM values.
[2025-11-20T00:46:26.524Z] Command line: [/home/jenkins/workspace/Test_openjdk21_hs_extended.openjdk_aarch64_linux_testList_5/jdkbinary/j2sdk-image/bin/java -cp /home/jenkins/workspace/Test_openjdk21_hs_extended.openjdk_aarch64_linux_testList_5/aqa-tests/TKG/output_17635986894292/hotspot_runtime_0/work/classes/2/runtime/CommandLine/OptionsValidation/TestOptionsWithRanges_id4.d:/home/jenkins/workspace/Test_openjdk21_hs_extended.openjdk_aarch64_linux_testList_5/aqa-tests/openjdk/openjdk-jdk/test/hotspot/jtreg/runtime/CommandLine/OptionsValidation:/home/jenkins/workspace/Test_openjdk21_hs_extended.openjdk_aarch64_linux_testList_5/aqa-tests/TKG/output_17635986894292/hotspot_runtime_0/work/classes/2/test/lib:/home/jenkins/workspace/Test_openjdk21_hs_extended.openjdk_aarch64_linux_testList_5/aqa-tests/TKG/output_17635986894292/hotspot_runtime_0/work/classes/2/runtime/CommandLine/OptionsValidation/common:/home/jenkins/workspace/Test_openjdk21_hs_extended.openjdk_aarch64_linux_testList_5/jvmtest/openjdk/jtreg/lib/javatest.jar:/home/jenkins/workspace/Test_openjdk21_hs_extended.openjdk_aarch64_linux_testList_5/jvmtest/openjdk/jtreg/lib/jtreg.jar:/home/jenkins/workspace/Test_openjdk21_hs_extended.openjdk_aarch64_linux_testList_5/jvmtest/openjdk/jtreg/lib/junit-platform-console-standalone-1.9.2.jar:/home/jenkins/workspace/Test_openjdk21_hs_extended.openjdk_aarch64_linux_testList_5/jvmtest/openjdk/jtreg/lib/testng-7.3.0.jar:/home/jenkins/workspace/Test_openjdk21_hs_extended.openjdk_aarch64_linux_testList_5/jvmtest/openjdk/jtreg/lib/guice-5.1.0.jar:/home/jenkins/workspace/Test_openjdk21_hs_extended.openjdk_aarch64_linux_testList_5/jvmtest/openjdk/jtreg/lib/jcommander-1.82.jar -server -Xmx1024m -XX:+UseG1GC -XX:+UnlockDiagnosticVMOptions -XX:+UnlockExperimentalVMOptions -XX:MaxRAM=0 optionsvalidation.JVMStartup ]
[2025-11-20T00:46:26.524Z] [2025-11-20T00:46:19.424943086Z] Gathering output for process 3563671
[2025-11-20T00:46:26.524Z] [2025-11-20T00:46:19.426377612Z] Waiting for completion for process 3563671
[2025-11-20T00:46:26.524Z] [2025-11-20T00:46:19.503875664Z] Waiting for completion finished for process 3563671
[2025-11-20T00:46:26.524Z]
[2025-11-20T00:46:26.524Z] Command line: [/home/jenkins/workspace/Test_openjdk21_hs_extended.openjdk_aarch64_linux_testList_5/jdkbinary/j2sdk-image/bin/java -cp /home/jenkins/workspace/Test_openjdk21_hs_extended.openjdk_aarch64_linux_testList_5/aqa-tests/TKG/output_17635986894292/hotspot_runtime_0/work/classes/2/runtime/CommandLine/OptionsValidation/TestOptionsWithRanges_id4.d:/home/jenkins/workspace/Test_openjdk21_hs_extended.openjdk_aarch64_linux_testList_5/aqa-tests/openjdk/openjdk-jdk/test/hotspot/jtreg/runtime/CommandLine/OptionsValidation:/home/jenkins/workspace/Test_openjdk21_hs_extended.openjdk_aarch64_linux_testList_5/aqa-tests/TKG/output_17635986894292/hotspot_runtime_0/work/classes/2/test/lib:/home/jenkins/workspace/Test_openjdk21_hs_extended.openjdk_aarch64_linux_testList_5/aqa-tests/TKG/output_17635986894292/hotspot_runtime_0/work/classes/2/runtime/CommandLine/OptionsValidation/common:/home/jenkins/workspace/Test_openjdk21_hs_extended.openjdk_aarch64_linux_testList_5/jvmtest/openjdk/jtreg/lib/javatest.jar:/home/jenkins/workspace/Test_openjdk21_hs_extended.openjdk_aarch64_linux_testList_5/jvmtest/openjdk/jtreg/lib/jtreg.jar:/home/jenkins/workspace/Test_openjdk21_hs_extended.openjdk_aarch64_linux_testList_5/jvmtest/openjdk/jtreg/lib/junit-platform-console-standalone-1.9.2.jar:/home/jenkins/workspace/Test_openjdk21_hs_extended.openjdk_aarch64_linux_testList_5/jvmtest/openjdk/jtreg/lib/testng-7.3.0.jar:/home/jenkins/workspace/Test_openjdk21_hs_extended.openjdk_aarch64_linux_testList_5/jvmtest/openjdk/jtreg/lib/guice-5.1.0.jar:/home/jenkins/workspace/Test_openjdk21_hs_extended.openjdk_aarch64_linux_testList_5/jvmtest/openjdk/jtreg/lib/jcommander-1.82.jar -server -Xmx1024m -XX:+UseG1GC -XX:+UnlockDiagnosticVMOptions -XX:+UnlockExperimentalVMOptions -XX:MaxRAM=1 optionsvalidation.JVMStartup ]
[2025-11-20T00:46:26.524Z] [2025-11-20T00:46:19.505740593Z] Gathering output for process 3563716
[2025-11-20T00:46:26.524Z] [2025-11-20T00:46:19.508184084Z] Waiting for completion for process 3563716
[2025-11-20T00:46:26.524Z] [2025-11-20T00:46:19.574422922Z] Waiting for completion finished for process 3563716
[2025-11-20T00:46:26.524Z]
[2025-11-20T00:46:26.524Z] Testing valid MaxRAMFraction values.
[2025-11-20T00:46:26.524Z] Command line: [/home/jenkins/workspace/Test_openjdk21_hs_extended.openjdk_aarch64_linux_testList_5/jdkbinary/j2sdk-image/bin/java -cp /home/jenkins/workspace/Test_openjdk21_hs_extended.openjdk_aarch64_linux_testList_5/aqa-tests/TKG/output_17635986894292/hotspot_runtime_0/work/classes/2/runtime/CommandLine/OptionsValidation/TestOptionsWithRanges_id4.d:/home/jenkins/workspace/Test_openjdk21_hs_extended.openjdk_aarch64_linux_testList_5/aqa-tests/openjdk/openjdk-jdk/test/hotspot/jtreg/runtime/CommandLine/OptionsValidation:/home/jenkins/workspace/Test_openjdk21_hs_extended.openjdk_aarch64_linux_testList_5/aqa-tests/TKG/output_17635986894292/hotspot_runtime_0/work/classes/2/test/lib:/home/jenkins/workspace/Test_openjdk21_hs_extended.openjdk_aarch64_linux_testList_5/aqa-tests/TKG/output_17635986894292/hotspot_runtime_0/work/classes/2/runtime/CommandLine/OptionsValidation/common:/home/jenkins/workspace/Test_openjdk21_hs_extended.openjdk_aarch64_linux_testList_5/jvmtest/openjdk/jtreg/lib/javatest.jar:/home/jenkins/workspace/Test_openjdk21_hs_extended.openjdk_aarch64_linux_testList_5/jvmtest/openjdk/jtreg/lib/jtreg.jar:/home/jenkins/workspace/Test_openjdk21_hs_extended.openjdk_aarch64_linux_testList_5/jvmtest/openjdk/jtreg/lib/junit-platform-console-standalone-1.9.2.jar:/home/jenkins/workspace/Test_openjdk21_hs_extended.openjdk_aarch64_linux_testList_5/jvmtest/openjdk/jtreg/lib/testng-7.3.0.jar:/home/jenkins/workspace/Test_openjdk21_hs_extended.openjdk_aarch64_linux_testList_5/jvmtest/openjdk/jtreg/lib/guice-5.1.0.jar:/home/jenkins/workspace/Test_openjdk21_hs_extended.openjdk_aarch64_linux_testList_5/jvmtest/openjdk/jtreg/lib/jcommander-1.82.jar -server -Xmx1024m -XX:+UseG1GC -XX:+UnlockDiagnosticVMOptions -XX:+UnlockExperimentalVMOptions -XX:MaxRAMFraction=1 optionsvalidation.JVMStartup ]
[2025-11-20T00:46:26.524Z] [2025-11-20T00:46:19.576157690Z] Gathering output for process 3563755
[2025-11-20T00:46:26.524Z] [2025-11-20T00:46:19.576671293Z] Waiting for completion for process 3563755
[2025-11-20T00:46:26.524Z] [2025-11-20T00:46:19.644955620Z] Waiting for completion finished for process 3563755
[2025-11-20T00:46:26.524Z]
[2025-11-20T00:46:26.524Z] Command line: [/home/jenkins/workspace/Test_openjdk21_hs_extended.openjdk_aarch64_linux_testList_5/jdkbinary/j2sdk-image/bin/java -cp /home/jenkins/workspace/Test_openjdk21_hs_extended.openjdk_aarch64_linux_testList_5/aqa-tests/TKG/output_17635986894292/hotspot_runtime_0/work/classes/2/runtime/CommandLine/OptionsValidation/TestOptionsWithRanges_id4.d:/home/jenkins/workspace/Test_openjdk21_hs_extended.openjdk_aarch64_linux_testList_5/aqa-tests/openjdk/openjdk-jdk/test/hotspot/jtreg/runtime/CommandLine/OptionsValidation:/home/jenkins/workspace/Test_openjdk21_hs_extended.openjdk_aarch64_linux_testList_5/aqa-tests/TKG/output_17635986894292/hotspot_runtime_0/work/classes/2/test/lib:/home/jenkins/workspace/Test_openjdk21_hs_extended.openjdk_aarch64_linux_testList_5/aqa-tests/TKG/output_17635986894292/hotspot_runtime_0/work/classes/2/runtime/CommandLine/OptionsValidation/common:/home/jenkins/workspace/Test_openjdk21_hs_extended.openjdk_aarch64_linux_testList_5/jvmtest/openjdk/jtreg/lib/javatest.jar:/home/jenkins/workspace/Test_openjdk21_hs_extended.openjdk_aarch64_linux_testList_5/jvmtest/openjdk/jtreg/lib/jtreg.jar:/home/jenkins/workspace/Test_openjdk21_hs_extended.openjdk_aarch64_linux_testList_5/jvmtest/openjdk/jtreg/lib/junit-platform-console-standalone-1.9.2.jar:/home/jenkins/workspace/Test_openjdk21_hs_extended.openjdk_aarch64_linux_testList_5/jvmtest/openjdk/jtreg/lib/testng-7.3.0.jar:/home/jenkins/workspace/Test_openjdk21_hs_extended.openjdk_aarch64_linux_testList_5/jvmtest/openjdk/jtreg/lib/guice-5.1.0.jar:/home/jenkins/workspace/Test_openjdk21_hs_extended.openjdk_aarch64_linux_testList_5/jvmtest/openjdk/jtreg/lib/jcommander-1.82.jar -server -Xmx1024m -XX:+UseG1GC -XX:+UnlockDiagnosticVMOptions -XX:+UnlockExperimentalVMOptions -XX:MaxRAMFraction=18446744073709551615 optionsvalidation.JVMStartup ]
[2025-11-20T00:46:26.524Z] [2025-11-20T00:46:19.647708953Z] Gathering output for process 3563794
[2025-11-20T00:46:26.524Z] [2025-11-20T00:46:19.648216795Z] Waiting for completion for process 3563794
[2025-11-20T00:46:26.524Z] [2025-11-20T00:46:19.725608366Z] Waiting for completion finished for process 3563794
[2025-11-20T00:46:26.524Z]
[2025-11-20T00:46:26.524Z] Command line: [/home/jenkins/workspace/Test_openjdk21_hs_extended.openjdk_aarch64_linux_testList_5/jdkbinary/j2sdk-image/bin/java -cp /home/jenkins/workspace/Test_openjdk21_hs_extended.openjdk_aarch64_linux_testList_5/aqa-tests/TKG/output_17635986894292/hotspot_runtime_0/work/classes/2/runtime/CommandLine/OptionsValidation/TestOptionsWithRanges_id4.d:/home/jenkins/workspace/Test_openjdk21_hs_extended.openjdk_aarch64_linux_testList_5/aqa-tests/openjdk/openjdk-jdk/test/hotspot/jtreg/runtime/CommandLine/OptionsValidation:/home/jenkins/workspace/Test_openjdk21_hs_extended.openjdk_aarch64_linux_testList_5/aqa-tests/TKG/output_17635986894292/hotspot_runtime_0/work/classes/2/test/lib:/home/jenkins/workspace/Test_openjdk21_hs_extended.openjdk_aarch64_linux_testList_5/aqa-tests/TKG/output_17635986894292/hotspot_runtime_0/work/classes/2/runtime/CommandLine/OptionsValidation/common:/home/jenkins/workspace/Test_openjdk21_hs_extended.openjdk_aarch64_linux_testList_5/jvmtest/openjdk/jtreg/lib/javatest.jar:/home/jenkins/workspace/Test_openjdk21_hs_extended.openjdk_aarch64_linux_testList_5/jvmtest/openjdk/jtreg/lib/jtreg.jar:/home/jenkins/workspace/Test_openjdk21_hs_extended.openjdk_aarch64_linux_testList_5/jvmtest/openjdk/jtreg/lib/junit-platform-console-standalone-1.9.2.jar:/home/jenkins/workspace/Test_openjdk21_hs_extended.openjdk_aarch64_linux_testList_5/jvmtest/openjdk/jtreg/lib/testng-7.3.0.jar:/home/jenkins/workspace/Test_openjdk21_hs_extended.openjdk_aarch64_linux_testList_5/jvmtest/openjdk/jtreg/lib/guice-5.1.0.jar:/home/jenkins/workspace/Test_openjdk21_hs_extended.openjdk_aarch64_linux_testList_5/jvmtest/openjdk/jtreg/lib/jcommander-1.82.jar -server -Xmx1024m -XX:+UseG1GC -XX:+UnlockDiagnosticVMOptions -XX:+UnlockExperimentalVMOptions -XX:MaxRAMFraction=2147483648 optionsvalidation.JVMStartup ]
[2025-11-20T00:46:26.524Z] [2025-11-20T00:46:19.728215539Z] Gathering output for process 3563834
[2025-11-20T00:46:26.524Z] [2025-11-20T00:46:19.728684061Z] Waiting for completion for process 3563834
[2025-11-20T00:46:26.525Z] [2025-11-20T00:46:19.801480410Z] Waiting for completion finished for process 3563834
[2025-11-20T00:46:26.525Z]
[2025-11-20T00:46:26.525Z] Command line: [/home/jenkins/workspace/Test_openjdk21_hs_extended.openjdk_aarch64_linux_testList_5/jdkbinary/j2sdk-image/bin/java -cp /home/jenkins/workspace/Test_openjdk21_hs_extended.openjdk_aarch64_linux_testList_5/aqa-tests/TKG/output_17635986894292/hotspot_runtime_0/work/classes/2/runtime/CommandLine/OptionsValidation/TestOptionsWithRanges_id4.d:/home/jenkins/workspace/Test_openjdk21_hs_extended.openjdk_aarch64_linux_testList_5/aqa-tests/openjdk/openjdk-jdk/test/hotspot/jtreg/runtime/CommandLine/OptionsValidation:/home/jenkins/workspace/Test_openjdk21_hs_extended.openjdk_aarch64_linux_testList_5/aqa-tests/TKG/output_17635986894292/hotspot_runtime_0/work/classes/2/test/lib:/home/jenkins/workspace/Test_openjdk21_hs_extended.openjdk_aarch64_linux_testList_5/aqa-tests/TKG/output_17635986894292/hotspot_runtime_0/work/classes/2/runtime/CommandLine/OptionsValidation/common:/home/jenkins/workspace/Test_openjdk21_hs_extended.openjdk_aarch64_linux_testList_5/jvmtest/openjdk/jtreg/lib/javatest.jar:/home/jenkins/workspace/Test_openjdk21_hs_extended.openjdk_aarch64_linux_testList_5/jvmtest/openjdk/jtreg/lib/jtreg.jar:/home/jenkins/workspace/Test_openjdk21_hs_extended.openjdk_aarch64_linux_testList_5/jvmtest/openjdk/jtreg/lib/junit-platform-console-standalone-1.9.2.jar:/home/jenkins/workspace/Test_openjdk21_hs_extended.openjdk_aarch64_linux_testList_5/jvmtest/openjdk/jtreg/lib/testng-7.3.0.jar:/home/jenkins/workspace/Test_openjdk21_hs_extended.openjdk_aarch64_linux_testList_5/jvmtest/openjdk/jtreg/lib/guice-5.1.0.jar:/home/jenkins/workspace/Test_openjdk21_hs_extended.openjdk_aarch64_linux_testList_5/jvmtest/openjdk/jtreg/lib/jcommander-1.82.jar -server -Xmx1024m -XX:+UseG1GC -XX:+UnlockDiagnosticVMOptions -XX:+UnlockExperimentalVMOptions -XX:MaxRAMFraction=4294967296 optionsvalidation.JVMStartup ]
[2025-11-20T00:46:26.525Z] [2025-11-20T00:46:19.803310858Z] Gathering output for process 3563874
[2025-11-20T00:46:26.525Z] [2025-11-20T00:46:19.803889101Z] Waiting for completion for process 3563874
[2025-11-20T00:46:26.525Z] [2025-11-20T00:46:19.905100146Z] Waiting for completion finished for process 3563874
[2025-11-20T00:46:26.525Z]
[2025-11-20T00:46:26.525Z] Testing invalid MaxRAMFraction values.
[2025-11-20T00:46:26.525Z] Command line: [/home/jenkins/workspace/Test_openjdk21_hs_extended.openjdk_aarch64_linux_testList_5/jdkbinary/j2sdk-image/bin/java -cp /home/jenkins/workspace/Test_openjdk21_hs_extended.openjdk_aarch64_linux_testList_5/aqa-tests/TKG/output_17635986894292/hotspot_runtime_0/work/classes/2/runtime/CommandLine/OptionsValidation/TestOptionsWithRanges_id4.d:/home/jenkins/workspace/Test_openjdk21_hs_extended.openjdk_aarch64_linux_testList_5/aqa-tests/openjdk/openjdk-jdk/test/hotspot/jtreg/runtime/CommandLine/OptionsValidation:/home/jenkins/workspace/Test_openjdk21_hs_extended.openjdk_aarch64_linux_testList_5/aqa-tests/TKG/output_17635986894292/hotspot_runtime_0/work/classes/2/test/lib:/home/jenkins/workspace/Test_openjdk21_hs_extended.openjdk_aarch64_linux_testList_5/aqa-tests/TKG/output_17635986894292/hotspot_runtime_0/work/classes/2/runtime/CommandLine/OptionsValidation/common:/home/jenkins/workspace/Test_openjdk21_hs_extended.openjdk_aarch64_linux_testList_5/jvmtest/openjdk/jtreg/lib/javatest.jar:/home/jenkins/workspace/Test_openjdk21_hs_extended.openjdk_aarch64_linux_testList_5/jvmtest/openjdk/jtreg/lib/jtreg.jar:/home/jenkins/workspace/Test_openjdk21_hs_extended.openjdk_aarch64_linux_testList_5/jvmtest/openjdk/jtreg/lib/junit-platform-console-standalone-1.9.2.jar:/home/jenkins/workspace/Test_openjdk21_hs_extended.openjdk_aarch64_linux_testList_5/jvmtest/openjdk/jtreg/lib/testng-7.3.0.jar:/home/jenkins/workspace/Test_openjdk21_hs_extended.openjdk_aarch64_linux_testList_5/jvmtest/openjdk/jtreg/lib/guice-5.1.0.jar:/home/jenkins/workspace/Test_openjdk21_hs_extended.openjdk_aarch64_linux_testList_5/jvmtest/openjdk/jtreg/lib/jcommander-1.82.jar -server -Xmx1024m -XX:+UseG1GC -XX:+UnlockDiagnosticVMOptions -XX:+UnlockExperimentalVMOptions -XX:MaxRAMFraction=0 optionsvalidation.JVMStartup ]
[2025-11-20T00:46:26.525Z] [2025-11-20T00:46:19.906964075Z] Gathering output for process 3563915
[2025-11-20T00:46:26.525Z] [2025-11-20T00:46:19.907594318Z] Waiting for completion for process 3563915
[2025-11-20T00:46:26.525Z] [2025-11-20T00:46:19.914628752Z] Waiting for completion finished for process 3563915
[2025-11-20T00:46:26.525Z]
[2025-11-20T00:46:26.525Z] Testing valid MaxRAMPercentage values.
[2025-11-20T00:46:26.525Z] Command line: [/home/jenkins/workspace/Test_openjdk21_hs_extended.openjdk_aarch64_linux_testList_5/jdkbinary/j2sdk-image/bin/java -cp /home/jenkins/workspace/Test_openjdk21_hs_extended.openjdk_aarch64_linux_testList_5/aqa-tests/TKG/output_17635986894292/hotspot_runtime_0/work/classes/2/runtime/CommandLine/OptionsValidation/TestOptionsWithRanges_id4.d:/home/jenkins/workspace/Test_openjdk21_hs_extended.openjdk_aarch64_linux_testList_5/aqa-tests/openjdk/openjdk-jdk/test/hotspot/jtreg/runtime/CommandLine/OptionsValidation:/home/jenkins/workspace/Test_openjdk21_hs_extended.openjdk_aarch64_linux_testList_5/aqa-tests/TKG/output_17635986894292/hotspot_runtime_0/work/classes/2/test/lib:/home/jenkins/workspace/Test_openjdk21_hs_extended.openjdk_aarch64_linux_testList_5/aqa-tests/TKG/output_17635986894292/hotspot_runtime_0/work/classes/2/runtime/CommandLine/OptionsValidation/common:/home/jenkins/workspace/Test_openjdk21_hs_extended.openjdk_aarch64_linux_testList_5/jvmtest/openjdk/jtreg/lib/javatest.jar:/home/jenkins/workspace/Test_openjdk21_hs_extended.openjdk_aarch64_linux_testList_5/jvmtest/openjdk/jtreg/lib/jtreg.jar:/home/jenkins/workspace/Test_openjdk21_hs_extended.openjdk_aarch64_linux_testList_5/jvmtest/openjdk/jtreg/lib/junit-platform-console-standalone-1.9.2.jar:/home/jenkins/workspace/Test_openjdk21_hs_extended.openjdk_aarch64_linux_testList_5/jvmtest/openjdk/jtreg/lib/testng-7.3.0.jar:/home/jenkins/workspace/Test_openjdk21_hs_extended.openjdk_aarch64_linux_testList_5/jvmtest/openjdk/jtreg/lib/guice-5.1.0.jar:/home/jenkins/workspace/Test_openjdk21_hs_extended.openjdk_aarch64_linux_testList_5/jvmtest/openjdk/jtreg/lib/jcommander-1.82.jar -server -Xmx1024m -XX:+UseG1GC -XX:+UnlockDiagnosticVMOptions -XX:+UnlockExperimentalVMOptions -XX:MaxRAMPercentage=0.000000 optionsvalidation.JVMStartup ]
[2025-11-20T00:46:26.525Z] [2025-11-20T00:46:19.920000977Z] Gathering output for process 3563923
[2025-11-20T00:46:26.525Z] [2025-11-20T00:46:19.921640585Z] Waiting for completion for process 3563923
[2025-11-20T00:46:26.525Z] [2025-11-20T00:46:19.994615295Z] Waiting for completion finished for process 3563923
[2025-11-20T00:46:26.525Z]
[2025-11-20T00:46:26.525Z] Command line: [/home/jenkins/workspace/Test_openjdk21_hs_extended.openjdk_aarch64_linux_testList_5/jdkbinary/j2sdk-image/bin/java -cp /home/jenkins/workspace/Test_openjdk21_hs_extended.openjdk_aarch64_linux_testList_5/aqa-tests/TKG/output_17635986894292/hotspot_runtime_0/work/classes/2/runtime/CommandLine/OptionsValidation/TestOptionsWithRanges_id4.d:/home/jenkins/workspace/Test_openjdk21_hs_extended.openjdk_aarch64_linux_testList_5/aqa-tests/openjdk/openjdk-jdk/test/hotspot/jtreg/runtime/CommandLine/OptionsValidation:/home/jenkins/workspace/Test_openjdk21_hs_extended.openjdk_aarch64_linux_testList_5/aqa-tests/TKG/output_17635986894292/hotspot_runtime_0/work/classes/2/test/lib:/home/jenkins/workspace/Test_openjdk21_hs_extended.openjdk_aarch64_linux_testList_5/aqa-tests/TKG/output_17635986894292/hotspot_runtime_0/work/classes/2/runtime/CommandLine/OptionsValidation/common:/home/jenkins/workspace/Test_openjdk21_hs_extended.openjdk_aarch64_linux_testList_5/jvmtest/openjdk/jtreg/lib/javatest.jar:/home/jenkins/workspace/Test_openjdk21_hs_extended.openjdk_aarch64_linux_testList_5/jvmtest/openjdk/jtreg/lib/jtreg.jar:/home/jenkins/workspace/Test_openjdk21_hs_extended.openjdk_aarch64_linux_testList_5/jvmtest/openjdk/jtreg/lib/junit-platform-console-standalone-1.9.2.jar:/home/jenkins/workspace/Test_openjdk21_hs_extended.openjdk_aarch64_linux_testList_5/jvmtest/openjdk/jtreg/lib/testng-7.3.0.jar:/home/jenkins/workspace/Test_openjdk21_hs_extended.openjdk_aarch64_linux_testList_5/jvmtest/openjdk/jtreg/lib/guice-5.1.0.jar:/home/jenkins/workspace/Test_openjdk21_hs_extended.openjdk_aarch64_linux_testList_5/jvmtest/openjdk/jtreg/lib/jcommander-1.82.jar -server -Xmx1024m -XX:+UseG1GC -XX:+UnlockDiagnosticVMOptions -XX:+UnlockExperimentalVMOptions -XX:MaxRAMPercentage=100.000000 optionsvalidation.JVMStartup ]
[2025-11-20T00:46:26.525Z] [2025-11-20T00:46:20.053120895Z] Gathering output for process 3563981
[2025-11-20T00:46:26.525Z] [2025-11-20T00:46:20.053676018Z] Waiting for completion for process 3563981
[2025-11-20T00:46:26.525Z] [2025-11-20T00:46:20.126736688Z] Waiting for completion finished for process 3563981
[2025-11-20T00:46:26.525Z]
[2025-11-20T00:46:26.525Z] Command line: [/home/jenkins/workspace/Test_openjdk21_hs_extended.openjdk_aarch64_linux_testList_5/jdkbinary/j2sdk-image/bin/java -cp /home/jenkins/workspace/Test_openjdk21_hs_extended.openjdk_aarch64_linux_testList_5/aqa-tests/TKG/output_17635986894292/hotspot_runtime_0/work/classes/2/runtime/CommandLine/OptionsValidation/TestOptionsWithRanges_id4.d:/home/jenkins/workspace/Test_openjdk21_hs_extended.openjdk_aarch64_linux_testList_5/aqa-tests/openjdk/openjdk-jdk/test/hotspot/jtreg/runtime/CommandLine/OptionsValidation:/home/jenkins/workspace/Test_openjdk21_hs_extended.openjdk_aarch64_linux_testList_5/aqa-tests/TKG/output_17635986894292/hotspot_runtime_0/work/classes/2/test/lib:/home/jenkins/workspace/Test_openjdk21_hs_extended.openjdk_aarch64_linux_testList_5/aqa-tests/TKG/output_17635986894292/hotspot_runtime_0/work/classes/2/runtime/CommandLine/OptionsValidation/common:/home/jenkins/workspace/Test_openjdk21_hs_extended.openjdk_aarch64_linux_testList_5/jvmtest/openjdk/jtreg/lib/javatest.jar:/home/jenkins/workspace/Test_openjdk21_hs_extended.openjdk_aarch64_linux_testList_5/jvmtest/openjdk/jtreg/lib/jtreg.jar:/home/jenkins/workspace/Test_openjdk21_hs_extended.openjdk_aarch64_linux_testList_5/jvmtest/openjdk/jtreg/lib/junit-platform-console-standalone-1.9.2.jar:/home/jenkins/workspace/Test_openjdk21_hs_extended.openjdk_aarch64_linux_testList_5/jvmtest/openjdk/jtreg/lib/testng-7.3.0.jar:/home/jenkins/workspace/Test_openjdk21_hs_extended.openjdk_aarch64_linux_testList_5/jvmtest/openjdk/jtreg/lib/guice-5.1.0.jar:/home/jenkins/workspace/Test_openjdk21_hs_extended.openjdk_aarch64_linux_testList_5/jvmtest/openjdk/jtreg/lib/jcommander-1.82.jar -server -Xmx1024m -XX:+UseG1GC -XX:+UnlockDiagnosticVMOptions -XX:+UnlockExperimentalVMOptions -XX:MaxRAMPercentage=1.750000 optionsvalidation.JVMStartup ]
[2025-11-20T00:46:26.525Z] [2025-11-20T00:46:20.128621297Z] Gathering output for process 3564025
[2025-11-20T00:46:26.525Z] [2025-11-20T00:46:20.129110259Z] Waiting for completion for process 3564025
[2025-11-20T00:46:26.525Z] [2025-11-20T00:46:20.195570738Z] Waiting for completion finished for process 3564025
[2025-11-20T00:46:26.525Z]
[2025-11-20T00:46:26.525Z] Testing invalid MaxRAMPercentage values.
[2025-11-20T00:46:26.525Z] Command line: [/home/jenkins/workspace/Test_openjdk21_hs_extended.openjdk_aarch64_linux_testList_5/jdkbinary/j2sdk-image/bin/java -cp /home/jenkins/workspace/Test_openjdk21_hs_extended.openjdk_aarch64_linux_testList_5/aqa-tests/TKG/output_17635986894292/hotspot_runtime_0/work/classes/2/runtime/CommandLine/OptionsValidation/TestOptionsWithRanges_id4.d:/home/jenkins/workspace/Test_openjdk21_hs_extended.openjdk_aarch64_linux_testList_5/aqa-tests/openjdk/openjdk-jdk/test/hotspot/jtreg/runtime/CommandLine/OptionsValidation:/home/jenkins/workspace/Test_openjdk21_hs_extended.openjdk_aarch64_linux_testList_5/aqa-tests/TKG/output_17635986894292/hotspot_runtime_0/work/classes/2/test/lib:/home/jenkins/workspace/Test_openjdk21_hs_extended.openjdk_aarch64_linux_testList_5/aqa-tests/TKG/output_17635986894292/hotspot_runtime_0/work/classes/2/runtime/CommandLine/OptionsValidation/common:/home/jenkins/workspace/Test_openjdk21_hs_extended.openjdk_aarch64_linux_testList_5/jvmtest/openjdk/jtreg/lib/javatest.jar:/home/jenkins/workspace/Test_openjdk21_hs_extended.openjdk_aarch64_linux_testList_5/jvmtest/openjdk/jtreg/lib/jtreg.jar:/home/jenkins/workspace/Test_openjdk21_hs_extended.openjdk_aarch64_linux_testList_5/jvmtest/openjdk/jtreg/lib/junit-platform-console-standalone-1.9.2.jar:/home/jenkins/workspace/Test_openjdk21_hs_extended.openjdk_aarch64_linux_testList_5/jvmtest/openjdk/jtreg/lib/testng-7.3.0.jar:/home/jenkins/workspace/Test_openjdk21_hs_extended.openjdk_aarch64_linux_testList_5/jvmtest/openjdk/jtreg/lib/guice-5.1.0.jar:/home/jenkins/workspace/Test_openjdk21_hs_extended.openjdk_aarch64_linux_testList_5/jvmtest/openjdk/jtreg/lib/jcommander-1.82.jar -server -Xmx1024m -XX:+UseG1GC -XX:+UnlockDiagnosticVMOptions -XX:+UnlockExperimentalVMOptions -XX:MaxRAMPercentage=100.100000 optionsvalidation.JVMStartup ]
[2025-11-20T00:46:26.525Z] [2025-11-20T00:46:20.197660628Z] Gathering output for process 3564067
[2025-11-20T00:46:26.525Z] [2025-11-20T00:46:20.198359351Z] Waiting for completion for process 3564067
[2025-11-20T00:46:26.525Z] [2025-11-20T00:46:20.205013023Z] Waiting for completion finished for process 3564067
[2025-11-20T00:46:26.525Z]
[2025-11-20T00:46:26.525Z] Testing valid MaxRecursiveInlineLevel values.
[2025-11-20T00:46:26.525Z] Command line: [/home/jenkins/workspace/Test_openjdk21_hs_extended.openjdk_aarch64_linux_testList_5/jdkbinary/j2sdk-image/bin/java -cp /home/jenkins/workspace/Test_openjdk21_hs_extended.openjdk_aarch64_linux_testList_5/aqa-tests/TKG/output_17635986894292/hotspot_runtime_0/work/classes/2/runtime/CommandLine/OptionsValidation/TestOptionsWithRanges_id4.d:/home/jenkins/workspace/Test_openjdk21_hs_extended.openjdk_aarch64_linux_testList_5/aqa-tests/openjdk/openjdk-jdk/test/hotspot/jtreg/runtime/CommandLine/OptionsValidation:/home/jenkins/workspace/Test_openjdk21_hs_extended.openjdk_aarch64_linux_testList_5/aqa-tests/TKG/output_17635986894292/hotspot_runtime_0/work/classes/2/test/lib:/home/jenkins/workspace/Test_openjdk21_hs_extended.openjdk_aarch64_linux_testList_5/aqa-tests/TKG/output_17635986894292/hotspot_runtime_0/work/classes/2/runtime/CommandLine/OptionsValidation/common:/home/jenkins/workspace/Test_openjdk21_hs_extended.openjdk_aarch64_linux_testList_5/jvmtest/openjdk/jtreg/lib/javatest.jar:/home/jenkins/workspace/Test_openjdk21_hs_extended.openjdk_aarch64_linux_testList_5/jvmtest/openjdk/jtreg/lib/jtreg.jar:/home/jenkins/workspace/Test_openjdk21_hs_extended.openjdk_aarch64_linux_testList_5/jvmtest/openjdk/jtreg/lib/junit-platform-console-standalone-1.9.2.jar:/home/jenkins/workspace/Test_openjdk21_hs_extended.openjdk_aarch64_linux_testList_5/jvmtest/openjdk/jtreg/lib/testng-7.3.0.jar:/home/jenkins/workspace/Test_openjdk21_hs_extended.openjdk_aarch64_linux_testList_5/jvmtest/openjdk/jtreg/lib/guice-5.1.0.jar:/home/jenkins/workspace/Test_openjdk21_hs_extended.openjdk_aarch64_linux_testList_5/jvmtest/openjdk/jtreg/lib/jcommander-1.82.jar -server -Xmx1024m -XX:+UseG1GC -XX:+UnlockDiagnosticVMOptions -XX:+UnlockExperimentalVMOptions -XX:MaxRecursiveInlineLevel=0 optionsvalidation.JVMStartup ]
[2025-11-20T00:46:26.525Z] [2025-11-20T00:46:20.210498209Z] Gathering output for process 3564078
[2025-11-20T00:46:26.525Z] [2025-11-20T00:46:20.211422174Z] Waiting for completion for process 3564078
[2025-11-20T00:46:26.525Z] [2025-11-20T00:46:20.292074880Z] Waiting for completion finished for process 3564078
[2025-11-20T00:46:26.525Z]
[2025-11-20T00:46:26.525Z] Command line: [/home/jenkins/workspace/Test_openjdk21_hs_extended.openjdk_aarch64_linux_testList_5/jdkbinary/j2sdk-image/bin/java -cp /home/jenkins/workspace/Test_openjdk21_hs_extended.openjdk_aarch64_linux_testList_5/aqa-tests/TKG/output_17635986894292/hotspot_runtime_0/work/classes/2/runtime/CommandLine/OptionsValidation/TestOptionsWithRanges_id4.d:/home/jenkins/workspace/Test_openjdk21_hs_extended.openjdk_aarch64_linux_testList_5/aqa-tests/openjdk/openjdk-jdk/test/hotspot/jtreg/runtime/CommandLine/OptionsValidation:/home/jenkins/workspace/Test_openjdk21_hs_extended.openjdk_aarch64_linux_testList_5/aqa-tests/TKG/output_17635986894292/hotspot_runtime_0/work/classes/2/test/lib:/home/jenkins/workspace/Test_openjdk21_hs_extended.openjdk_aarch64_linux_testList_5/aqa-tests/TKG/output_17635986894292/hotspot_runtime_0/work/classes/2/runtime/CommandLine/OptionsValidation/common:/home/jenkins/workspace/Test_openjdk21_hs_extended.openjdk_aarch64_linux_testList_5/jvmtest/openjdk/jtreg/lib/javatest.jar:/home/jenkins/workspace/Test_openjdk21_hs_extended.openjdk_aarch64_linux_testList_5/jvmtest/openjdk/jtreg/lib/jtreg.jar:/home/jenkins/workspace/Test_openjdk21_hs_extended.openjdk_aarch64_linux_testList_5/jvmtest/openjdk/jtreg/lib/junit-platform-console-standalone-1.9.2.jar:/home/jenkins/workspace/Test_openjdk21_hs_extended.openjdk_aarch64_linux_testList_5/jvmtest/openjdk/jtreg/lib/testng-7.3.0.jar:/home/jenkins/workspace/Test_openjdk21_hs_extended.openjdk_aarch64_linux_testList_5/jvmtest/openjdk/jtreg/lib/guice-5.1.0.jar:/home/jenkins/workspace/Test_openjdk21_hs_extended.openjdk_aarch64_linux_testList_5/jvmtest/openjdk/jtreg/lib/jcommander-1.82.jar -server -Xmx1024m -XX:+UseG1GC -XX:+UnlockDiagnosticVMOptions -XX:+UnlockExperimentalVMOptions -XX:MaxRecursiveInlineLevel=2147483647 optionsvalidation.JVMStartup ]
[2025-11-20T00:46:26.525Z] [2025-11-20T00:46:20.294086810Z] Gathering output for process 3564122
[2025-11-20T00:46:26.525Z] [2025-11-20T00:46:20.294712413Z] Waiting for completion for process 3564122
[2025-11-20T00:46:26.525Z] [2025-11-20T00:46:20.377156088Z] Waiting for completion finished for process 3564122
[2025-11-20T00:46:26.525Z]
[2025-11-20T00:46:26.525Z] Command line: [/home/jenkins/workspace/Test_openjdk21_hs_extended.openjdk_aarch64_linux_testList_5/jdkbinary/j2sdk-image/bin/java -cp /home/jenkins/workspace/Test_openjdk21_hs_extended.openjdk_aarch64_linux_testList_5/aqa-tests/TKG/output_17635986894292/hotspot_runtime_0/work/classes/2/runtime/CommandLine/OptionsValidation/TestOptionsWithRanges_id4.d:/home/jenkins/workspace/Test_openjdk21_hs_extended.openjdk_aarch64_linux_testList_5/aqa-tests/openjdk/openjdk-jdk/test/hotspot/jtreg/runtime/CommandLine/OptionsValidation:/home/jenkins/workspace/Test_openjdk21_hs_extended.openjdk_aarch64_linux_testList_5/aqa-tests/TKG/output_17635986894292/hotspot_runtime_0/work/classes/2/test/lib:/home/jenkins/workspace/Test_openjdk21_hs_extended.openjdk_aarch64_linux_testList_5/aqa-tests/TKG/output_17635986894292/hotspot_runtime_0/work/classes/2/runtime/CommandLine/OptionsValidation/common:/home/jenkins/workspace/Test_openjdk21_hs_extended.openjdk_aarch64_linux_testList_5/jvmtest/openjdk/jtreg/lib/javatest.jar:/home/jenkins/workspace/Test_openjdk21_hs_extended.openjdk_aarch64_linux_testList_5/jvmtest/openjdk/jtreg/lib/jtreg.jar:/home/jenkins/workspace/Test_openjdk21_hs_extended.openjdk_aarch64_linux_testList_5/jvmtest/openjdk/jtreg/lib/junit-platform-console-standalone-1.9.2.jar:/home/jenkins/workspace/Test_openjdk21_hs_extended.openjdk_aarch64_linux_testList_5/jvmtest/openjdk/jtreg/lib/testng-7.3.0.jar:/home/jenkins/workspace/Test_openjdk21_hs_extended.openjdk_aarch64_linux_testList_5/jvmtest/openjdk/jtreg/lib/guice-5.1.0.jar:/home/jenkins/workspace/Test_openjdk21_hs_extended.openjdk_aarch64_linux_testList_5/jvmtest/openjdk/jtreg/lib/jcommander-1.82.jar -server -Xmx1024m -XX:+UseG1GC -XX:+UnlockDiagnosticVMOptions -XX:+UnlockExperimentalVMOptions -XX:MaxRecursiveInlineLevel=1 optionsvalidation.JVMStartup ]
[2025-11-20T00:46:26.525Z] [2025-11-20T00:46:20.380556064Z] Gathering output for process 3564164
[2025-11-20T00:46:26.525Z] [2025-11-20T00:46:20.381211547Z] Waiting for completion for process 3564164
[2025-11-20T00:46:26.525Z] [2025-11-20T00:46:20.460376526Z] Waiting for completion finished for process 3564164
[2025-11-20T00:46:26.525Z]
[2025-11-20T00:46:26.525Z] Testing invalid MaxRecursiveInlineLevel values.
[2025-11-20T00:46:26.525Z] Command line: [/home/jenkins/workspace/Test_openjdk21_hs_extended.openjdk_aarch64_linux_testList_5/jdkbinary/j2sdk-image/bin/java -cp /home/jenkins/workspace/Test_openjdk21_hs_extended.openjdk_aarch64_linux_testList_5/aqa-tests/TKG/output_17635986894292/hotspot_runtime_0/work/classes/2/runtime/CommandLine/OptionsValidation/TestOptionsWithRanges_id4.d:/home/jenkins/workspace/Test_openjdk21_hs_extended.openjdk_aarch64_linux_testList_5/aqa-tests/openjdk/openjdk-jdk/test/hotspot/jtreg/runtime/CommandLine/OptionsValidation:/home/jenkins/workspace/Test_openjdk21_hs_extended.openjdk_aarch64_linux_testList_5/aqa-tests/TKG/output_17635986894292/hotspot_runtime_0/work/classes/2/test/lib:/home/jenkins/workspace/Test_openjdk21_hs_extended.openjdk_aarch64_linux_testList_5/aqa-tests/TKG/output_17635986894292/hotspot_runtime_0/work/classes/2/runtime/CommandLine/OptionsValidation/common:/home/jenkins/workspace/Test_openjdk21_hs_extended.openjdk_aarch64_linux_testList_5/jvmtest/openjdk/jtreg/lib/javatest.jar:/home/jenkins/workspace/Test_openjdk21_hs_extended.openjdk_aarch64_linux_testList_5/jvmtest/openjdk/jtreg/lib/jtreg.jar:/home/jenkins/workspace/Test_openjdk21_hs_extended.openjdk_aarch64_linux_testList_5/jvmtest/openjdk/jtreg/lib/junit-platform-console-standalone-1.9.2.jar:/home/jenkins/workspace/Test_openjdk21_hs_extended.openjdk_aarch64_linux_testList_5/jvmtest/openjdk/jtreg/lib/testng-7.3.0.jar:/home/jenkins/workspace/Test_openjdk21_hs_extended.openjdk_aarch64_linux_testList_5/jvmtest/openjdk/jtreg/lib/guice-5.1.0.jar:/home/jenkins/workspace/Test_openjdk21_hs_extended.openjdk_aarch64_linux_testList_5/jvmtest/openjdk/jtreg/lib/jcommander-1.82.jar -server -Xmx1024m -XX:+UseG1GC -XX:+UnlockDiagnosticVMOptions -XX:+UnlockExperimentalVMOptions -XX:MaxRecursiveInlineLevel=-1 optionsvalidation.JVMStartup ]
[2025-11-20T00:46:26.525Z] [2025-11-20T00:46:20.462884538Z] Gathering output for process 3564207
[2025-11-20T00:46:26.525Z] [2025-11-20T00:46:20.463742462Z] Waiting for completion for process 3564207
[2025-11-20T00:46:26.525Z] [2025-11-20T00:46:20.470549855Z] Waiting for completion finished for process 3564207
[2025-11-20T00:46:26.525Z]
[2025-11-20T00:46:26.525Z] Command line: [/home/jenkins/workspace/Test_openjdk21_hs_extended.openjdk_aarch64_linux_testList_5/jdkbinary/j2sdk-image/bin/java -cp /home/jenkins/workspace/Test_openjdk21_hs_extended.openjdk_aarch64_linux_testList_5/aqa-tests/TKG/output_17635986894292/hotspot_runtime_0/work/classes/2/runtime/CommandLine/OptionsValidation/TestOptionsWithRanges_id4.d:/home/jenkins/workspace/Test_openjdk21_hs_extended.openjdk_aarch64_linux_testList_5/aqa-tests/openjdk/openjdk-jdk/test/hotspot/jtreg/runtime/CommandLine/OptionsValidation:/home/jenkins/workspace/Test_openjdk21_hs_extended.openjdk_aarch64_linux_testList_5/aqa-tests/TKG/output_17635986894292/hotspot_runtime_0/work/classes/2/test/lib:/home/jenkins/workspace/Test_openjdk21_hs_extended.openjdk_aarch64_linux_testList_5/aqa-tests/TKG/output_17635986894292/hotspot_runtime_0/work/classes/2/runtime/CommandLine/OptionsValidation/common:/home/jenkins/workspace/Test_openjdk21_hs_extended.openjdk_aarch64_linux_testList_5/jvmtest/openjdk/jtreg/lib/javatest.jar:/home/jenkins/workspace/Test_openjdk21_hs_extended.openjdk_aarch64_linux_testList_5/jvmtest/openjdk/jtreg/lib/jtreg.jar:/home/jenkins/workspace/Test_openjdk21_hs_extended.openjdk_aarch64_linux_testList_5/jvmtest/openjdk/jtreg/lib/junit-platform-console-standalone-1.9.2.jar:/home/jenkins/workspace/Test_openjdk21_hs_extended.openjdk_aarch64_linux_testList_5/jvmtest/openjdk/jtreg/lib/testng-7.3.0.jar:/home/jenkins/workspace/Test_openjdk21_hs_extended.openjdk_aarch64_linux_testList_5/jvmtest/openjdk/jtreg/lib/guice-5.1.0.jar:/home/jenkins/workspace/Test_openjdk21_hs_extended.openjdk_aarch64_linux_testList_5/jvmtest/openjdk/jtreg/lib/jcommander-1.82.jar -server -Xmx1024m -XX:+UseG1GC -XX:+UnlockDiagnosticVMOptions -XX:+UnlockExperimentalVMOptions -XX:MaxRecursiveInlineLevel=2147483648 optionsvalidation.JVMStartup ]
[2025-11-20T00:46:26.525Z] [2025-11-20T00:46:20.473528709Z] Gathering output for process 3564211
[2025-11-20T00:46:26.525Z] [2025-11-20T00:46:20.474067592Z] Waiting for completion for process 3564211
[2025-11-20T00:46:26.525Z] [2025-11-20T00:46:20.481564268Z] Waiting for completion finished for process 3564211
[2025-11-20T00:46:26.525Z]
[2025-11-20T00:46:26.525Z] STDERR:
[2025-11-20T00:46:26.525Z] TEST FAILED: Error processing option LogEventsBufferEntries with valid value '-server -XX:+UseG1GC -XX:LogEventsBufferEntries=1048576'! JVM exited with unexpected error code = 137 [0x89]
[2025-11-20T00:46:26.525Z] stdout content[]
[2025-11-20T00:46:26.525Z] stderr content[]
[2025-11-20T00:46:26.525Z]
[2025-11-20T00:46:26.525Z] java.lang.RuntimeException: 1 tests failed! (Error processing option LogEventsBufferEntries with valid value '-server -XX:+UseG1GC -XX:LogEventsBufferEntries=1048576'! JVM exited with unexpected error code = 137 [0x89])
[2025-11-20T00:46:26.525Z] expected: 1 but was: 0
[2025-11-20T00:46:26.525Z] at jdk.test.lib.Asserts.fail(Asserts.java:717)
[2025-11-20T00:46:26.525Z] at jdk.test.lib.Asserts.assertEquals(Asserts.java:208)
[2025-11-20T00:46:26.525Z] at jdk.test.lib.Asserts.assertEQ(Asserts.java:184)
[2025-11-20T00:46:26.525Z] at TestOptionsWithRanges.main(TestOptionsWithRanges.java:281)
[2025-11-20T00:46:26.525Z] at java.base/jdk.internal.reflect.DirectMethodHandleAccessor.invoke(DirectMethodHandleAccessor.java:103)
[2025-11-20T00:46:26.525Z] at java.base/java.lang.reflect.Method.invoke(Method.java:580)
[2025-11-20T00:46:26.525Z] at com.sun.javatest.regtest.agent.MainActionHelper$AgentVMRunnable.run(MainActionHelper.java:333)
[2025-11-20T00:46:26.525Z] at java.base/java.lang.Thread.run(Thread.java:1583)
[2025-11-20T00:46:26.525Z]
[2025-11-20T00:46:26.525Z] JavaTest Message: Test threw exception: java.lang.RuntimeException
[2025-11-20T00:46:26.525Z] JavaTest Message: shutting down test
[2025-11-20T00:46:26.525Z]
[2025-11-20T00:46:26.525Z]
[2025-11-20T00:46:26.525Z] TEST RESULT: Failed. Execution failed: `main' threw exception: java.lang.RuntimeException: 1 tests failed! (Error processing option LogEventsBufferEntries with valid value '-server -XX:+UseG1GC -XX:LogEventsBufferEntries=1048576'! JVM exited with unexpected error code = 137 [0x89]) expected: 1 but was: 0
[2025-11-20T00:46:26.525Z] --------------------------------------------------
[2025-11-20T01:13:16.147Z] Test results: passed: 1,002; failed: 1
[2025-11-20T01:13:40.852Z] Report written to /home/jenkins/workspace/Test_openjdk21_hs_extended.openjdk_aarch64_linux_testList_5/aqa-tests/TKG/output_17635986894292/hotspot_runtime_0/report/html/report.html
[2025-11-20T01:13:40.852Z] Results written to /home/jenkins/workspace/Test_openjdk21_hs_extended.openjdk_aarch64_linux_testList_5/aqa-tests/TKG/output_17635986894292/hotspot_runtime_0/work
[2025-11-20T01:13:40.852Z] Error: Some tests failed or other problems occurred.
[2025-11-20T01:13:40.852Z] -----------------------------------
[2025-11-20T01:13:40.852Z] hotspot_runtime_0_FAILED
[2025-11-20T01:13:40.852Z] -----------------------------------
[2025-11-20T01:13:40.852Z]
[2025-11-20T01:13:40.852Z] TEST TEARDOWN:
[2025-11-20T01:13:40.852Z] Nothing to be done for teardown.
[2025-11-20T01:13:40.852Z] hotspot_runtime_0 Finish Time: Thu Nov 20 01:13:38 2025 Epoch Time (ms): 1763601218914