Post Test
[2025-11-08T13:29:26.419Z] make[4]: Leaving directory '/home/jenkins/workspace/Test_openjdk25_hs_extended.openjdk_aarch64_linux_testList_2/aqa-tests/openjdk'
[2025-11-08T13:29:26.419Z] make[3]: Leaving directory '/home/jenkins/workspace/Test_openjdk25_hs_extended.openjdk_aarch64_linux_testList_2/aqa-tests'
[2025-11-08T13:29:26.419Z]
[2025-11-08T13:29:26.419Z]
[2025-11-08T13:29:26.419Z] All tests finished, run result summary:
[2025-11-08T13:29:26.419Z] cd "/home/jenkins/workspace/Test_openjdk25_hs_extended.openjdk_aarch64_linux_testList_2/aqa-tests/TKG/../TKG/scripts"; \
[2025-11-08T13:29:26.420Z] perl "resultsSum.pl" --failuremk="/home/jenkins/workspace/Test_openjdk25_hs_extended.openjdk_aarch64_linux_testList_2/aqa-tests/TKG/../TKG/failedtargets.mk" --resultFile="/home/jenkins/workspace/Test_openjdk25_hs_extended.openjdk_aarch64_linux_testList_2/aqa-tests/TKG/../TKG/output_17626085636395/TestTargetResult" --platFile="/home/jenkins/workspace/Test_openjdk25_hs_extended.openjdk_aarch64_linux_testList_2/aqa-tests/TKG/../TKG/resources/buildPlatformMap.properties" --diagnostic=failure --jdkVersion=25 --jdkImpl=hotspot --jdkVendor="Undefined Vendor" --spec=linux_aarch64 --buildList=openjdk --customTarget="" --testTarget=testList --tapPath=/home/jenkins/workspace/Test_openjdk25_hs_extended.openjdk_aarch64_linux_testList_2/aqa-tests/TKG/../TKG/output_17626085636395/ --tapName=Test_openjdk25_hs_extended.openjdk_aarch64_linux_testList_2.tap --comment=""
[2025-11-08T13:29:26.420Z]
[2025-11-08T13:29:26.420Z]
[2025-11-08T13:29:26.420Z] TEST TARGETS SUMMARY
[2025-11-08T13:29:26.420Z] ++++++++++++++++++++++++++++++++++++++++++++++++++++++++++++++++++++++++++
[2025-11-08T13:29:26.420Z] FAILED test targets:
[2025-11-08T13:29:26.420Z] hotspot_runtime_0
[2025-11-08T13:29:26.420Z] jdk_nio_1
[2025-11-08T13:29:26.420Z] jdk_management_0
[2025-11-08T13:29:26.420Z] jdk_jmx_1
[2025-11-08T13:29:26.420Z] jdk_rmi_1
[2025-11-08T13:29:26.420Z] jdk_build_0
[2025-11-08T13:29:26.420Z] jdk_native_sanity_0
[2025-11-08T13:29:26.420Z]
[2025-11-08T13:29:26.420Z] TOTAL: 7 EXECUTED: 7 PASSED: 0 FAILED: 7 DISABLED: 0 SKIPPED: 0
[2025-11-08T13:29:26.420Z] ++++++++++++++++++++++++++++++++++++++++++++++++++++++++++++++++++++++++++
[2025-11-08T13:29:26.420Z]
[2025-11-08T13:29:26.420Z] make[2]: *** [settings.mk:454: resultsSummary] Error 2
[2025-11-08T13:29:26.420Z] make[2]: Leaving directory '/home/jenkins/workspace/Test_openjdk25_hs_extended.openjdk_aarch64_linux_testList_2/aqa-tests/TKG'
[2025-11-08T13:29:26.420Z] make[1]: *** [makefile:62: _testList] Error 2
[2025-11-08T13:29:26.420Z] make[1]: Leaving directory '/home/jenkins/workspace/Test_openjdk25_hs_extended.openjdk_aarch64_linux_testList_2/aqa-tests/TKG'
[2025-11-08T13:29:26.420Z] make: *** [parallelList.mk:47: testList_2] Error 2
[Pipeline] sh
[2025-11-08T13:29:28.984Z] + uname
[2025-11-08T13:29:28.984Z] + [ Linux = AIX ]
[2025-11-08T13:29:28.984Z] + uname
[2025-11-08T13:29:28.984Z] + [ Linux = SunOS ]
[2025-11-08T13:29:28.984Z] + uname
[2025-11-08T13:29:28.984Z] + [ Linux = *BSD ]
[2025-11-08T13:29:28.984Z] + MAKE=make
[2025-11-08T13:29:28.984Z] + make -f ./aqa-tests/TKG/testEnv.mk testEnvTeardown
[2025-11-08T13:29:28.984Z] make: Nothing to be done for 'testEnvTeardown'.
[Pipeline] }
[2025-11-08T13:29:29.604Z] $ ssh-agent -k
[2025-11-08T13:29:29.610Z] unset SSH_AUTH_SOCK;
[2025-11-08T13:29:29.610Z] unset SSH_AGENT_PID;
[2025-11-08T13:29:29.610Z] echo Agent pid 1106772 killed;
[2025-11-08T13:29:30.454Z] [ssh-agent] Stopped.
[Pipeline] // sshagent
[Pipeline] }
[2025-11-08T13:29:30.481Z] Xvfb stopping
[Pipeline] // wrap
[Pipeline] echo
[2025-11-08T13:29:31.105Z] There were test failures, current build status is UNSTABLE.
[Pipeline] }
[Pipeline] // stage
[Pipeline] stage
[Pipeline] { (Post)
[Pipeline] echo
[2025-11-08T13:29:31.192Z] Saving aqa-tests/testenv/testenv.properties file on jenkins.
[Pipeline] archiveArtifacts
[2025-11-08T13:29:31.469Z] Archiving artifacts
[2025-11-08T13:29:31.850Z] Recording fingerprints
[Pipeline] echo
[2025-11-08T13:29:32.048Z] Saving aqa-tests/TKG/**/*.tap file on jenkins.
[Pipeline] archiveArtifacts
[2025-11-08T13:29:32.236Z] Archiving artifacts
[2025-11-08T13:29:32.601Z] Recording fingerprints
[Pipeline] sh
[2025-11-08T13:29:34.677Z] + tar -cf - ./aqa-tests/TKG/output_17626085636395
[2025-11-08T13:29:34.677Z] + pigz -9
[2025-11-08T13:29:34.677Z] + gzip -9
[Pipeline] echo
[2025-11-08T13:29:35.222Z] ARTIFACTORY_SERVER is not set. Saving artifacts on jenkins.
[Pipeline] archiveArtifacts
[2025-11-08T13:29:35.425Z] Archiving artifacts
[2025-11-08T13:29:35.783Z] Recording fingerprints
[Pipeline] findFiles
[Pipeline] echo
[2025-11-08T13:29:39.379Z] Tap file found: aqa-tests/TKG/output_17626085636395/Test_openjdk25_hs_extended.openjdk_aarch64_linux_testList_2.tap...
[Pipeline] readFile
[Pipeline] echo
[2025-11-08T13:29:39.654Z] Rerun in Grinder with failed test targets: https://ci.adoptium.net/job/Grinder/parambuild/?SDK_RESOURCE=upstream&TARGET=testList+TESTLIST=hotspot_runtime_0,jdk_nio_1,jdk_management_0,jdk_jmx_1,jdk_rmi_1,jdk_build_0,jdk_native_sanity_0&BASE_DOCKER_REGISTRY_CREDENTIAL_ID=&TEST_FLAG=&UPSTREAM_TEST_JOB_NAME=Test_openjdk25_hs_extended.openjdk_aarch64_linux&DOCKER_REQUIRED=false&ACTIVE_NODE_TIMEOUT=5&VENDOR_TEST_DIRS=&EXTRA_DOCKER_ARGS=&TKG_OWNER_BRANCH=adoptium%3Amaster&OPENJ9_SYSTEMTEST_OWNER_BRANCH=eclipse%3Amaster&PLATFORM=aarch64_linux&GENERATE_JOBS=true&KEEP_REPORTDIR=true&PERSONAL_BUILD=false&DOCKER_REGISTRY_DIR=&RERUN_ITERATIONS=0&ADOPTOPENJDK_REPO=https%3A%2F%2Fgithub.com%2Fadoptium%2Faqa-tests.git&SETUP_JCK_RUN=false&DOCKER_REGISTRY_URL_CREDENTIAL_ID=&LABEL=&EXTRA_OPTIONS=&CUSTOMIZED_SDK_URL=&BUILD_IDENTIFIER=&JENKINS_KEY=&ADOPTOPENJDK_BRANCH=master&LIGHT_WEIGHT_CHECKOUT=false&USE_JRE=false&ARTIFACTORY_SERVER=&KEEP_WORKSPACE=false&USER_CREDENTIALS_ID=&JDK_VERSION=25&DOCKER_REGISTRY_URL=&ITERATIONS=1&VENDOR_TEST_REPOS=&JDK_REPO=https%3A%2F%2Fgithub.com%2Fopenjdk%2Fjdk25u&JCK_GIT_BRANCH=master&OPENJ9_BRANCH=master&OPENJ9_SHA=&JCK_GIT_REPO=&VENDOR_TEST_BRANCHES=&UPSTREAM_JOB_NAME=build-scripts%2Fjobs%2Fjdk25u%2Fjdk25u-linux-aarch64-hotspot&OPENJ9_REPO=https%3A%2F%2Fgithub.com%2Feclipse-openj9%2Fopenj9.git&CLOUD_PROVIDER=&CUSTOM_TARGET=&VENDOR_TEST_SHAS=&JDK_BRANCH=master&LABEL_ADDITION=&ARTIFACTORY_REPO=&ARTIFACTORY_ROOT_DIR=&UPSTREAM_TEST_JOB_NUMBER=35&DOCKERIMAGE_TAG=&TEST_TIME=&JDK_IMPL=hotspot&SSH_AGENT_CREDENTIAL=&AUTO_DETECT=true&SLACK_CHANNEL=aqavit-bot&DYNAMIC_COMPILE=false&RELATED_NODES=&ADOPTOPENJDK_SYSTEMTEST_OWNER_BRANCH=adoptium%3Amaster&APPLICATION_OPTIONS=&CUSTOMIZED_SDK_URL_CREDENTIAL_ID=eclipse_temurin_bot_email_and_token&ARCHIVE_TEST_RESULTS=false&NUM_MACHINES=&OPENJDK_SHA=&TRSS_URL=&RERUN_FAILURE=false&USE_TESTENV_PROPERTIES=false&BUILD_LIST=openjdk&ADDITIONAL_ARTIFACTS_REQUIRED=&UPSTREAM_JOB_NUMBER=7&STF_OWNER_BRANCH=adoptium%3Amaster&TIME_LIMIT=25&JVM_OPTIONS=&PARALLEL=None
[Pipeline] junit
[2025-11-08T13:29:39.845Z] Recording test results
[2025-11-08T13:29:42.561Z] None of the test reports contained any result
[2025-11-08T13:29:42.561Z] [Checks API] No suitable checks publisher found.
[Pipeline] }
[Pipeline] // stage
[Pipeline] echo
[2025-11-08T13:29:42.595Z] PROCESSCATCH: Terminating any hung/left over test processes:
[Pipeline] sh
[2025-11-08T13:29:42.435Z] No test report files were found. Configuration error?
[2025-11-08T13:29:44.493Z] + aqa-tests/terminateTestProcesses.sh jenkins
[2025-11-08T13:29:44.493Z] Unix type machine..
[2025-11-08T13:29:44.493Z] Running on a Linux host
[2025-11-08T13:29:44.493Z] Woohoo - no rogue processes detected!
[Pipeline] retry
[Pipeline] {
[Pipeline] cleanWs
[2025-11-08T13:29:45.409Z] [WS-CLEANUP] Deleting project workspace...
[2025-11-08T13:29:45.409Z] [WS-CLEANUP] Deferred wipeout is disabled by the job configuration...
[2025-11-08T13:29:54.546Z] [WS-CLEANUP] done
[Pipeline] }
[Pipeline] // retry
[Pipeline] sh
[2025-11-08T13:29:56.580Z] + find /tmp -name *core* -print -exec rm -f {} ;
[Pipeline] }
[Pipeline] // timeout
[Pipeline] timeout
[2025-11-08T13:29:57.225Z] Timeout set to expire in 5 min 0 sec
[Pipeline] {
[Pipeline] }
[Pipeline] // timeout
[Pipeline] }
[Pipeline] // node
[Pipeline] }
[Pipeline] // stage
[Pipeline] }
[Pipeline] // timestamps
[Pipeline] End of Pipeline
Finished: UNSTABLE