Post Test
[2025-11-06T08:36:50.960Z] make[4]: Leaving directory '/home/jenkins/workspace/Test_openjdk21_hs_extended.openjdk_aarch64_linux_testList_4_rerun/aqa-tests/openjdk'
[2025-11-06T08:36:50.960Z] make[3]: Leaving directory '/home/jenkins/workspace/Test_openjdk21_hs_extended.openjdk_aarch64_linux_testList_4_rerun/aqa-tests'
[2025-11-06T08:36:50.960Z]
[2025-11-06T08:36:50.960Z]
[2025-11-06T08:36:50.960Z] All tests finished, run result summary:
[2025-11-06T08:36:50.960Z] cd "/home/jenkins/workspace/Test_openjdk21_hs_extended.openjdk_aarch64_linux_testList_4_rerun/aqa-tests/TKG/../TKG/scripts"; \
[2025-11-06T08:36:50.960Z] perl "resultsSum.pl" --failuremk="/home/jenkins/workspace/Test_openjdk21_hs_extended.openjdk_aarch64_linux_testList_4_rerun/aqa-tests/TKG/../TKG/failedtargets.mk" --resultFile="/home/jenkins/workspace/Test_openjdk21_hs_extended.openjdk_aarch64_linux_testList_4_rerun/aqa-tests/TKG/../TKG/output_17624096561442/TestTargetResult" --platFile="/home/jenkins/workspace/Test_openjdk21_hs_extended.openjdk_aarch64_linux_testList_4_rerun/aqa-tests/TKG/../TKG/resources/buildPlatformMap.properties" --diagnostic=failure --jdkVersion=21 --jdkImpl=hotspot --jdkVendor="eclipse" --spec=linux_aarch64 --buildList=openjdk --customTarget="" --testTarget=testList --tapPath=/home/jenkins/workspace/Test_openjdk21_hs_extended.openjdk_aarch64_linux_testList_4_rerun/aqa-tests/TKG/../TKG/output_17624096561442/ --tapName=Test_openjdk21_hs_extended.openjdk_aarch64_linux_testList_4_rerun.tap --comment=""
[2025-11-06T08:36:52.889Z]
[2025-11-06T08:36:52.889Z]
[2025-11-06T08:36:52.889Z] TEST TARGETS SUMMARY
[2025-11-06T08:36:52.889Z] ++++++++++++++++++++++++++++++++++++++++++++++++++++++++++++++++++++++++++
[2025-11-06T08:36:52.889Z] PASSED test targets:
[2025-11-06T08:36:52.890Z] hotspot_vmTestbase_vm_compiler_0 - Test results: passed: 284
[2025-11-06T08:36:52.890Z] jdk_rmi_0 - Test results: passed: 97
[2025-11-06T08:36:52.890Z] jdk_tools_1 - Test results: passed: 288
[2025-11-06T08:36:52.890Z] jdk_jfr_0 - Test results: passed: 585
[2025-11-06T08:36:52.890Z] jdk_jdi_0 - Test results: passed: 179
[2025-11-06T08:36:52.890Z] jdk_build_0 - Test results: passed: 1
[2025-11-06T08:36:52.890Z]
[2025-11-06T08:36:52.890Z] FAILED test targets:
[2025-11-06T08:36:52.890Z] jdk_nio_0 - Test results: passed: 473; failed: 1
[2025-11-06T08:36:52.890Z] Failed test cases:
[2025-11-06T08:36:52.890Z] TEST: java/nio/channels/FileChannel/LargeGatheringWrite.java
[2025-11-06T08:36:52.890Z]
[2025-11-06T08:36:52.890Z]
[2025-11-06T08:36:52.890Z] TOTAL: 7 EXECUTED: 7 PASSED: 6 FAILED: 1 DISABLED: 0 SKIPPED: 0
[2025-11-06T08:36:52.890Z] ++++++++++++++++++++++++++++++++++++++++++++++++++++++++++++++++++++++++++
[2025-11-06T08:36:52.890Z]
[2025-11-06T08:36:52.890Z] TESTCASES RESULTS SUMMARY: passed: 1,907; failed: 1; error: 0; skipped: 0
[2025-11-06T08:36:52.890Z] ++++++++++++++++++++++++++++++++++++++++++++++++++++++++++++++++++++++++++
[2025-11-06T08:36:52.890Z] make[2]: *** [settings.mk:454: resultsSummary] Error 2
[2025-11-06T08:36:52.890Z] make[2]: Leaving directory '/home/jenkins/workspace/Test_openjdk21_hs_extended.openjdk_aarch64_linux_testList_4_rerun/aqa-tests/TKG'
[2025-11-06T08:36:52.890Z] make[1]: *** [makefile:62: _testList] Error 2
[2025-11-06T08:36:52.890Z] make[1]: Leaving directory '/home/jenkins/workspace/Test_openjdk21_hs_extended.openjdk_aarch64_linux_testList_4_rerun/aqa-tests/TKG'
[2025-11-06T08:36:52.890Z] make: *** [parallelList.mk:53: testList_4] Error 2
[Pipeline] sh
[2025-11-06T08:36:55.898Z] + uname
[2025-11-06T08:36:55.898Z] + [ Linux = AIX ]
[2025-11-06T08:36:55.898Z] + uname
[2025-11-06T08:36:55.898Z] + [ Linux = SunOS ]
[2025-11-06T08:36:55.898Z] + uname
[2025-11-06T08:36:55.898Z] + [ Linux = *BSD ]
[2025-11-06T08:36:55.898Z] + MAKE=make
[2025-11-06T08:36:55.898Z] + make -f ./aqa-tests/TKG/testEnv.mk testEnvTeardown
[2025-11-06T08:36:55.898Z] make: Nothing to be done for 'testEnvTeardown'.
[Pipeline] }
[2025-11-06T08:36:56.727Z] $ ssh-agent -k
[2025-11-06T08:36:56.846Z] unset SSH_AUTH_SOCK;
[2025-11-06T08:36:56.846Z] unset SSH_AGENT_PID;
[2025-11-06T08:36:56.846Z] echo Agent pid 2263297 killed;
[2025-11-06T08:36:57.556Z] [ssh-agent] Stopped.
[Pipeline] // sshagent
[Pipeline] }
[2025-11-06T08:36:57.596Z] Xvfb stopping
[Pipeline] // wrap
[Pipeline] echo
[2025-11-06T08:36:58.511Z] There were test failures, current build status is UNSTABLE.
[Pipeline] }
[Pipeline] // stage
[Pipeline] stage
[Pipeline] { (Post)
[Pipeline] echo
[2025-11-06T08:36:58.616Z] Saving aqa-tests/testenv/testenv.properties file on jenkins.
[Pipeline] archiveArtifacts
[2025-11-06T08:36:58.799Z] Archiving artifacts
[2025-11-06T08:36:59.357Z] Recording fingerprints
[Pipeline] echo
[2025-11-06T08:36:59.554Z] Saving aqa-tests/TKG/**/*.tap file on jenkins.
[Pipeline] archiveArtifacts
[2025-11-06T08:36:59.737Z] Archiving artifacts
[2025-11-06T08:37:01.477Z] Recording fingerprints
[Pipeline] sh
[2025-11-06T08:37:04.920Z] + tar -cf - ./aqa-tests/TKG/output_17624096561442
[2025-11-06T08:37:04.920Z] + pigz -9
[2025-11-06T08:37:04.920Z] + gzip -9
[Pipeline] echo
[2025-11-06T08:41:20.401Z] ARTIFACTORY_SERVER is not set. Saving artifacts on jenkins.
[Pipeline] archiveArtifacts
[2025-11-06T08:41:20.587Z] Archiving artifacts
[2025-11-06T08:41:27.545Z] Recording fingerprints
[Pipeline] findFiles
[Pipeline] echo
[2025-11-06T08:41:32.470Z] Tap file found: aqa-tests/TKG/output_17624096561442/Test_openjdk21_hs_extended.openjdk_aarch64_linux_testList_4_rerun.tap...
[Pipeline] readFile
[Pipeline] echo
[2025-11-06T08:41:32.803Z] Rerun in Grinder with failed test targets: https://ci.adoptium.net/job/Grinder/parambuild/?SDK_RESOURCE=upstream&TARGET=testList+TESTLIST=jdk_nio_0&BASE_DOCKER_REGISTRY_CREDENTIAL_ID=&TEST_FLAG=&UPSTREAM_TEST_JOB_NAME=Test_openjdk21_hs_extended.openjdk_aarch64_linux&DOCKER_REQUIRED=false&ACTIVE_NODE_TIMEOUT=5&VENDOR_TEST_DIRS=&EXTRA_DOCKER_ARGS=&TKG_OWNER_BRANCH=adoptium%3Amaster&OPENJ9_SYSTEMTEST_OWNER_BRANCH=eclipse%3Amaster&PLATFORM=aarch64_linux&GENERATE_JOBS=true&KEEP_REPORTDIR=true&PERSONAL_BUILD=false&DOCKER_REGISTRY_DIR=&RERUN_ITERATIONS=0&ADOPTOPENJDK_REPO=https%3A%2F%2Fgithub.com%2Fadoptium%2Faqa-tests.git&SETUP_JCK_RUN=false&DOCKER_REGISTRY_URL_CREDENTIAL_ID=&LABEL=&EXTRA_OPTIONS=&CUSTOMIZED_SDK_URL=&BUILD_IDENTIFIER=&JENKINS_KEY=&ADOPTOPENJDK_BRANCH=master&LIGHT_WEIGHT_CHECKOUT=false&USE_JRE=false&ARTIFACTORY_SERVER=&KEEP_WORKSPACE=false&USER_CREDENTIALS_ID=&JDK_VERSION=21&DOCKER_REGISTRY_URL=&ITERATIONS=1&VENDOR_TEST_REPOS=&JDK_REPO=https%3A%2F%2Fgithub.com%2Fadoptium%2Fjdk21u&JCK_GIT_BRANCH=master&OPENJ9_BRANCH=master&OPENJ9_SHA=&JCK_GIT_REPO=&VENDOR_TEST_BRANCHES=&UPSTREAM_JOB_NAME=build-scripts%2Fjobs%2Fjdk21u%2Fjdk21u-linux-aarch64-temurin&OPENJ9_REPO=https%3A%2F%2Fgithub.com%2Feclipse-openj9%2Fopenj9.git&CLOUD_PROVIDER=&CUSTOM_TARGET=&VENDOR_TEST_SHAS=&JDK_BRANCH=jdk-21.0.10%2B1_adopt&LABEL_ADDITION=&ARTIFACTORY_REPO=&ARTIFACTORY_ROOT_DIR=&UPSTREAM_TEST_JOB_NUMBER=181&DOCKERIMAGE_TAG=&TEST_TIME=&JDK_IMPL=hotspot&SSH_AGENT_CREDENTIAL=&AUTO_DETECT=true&SLACK_CHANNEL=aqavit-bot&DYNAMIC_COMPILE=false&RELATED_NODES=&ADOPTOPENJDK_SYSTEMTEST_OWNER_BRANCH=adoptium%3Amaster&APPLICATION_OPTIONS=&CUSTOMIZED_SDK_URL_CREDENTIAL_ID=eclipse_temurin_bot_email_and_token&ARCHIVE_TEST_RESULTS=false&NUM_MACHINES=&OPENJDK_SHA=&TRSS_URL=&RERUN_FAILURE=false&USE_TESTENV_PROPERTIES=false&BUILD_LIST=openjdk&ADDITIONAL_ARTIFACTS_REQUIRED=&UPSTREAM_JOB_NUMBER=326&STF_OWNER_BRANCH=adoptium%3Amaster&TIME_LIMIT=25&JVM_OPTIONS=&PARALLEL=None
[Pipeline] echo
[2025-11-06T08:41:32.877Z] Rerun failed jdk test cases in Grinder with jdk_custom target: https://ci.adoptium.net/job/Grinder/parambuild/?SDK_RESOURCE=upstream&TARGET=jdk_custom&BASE_DOCKER_REGISTRY_CREDENTIAL_ID=&TEST_FLAG=&UPSTREAM_TEST_JOB_NAME=Test_openjdk21_hs_extended.openjdk_aarch64_linux&DOCKER_REQUIRED=false&ACTIVE_NODE_TIMEOUT=5&VENDOR_TEST_DIRS=&EXTRA_DOCKER_ARGS=&TKG_OWNER_BRANCH=adoptium%3Amaster&OPENJ9_SYSTEMTEST_OWNER_BRANCH=eclipse%3Amaster&PLATFORM=aarch64_linux&GENERATE_JOBS=true&KEEP_REPORTDIR=true&PERSONAL_BUILD=false&DOCKER_REGISTRY_DIR=&RERUN_ITERATIONS=0&ADOPTOPENJDK_REPO=https%3A%2F%2Fgithub.com%2Fadoptium%2Faqa-tests.git&SETUP_JCK_RUN=false&DOCKER_REGISTRY_URL_CREDENTIAL_ID=&LABEL=&EXTRA_OPTIONS=&CUSTOMIZED_SDK_URL=&BUILD_IDENTIFIER=&JENKINS_KEY=&ADOPTOPENJDK_BRANCH=master&LIGHT_WEIGHT_CHECKOUT=false&USE_JRE=false&ARTIFACTORY_SERVER=&KEEP_WORKSPACE=false&USER_CREDENTIALS_ID=&JDK_VERSION=21&DOCKER_REGISTRY_URL=&ITERATIONS=1&VENDOR_TEST_REPOS=&JDK_REPO=https%3A%2F%2Fgithub.com%2Fadoptium%2Fjdk21u&JCK_GIT_BRANCH=master&OPENJ9_BRANCH=master&OPENJ9_SHA=&JCK_GIT_REPO=&VENDOR_TEST_BRANCHES=&UPSTREAM_JOB_NAME=build-scripts%2Fjobs%2Fjdk21u%2Fjdk21u-linux-aarch64-temurin&OPENJ9_REPO=https%3A%2F%2Fgithub.com%2Feclipse-openj9%2Fopenj9.git&CLOUD_PROVIDER=&CUSTOM_TARGET=java%2Fnio%2Fchannels%2FFileChannel%2FLargeGatheringWrite.java&VENDOR_TEST_SHAS=&JDK_BRANCH=jdk-21.0.10%2B1_adopt&LABEL_ADDITION=&ARTIFACTORY_REPO=&ARTIFACTORY_ROOT_DIR=&UPSTREAM_TEST_JOB_NUMBER=181&DOCKERIMAGE_TAG=&TEST_TIME=&JDK_IMPL=hotspot&SSH_AGENT_CREDENTIAL=&AUTO_DETECT=true&SLACK_CHANNEL=aqavit-bot&DYNAMIC_COMPILE=false&RELATED_NODES=&ADOPTOPENJDK_SYSTEMTEST_OWNER_BRANCH=adoptium%3Amaster&APPLICATION_OPTIONS=&CUSTOMIZED_SDK_URL_CREDENTIAL_ID=eclipse_temurin_bot_email_and_token&ARCHIVE_TEST_RESULTS=false&NUM_MACHINES=&OPENJDK_SHA=&TRSS_URL=&RERUN_FAILURE=false&USE_TESTENV_PROPERTIES=false&BUILD_LIST=openjdk&ADDITIONAL_ARTIFACTS_REQUIRED=&UPSTREAM_JOB_NUMBER=326&STF_OWNER_BRANCH=adoptium%3Amaster&TIME_LIMIT=25&JVM_OPTIONS=&PARALLEL=None
[Pipeline] junit
[2025-11-06T08:41:33.062Z] Recording test results
[2025-11-06T08:41:43.509Z] [Checks API] No suitable checks publisher found.
[Pipeline] }
[Pipeline] // stage
[Pipeline] echo
[2025-11-06T08:41:43.537Z] PROCESSCATCH: Terminating any hung/left over test processes:
[Pipeline] sh
[2025-11-06T08:41:45.577Z] + aqa-tests/terminateTestProcesses.sh jenkins
[2025-11-06T08:41:45.577Z] Unix type machine..
[2025-11-06T08:41:45.577Z] Running on a Linux host
[2025-11-06T08:41:45.577Z] Woohoo - no rogue processes detected!
[Pipeline] retry
[Pipeline] {
[Pipeline] cleanWs
[2025-11-06T08:41:46.482Z] [WS-CLEANUP] Deleting project workspace...
[2025-11-06T08:41:46.482Z] [WS-CLEANUP] Deferred wipeout is disabled by the job configuration...
[2025-11-06T08:42:10.547Z] [WS-CLEANUP] done
[Pipeline] }
[Pipeline] // retry
[Pipeline] sh
[2025-11-06T08:42:12.597Z] + find /tmp -name *core* -print -exec rm -f {} ;
[Pipeline] }
[Pipeline] // timeout
[Pipeline] timeout
[2025-11-06T08:42:31.459Z] Timeout set to expire in 5 min 0 sec
[Pipeline] {
[Pipeline] }
[Pipeline] // timeout
[Pipeline] }
[Pipeline] // node
[Pipeline] }
[Pipeline] // stage
[Pipeline] }
[Pipeline] // timestamps
[Pipeline] End of Pipeline
Finished: UNSTABLE