jdk_net_1
[2025-10-16T01:52:46.846Z] Running test jdk_net_1 ...
[2025-10-16T01:52:46.846Z] ===============================================
[2025-10-16T01:52:46.846Z] jdk_net_1 Start Time: Thu Oct 16 01:52:46 2025 Epoch Time (ms): 1760579566387
[2025-10-16T01:52:46.846Z] variation: Mode650
[2025-10-16T01:52:46.846Z] JVM_OPTIONS: -XX:-UseCompressedOops
[2025-10-16T01:52:46.846Z] { \
[2025-10-16T01:52:46.846Z] echo ""; echo "TEST SETUP:"; \
[2025-10-16T01:52:46.846Z] echo "Nothing to be done for setup."; \
[2025-10-16T01:52:46.846Z] mkdir -p "/home/jenkins/workspace/Test_openjdk25_hs_extended.openjdk_ppc64le_linux_testList_3/aqa-tests/TKG/../TKG/output_17605780863629/jdk_net_1"; \
[2025-10-16T01:52:46.846Z] cd "/home/jenkins/workspace/Test_openjdk25_hs_extended.openjdk_ppc64le_linux_testList_3/aqa-tests/TKG/../TKG/output_17605780863629/jdk_net_1"; \
[2025-10-16T01:52:46.846Z] echo ""; echo "TESTING:"; \
[2025-10-16T01:52:46.846Z] "/home/jenkins/workspace/Test_openjdk25_hs_extended.openjdk_ppc64le_linux_testList_3/jdkbinary/j2sdk-image/bin/java" -Xmx512m -jar "/home/jenkins/workspace/Test_openjdk25_hs_extended.openjdk_ppc64le_linux_testList_3/aqa-tests/TKG/../../jvmtest/openjdk/jtreg/lib/jtreg.jar" \
[2025-10-16T01:52:46.846Z] -agentvm -a -ea -esa -v:fail,error,time,nopass -retain:fail,error,*.dmp,javacore.*,heapdump.*,*.trc -ignore:quiet -timeoutFactor:8 -xml:verify -concurrency:3 -nativepath:"/home/jenkins/workspace/Test_openjdk25_hs_extended.openjdk_ppc64le_linux_testList_3/jdkbinary/openjdk-test-image/jdk/jtreg/native" -vmoptions:"-Xmx512m -XX:-UseCompressedOops " \
[2025-10-16T01:52:46.846Z] -w ""/home/jenkins/workspace/Test_openjdk25_hs_extended.openjdk_ppc64le_linux_testList_3/aqa-tests/TKG/../TKG/output_17605780863629/jdk_net_1"/work" \
[2025-10-16T01:52:46.846Z] -r ""/home/jenkins/workspace/Test_openjdk25_hs_extended.openjdk_ppc64le_linux_testList_3/aqa-tests/TKG/../TKG/output_17605780863629/jdk_net_1"/report" \
[2025-10-16T01:52:46.847Z] -jdk:"/home/jenkins/workspace/Test_openjdk25_hs_extended.openjdk_ppc64le_linux_testList_3/jdkbinary/j2sdk-image" \
[2025-10-16T01:52:46.847Z] -exclude:"/home/jenkins/workspace/Test_openjdk25_hs_extended.openjdk_ppc64le_linux_testList_3/aqa-tests/TKG/../openjdk/openjdk-jdk/test/jdk/ProblemList.txt" \
[2025-10-16T01:52:46.847Z] -exclude:"/home/jenkins/workspace/Test_openjdk25_hs_extended.openjdk_ppc64le_linux_testList_3/aqa-tests/TKG/../../jvmtest/openjdk/excludes/ProblemList_openjdk25.txt" \
[2025-10-16T01:52:46.847Z] \
[2025-10-16T01:52:46.847Z] \
[2025-10-16T01:52:46.847Z] "/home/jenkins/workspace/Test_openjdk25_hs_extended.openjdk_ppc64le_linux_testList_3/aqa-tests/TKG/../openjdk/openjdk-jdk/test/jdk:jdk_net"; \
[2025-10-16T01:52:46.847Z] if [ $? -eq 0 ]; then echo "-----------------------------------"; echo "jdk_net_1""_PASSED"; echo "-----------------------------------"; cd /home/jenkins/workspace/Test_openjdk25_hs_extended.openjdk_ppc64le_linux_testList_3/aqa-tests/TKG/..; else echo "-----------------------------------"; echo "jdk_net_1""_FAILED"; echo "-----------------------------------"; fi; \
[2025-10-16T01:52:46.847Z] echo ""; echo "TEST TEARDOWN:"; \
[2025-10-16T01:52:46.847Z] echo "Nothing to be done for teardown."; \
[2025-10-16T01:52:46.847Z] } 2>&1 | tee -a "/home/jenkins/workspace/Test_openjdk25_hs_extended.openjdk_ppc64le_linux_testList_3/aqa-tests/TKG/../TKG/output_17605780863629/TestTargetResult";
[2025-10-16T01:52:46.847Z]
[2025-10-16T01:52:46.847Z] TEST SETUP:
[2025-10-16T01:52:46.847Z] Nothing to be done for setup.
[2025-10-16T01:52:46.847Z]
[2025-10-16T01:52:46.847Z] TESTING:
[2025-10-16T01:52:47.792Z] Directory "/home/jenkins/workspace/Test_openjdk25_hs_extended.openjdk_ppc64le_linux_testList_3/aqa-tests/TKG/../TKG/output_17605780863629/jdk_net_1/work" not found: creating
[2025-10-16T01:52:47.792Z] Directory "/home/jenkins/workspace/Test_openjdk25_hs_extended.openjdk_ppc64le_linux_testList_3/aqa-tests/TKG/../TKG/output_17605780863629/jdk_net_1/report" not found: creating
[2025-10-16T01:52:53.147Z] XML output with verification to /home/jenkins/workspace/Test_openjdk25_hs_extended.openjdk_ppc64le_linux_testList_3/aqa-tests/TKG/output_17605780863629/jdk_net_1/work
[2025-10-16T01:57:08.135Z] --------------------------------------------------
[2025-10-16T01:57:08.135Z] TEST: java/net/CookieHandler/B6644726.java
[2025-10-16T01:57:08.135Z] TEST JDK: /home/jenkins/workspace/Test_openjdk25_hs_extended.openjdk_ppc64le_linux_testList_3/jdkbinary/j2sdk-image
[2025-10-16T01:57:08.135Z]
[2025-10-16T01:57:08.135Z] ACTION: build -- Passed. Build successful
[2025-10-16T01:57:08.135Z] REASON: Named class compiled on demand
[2025-10-16T01:57:08.135Z] TIME: 0.038 seconds
[2025-10-16T01:57:08.135Z] messages:
[2025-10-16T01:57:08.135Z] command: build B6644726
[2025-10-16T01:57:08.135Z] reason: Named class compiled on demand
[2025-10-16T01:57:08.135Z] started: Thu Oct 16 01:56:56 UTC 2025
[2025-10-16T01:57:08.135Z] Test directory:
[2025-10-16T01:57:08.135Z] compile: B6644726
[2025-10-16T01:57:08.135Z] finished: Thu Oct 16 01:56:56 UTC 2025
[2025-10-16T01:57:08.135Z] elapsed time (seconds): 0.038
[2025-10-16T01:57:08.135Z]
[2025-10-16T01:57:08.135Z] ACTION: compile -- Passed. Compilation successful
[2025-10-16T01:57:08.135Z] REASON: .class file out of date or does not exist
[2025-10-16T01:57:08.135Z] TIME: 0.038 seconds
[2025-10-16T01:57:08.135Z] messages:
[2025-10-16T01:57:08.135Z] command: compile /home/jenkins/workspace/Test_openjdk25_hs_extended.openjdk_ppc64le_linux_testList_3/aqa-tests/openjdk/openjdk-jdk/test/jdk/java/net/CookieHandler/B6644726.java
[2025-10-16T01:57:08.135Z] reason: .class file out of date or does not exist
[2025-10-16T01:57:08.135Z] started: Thu Oct 16 01:56:56 UTC 2025
[2025-10-16T01:57:08.135Z] Mode: agentvm
[2025-10-16T01:57:08.135Z] Agent id: 3
[2025-10-16T01:57:08.135Z] Process id: 2999990
[2025-10-16T01:57:08.135Z] finished: Thu Oct 16 01:56:56 UTC 2025
[2025-10-16T01:57:08.135Z] elapsed time (seconds): 0.038
[2025-10-16T01:57:08.135Z] configuration:
[2025-10-16T01:57:08.135Z] Boot Layer (javac runtime environment)
[2025-10-16T01:57:08.135Z] class path: /home/jenkins/workspace/Test_openjdk25_hs_extended.openjdk_ppc64le_linux_testList_3/jvmtest/openjdk/jtreg/lib/javatest.jar
[2025-10-16T01:57:08.135Z] /home/jenkins/workspace/Test_openjdk25_hs_extended.openjdk_ppc64le_linux_testList_3/jvmtest/openjdk/jtreg/lib/jtreg.jar
[2025-10-16T01:57:08.135Z] patch: java.base /home/jenkins/workspace/Test_openjdk25_hs_extended.openjdk_ppc64le_linux_testList_3/aqa-tests/TKG/output_17605780863629/jdk_net_1/work/patches/java.base
[2025-10-16T01:57:08.135Z]
[2025-10-16T01:57:08.135Z] javac compilation environment
[2025-10-16T01:57:08.135Z] source path: /home/jenkins/workspace/Test_openjdk25_hs_extended.openjdk_ppc64le_linux_testList_3/aqa-tests/openjdk/openjdk-jdk/test/jdk/java/net/CookieHandler
[2025-10-16T01:57:08.135Z] class path: /home/jenkins/workspace/Test_openjdk25_hs_extended.openjdk_ppc64le_linux_testList_3/aqa-tests/openjdk/openjdk-jdk/test/jdk/java/net/CookieHandler
[2025-10-16T01:57:08.135Z] /home/jenkins/workspace/Test_openjdk25_hs_extended.openjdk_ppc64le_linux_testList_3/aqa-tests/TKG/output_17605780863629/jdk_net_1/work/classes/0/java/net/CookieHandler/B6644726.d
[2025-10-16T01:57:08.135Z]
[2025-10-16T01:57:08.135Z] rerun:
[2025-10-16T01:57:08.135Z] cd /home/jenkins/workspace/Test_openjdk25_hs_extended.openjdk_ppc64le_linux_testList_3/aqa-tests/TKG/output_17605780863629/jdk_net_1/work/scratch/2 && \
[2025-10-16T01:57:08.135Z] DBUS_SESSION_BUS_ADDRESS=unix:path=/run/user/1002/bus \
[2025-10-16T01:57:08.135Z] DISPLAY=:0 \
[2025-10-16T01:57:08.135Z] HOME=/home/jenkins \
[2025-10-16T01:57:08.135Z] LANG=en_US.UTF-8 \
[2025-10-16T01:57:08.135Z] PATH=/bin:/usr/bin:/usr/sbin \
[2025-10-16T01:57:08.135Z] XDG_RUNTIME_DIR=/run/user/1002 \
[2025-10-16T01:57:08.135Z] XDG_SESSION_CLASS=user \
[2025-10-16T01:57:08.135Z] XDG_SESSION_ID=168080 \
[2025-10-16T01:57:08.135Z] XDG_SESSION_TYPE=tty \
[2025-10-16T01:57:08.135Z] /home/jenkins/workspace/Test_openjdk25_hs_extended.openjdk_ppc64le_linux_testList_3/jdkbinary/j2sdk-image/bin/javac \
[2025-10-16T01:57:08.135Z] -J-ea \
[2025-10-16T01:57:08.135Z] -J-esa \
[2025-10-16T01:57:08.135Z] -J-Xmx512m \
[2025-10-16T01:57:08.135Z] -J-XX:-UseCompressedOops \
[2025-10-16T01:57:08.135Z] -J-Dtest.vm.opts='-ea -esa -Xmx512m -XX:-UseCompressedOops' \
[2025-10-16T01:57:08.135Z] -J-Dtest.tool.vm.opts='-J-ea -J-esa -J-Xmx512m -J-XX:-UseCompressedOops' \
[2025-10-16T01:57:08.135Z] -J-Dtest.compiler.opts= \
[2025-10-16T01:57:08.135Z] -J-Dtest.java.opts= \
[2025-10-16T01:57:08.135Z] -J-Dtest.jdk=/home/jenkins/workspace/Test_openjdk25_hs_extended.openjdk_ppc64le_linux_testList_3/jdkbinary/j2sdk-image \
[2025-10-16T01:57:08.135Z] -J-Dcompile.jdk=/home/jenkins/workspace/Test_openjdk25_hs_extended.openjdk_ppc64le_linux_testList_3/jdkbinary/j2sdk-image \
[2025-10-16T01:57:08.135Z] -J-Dtest.timeout.factor=8.0 \
[2025-10-16T01:57:08.135Z] -J-Dtest.nativepath=/home/jenkins/workspace/Test_openjdk25_hs_extended.openjdk_ppc64le_linux_testList_3/jdkbinary/openjdk-test-image/jdk/jtreg/native \
[2025-10-16T01:57:08.135Z] -J-Dtest.root=/home/jenkins/workspace/Test_openjdk25_hs_extended.openjdk_ppc64le_linux_testList_3/aqa-tests/openjdk/openjdk-jdk/test/jdk \
[2025-10-16T01:57:08.135Z] -J-Dtest.name=java/net/CookieHandler/B6644726.java \
[2025-10-16T01:57:08.135Z] -J-Dtest.verbose=Verbose[p=NONE,f=FULL,e=FULL,t=true,m=false] \
[2025-10-16T01:57:08.135Z] -J-Dtest.file=/home/jenkins/workspace/Test_openjdk25_hs_extended.openjdk_ppc64le_linux_testList_3/aqa-tests/openjdk/openjdk-jdk/test/jdk/java/net/CookieHandler/B6644726.java \
[2025-10-16T01:57:08.135Z] -J-Dtest.src=/home/jenkins/workspace/Test_openjdk25_hs_extended.openjdk_ppc64le_linux_testList_3/aqa-tests/openjdk/openjdk-jdk/test/jdk/java/net/CookieHandler \
[2025-10-16T01:57:08.135Z] -J-Dtest.src.path=/home/jenkins/workspace/Test_openjdk25_hs_extended.openjdk_ppc64le_linux_testList_3/aqa-tests/openjdk/openjdk-jdk/test/jdk/java/net/CookieHandler \
[2025-10-16T01:57:08.135Z] -J-Dtest.classes=/home/jenkins/workspace/Test_openjdk25_hs_extended.openjdk_ppc64le_linux_testList_3/aqa-tests/TKG/output_17605780863629/jdk_net_1/work/classes/0/java/net/CookieHandler/B6644726.d \
[2025-10-16T01:57:08.135Z] -J-Dtest.class.path=/home/jenkins/workspace/Test_openjdk25_hs_extended.openjdk_ppc64le_linux_testList_3/aqa-tests/TKG/output_17605780863629/jdk_net_1/work/classes/0/java/net/CookieHandler/B6644726.d \
[2025-10-16T01:57:08.135Z] -J-Dtest.class.path.prefix=/home/jenkins/workspace/Test_openjdk25_hs_extended.openjdk_ppc64le_linux_testList_3/aqa-tests/TKG/output_17605780863629/jdk_net_1/work/classes/0/java/net/CookieHandler/B6644726.d:/home/jenkins/workspace/Test_openjdk25_hs_extended.openjdk_ppc64le_linux_testList_3/aqa-tests/openjdk/openjdk-jdk/test/jdk/java/net/CookieHandler \
[2025-10-16T01:57:08.135Z] -d /home/jenkins/workspace/Test_openjdk25_hs_extended.openjdk_ppc64le_linux_testList_3/aqa-tests/TKG/output_17605780863629/jdk_net_1/work/classes/0/java/net/CookieHandler/B6644726.d \
[2025-10-16T01:57:08.135Z] -sourcepath /home/jenkins/workspace/Test_openjdk25_hs_extended.openjdk_ppc64le_linux_testList_3/aqa-tests/openjdk/openjdk-jdk/test/jdk/java/net/CookieHandler \
[2025-10-16T01:57:08.135Z] -classpath /home/jenkins/workspace/Test_openjdk25_hs_extended.openjdk_ppc64le_linux_testList_3/aqa-tests/openjdk/openjdk-jdk/test/jdk/java/net/CookieHandler:/home/jenkins/workspace/Test_openjdk25_hs_extended.openjdk_ppc64le_linux_testList_3/aqa-tests/TKG/output_17605780863629/jdk_net_1/work/classes/0/java/net/CookieHandler/B6644726.d /home/jenkins/workspace/Test_openjdk25_hs_extended.openjdk_ppc64le_linux_testList_3/aqa-tests/openjdk/openjdk-jdk/test/jdk/java/net/CookieHandler/B6644726.java
[2025-10-16T01:57:08.135Z]
[2025-10-16T01:57:08.135Z] ACTION: main -- Failed. Execution failed: `main' threw exception: java.lang.RuntimeException: Should have 5 cookies. Got only 3, expires probably didn't parse correctly
[2025-10-16T01:57:08.135Z] REASON: Assumed action based on file name: run main B6644726
[2025-10-16T01:57:08.135Z] TIME: 0.032 seconds
[2025-10-16T01:57:08.135Z] messages:
[2025-10-16T01:57:08.135Z] command: main B6644726
[2025-10-16T01:57:08.135Z] reason: Assumed action based on file name: run main B6644726
[2025-10-16T01:57:08.135Z] started: Thu Oct 16 01:56:56 UTC 2025
[2025-10-16T01:57:08.135Z] Mode: agentvm
[2025-10-16T01:57:08.135Z] Agent id: 10
[2025-10-16T01:57:08.135Z] Process id: 3005744
[2025-10-16T01:57:08.135Z] finished: Thu Oct 16 01:56:56 UTC 2025
[2025-10-16T01:57:08.135Z] elapsed time (seconds): 0.032
[2025-10-16T01:57:08.135Z] configuration:
[2025-10-16T01:57:08.135Z] Boot Layer
[2025-10-16T01:57:08.135Z] class path: /home/jenkins/workspace/Test_openjdk25_hs_extended.openjdk_ppc64le_linux_testList_3/jvmtest/openjdk/jtreg/lib/javatest.jar
[2025-10-16T01:57:08.135Z] /home/jenkins/workspace/Test_openjdk25_hs_extended.openjdk_ppc64le_linux_testList_3/jvmtest/openjdk/jtreg/lib/jtreg.jar
[2025-10-16T01:57:08.135Z] /home/jenkins/workspace/Test_openjdk25_hs_extended.openjdk_ppc64le_linux_testList_3/jvmtest/openjdk/jtreg/lib/junit-platform-console-standalone-1.11.0.jar
[2025-10-16T01:57:08.136Z] /home/jenkins/workspace/Test_openjdk25_hs_extended.openjdk_ppc64le_linux_testList_3/jvmtest/openjdk/jtreg/lib/testng-7.3.0.jar
[2025-10-16T01:57:08.136Z] /home/jenkins/workspace/Test_openjdk25_hs_extended.openjdk_ppc64le_linux_testList_3/jvmtest/openjdk/jtreg/lib/guice-5.1.0.jar
[2025-10-16T01:57:08.136Z] /home/jenkins/workspace/Test_openjdk25_hs_extended.openjdk_ppc64le_linux_testList_3/jvmtest/openjdk/jtreg/lib/jcommander-1.82.jar
[2025-10-16T01:57:08.136Z] patch: java.base /home/jenkins/workspace/Test_openjdk25_hs_extended.openjdk_ppc64le_linux_testList_3/aqa-tests/TKG/output_17605780863629/jdk_net_1/work/patches/java.base
[2025-10-16T01:57:08.136Z]
[2025-10-16T01:57:08.136Z] Test Layer
[2025-10-16T01:57:08.136Z] class path: /home/jenkins/workspace/Test_openjdk25_hs_extended.openjdk_ppc64le_linux_testList_3/aqa-tests/TKG/output_17605780863629/jdk_net_1/work/classes/0/java/net/CookieHandler/B6644726.d
[2025-10-16T01:57:08.136Z] /home/jenkins/workspace/Test_openjdk25_hs_extended.openjdk_ppc64le_linux_testList_3/aqa-tests/openjdk/openjdk-jdk/test/jdk/java/net/CookieHandler
[2025-10-16T01:57:08.136Z]
[2025-10-16T01:57:08.136Z] rerun:
[2025-10-16T01:57:08.136Z] cd /home/jenkins/workspace/Test_openjdk25_hs_extended.openjdk_ppc64le_linux_testList_3/aqa-tests/TKG/output_17605780863629/jdk_net_1/work/scratch/2 && \
[2025-10-16T01:57:08.136Z] DBUS_SESSION_BUS_ADDRESS=unix:path=/run/user/1002/bus \
[2025-10-16T01:57:08.136Z] DISPLAY=:0 \
[2025-10-16T01:57:08.136Z] HOME=/home/jenkins \
[2025-10-16T01:57:08.136Z] LANG=en_US.UTF-8 \
[2025-10-16T01:57:08.136Z] PATH=/bin:/usr/bin:/usr/sbin \
[2025-10-16T01:57:08.136Z] XDG_RUNTIME_DIR=/run/user/1002 \
[2025-10-16T01:57:08.136Z] XDG_SESSION_CLASS=user \
[2025-10-16T01:57:08.136Z] XDG_SESSION_ID=168080 \
[2025-10-16T01:57:08.136Z] XDG_SESSION_TYPE=tty \
[2025-10-16T01:57:08.136Z] /home/jenkins/workspace/Test_openjdk25_hs_extended.openjdk_ppc64le_linux_testList_3/jdkbinary/j2sdk-image/bin/java \
[2025-10-16T01:57:08.136Z] -Dtest.vm.opts='-ea -esa -Xmx512m -XX:-UseCompressedOops' \
[2025-10-16T01:57:08.136Z] -Dtest.tool.vm.opts='-J-ea -J-esa -J-Xmx512m -J-XX:-UseCompressedOops' \
[2025-10-16T01:57:08.136Z] -Dtest.compiler.opts= \
[2025-10-16T01:57:08.136Z] -Dtest.java.opts= \
[2025-10-16T01:57:08.136Z] -Dtest.jdk=/home/jenkins/workspace/Test_openjdk25_hs_extended.openjdk_ppc64le_linux_testList_3/jdkbinary/j2sdk-image \
[2025-10-16T01:57:08.136Z] -Dcompile.jdk=/home/jenkins/workspace/Test_openjdk25_hs_extended.openjdk_ppc64le_linux_testList_3/jdkbinary/j2sdk-image \
[2025-10-16T01:57:08.136Z] -Dtest.timeout.factor=8.0 \
[2025-10-16T01:57:08.136Z] -Dtest.nativepath=/home/jenkins/workspace/Test_openjdk25_hs_extended.openjdk_ppc64le_linux_testList_3/jdkbinary/openjdk-test-image/jdk/jtreg/native \
[2025-10-16T01:57:08.136Z] -Dtest.root=/home/jenkins/workspace/Test_openjdk25_hs_extended.openjdk_ppc64le_linux_testList_3/aqa-tests/openjdk/openjdk-jdk/test/jdk \
[2025-10-16T01:57:08.136Z] -Dtest.name=java/net/CookieHandler/B6644726.java \
[2025-10-16T01:57:08.136Z] -Dtest.verbose=Verbose[p=NONE,f=FULL,e=FULL,t=true,m=false] \
[2025-10-16T01:57:08.136Z] -Dtest.file=/home/jenkins/workspace/Test_openjdk25_hs_extended.openjdk_ppc64le_linux_testList_3/aqa-tests/openjdk/openjdk-jdk/test/jdk/java/net/CookieHandler/B6644726.java \
[2025-10-16T01:57:08.136Z] -Dtest.src=/home/jenkins/workspace/Test_openjdk25_hs_extended.openjdk_ppc64le_linux_testList_3/aqa-tests/openjdk/openjdk-jdk/test/jdk/java/net/CookieHandler \
[2025-10-16T01:57:08.136Z] -Dtest.src.path=/home/jenkins/workspace/Test_openjdk25_hs_extended.openjdk_ppc64le_linux_testList_3/aqa-tests/openjdk/openjdk-jdk/test/jdk/java/net/CookieHandler \
[2025-10-16T01:57:08.136Z] -Dtest.classes=/home/jenkins/workspace/Test_openjdk25_hs_extended.openjdk_ppc64le_linux_testList_3/aqa-tests/TKG/output_17605780863629/jdk_net_1/work/classes/0/java/net/CookieHandler/B6644726.d \
[2025-10-16T01:57:08.136Z] -Dtest.class.path=/home/jenkins/workspace/Test_openjdk25_hs_extended.openjdk_ppc64le_linux_testList_3/aqa-tests/TKG/output_17605780863629/jdk_net_1/work/classes/0/java/net/CookieHandler/B6644726.d \
[2025-10-16T01:57:08.136Z] -Dtest.class.path.prefix=/home/jenkins/workspace/Test_openjdk25_hs_extended.openjdk_ppc64le_linux_testList_3/aqa-tests/TKG/output_17605780863629/jdk_net_1/work/classes/0/java/net/CookieHandler/B6644726.d:/home/jenkins/workspace/Test_openjdk25_hs_extended.openjdk_ppc64le_linux_testList_3/aqa-tests/openjdk/openjdk-jdk/test/jdk/java/net/CookieHandler \
[2025-10-16T01:57:08.136Z] -classpath /home/jenkins/workspace/Test_openjdk25_hs_extended.openjdk_ppc64le_linux_testList_3/aqa-tests/TKG/output_17605780863629/jdk_net_1/work/classes/0/java/net/CookieHandler/B6644726.d:/home/jenkins/workspace/Test_openjdk25_hs_extended.openjdk_ppc64le_linux_testList_3/aqa-tests/openjdk/openjdk-jdk/test/jdk/java/net/CookieHandler:/home/jenkins/workspace/Test_openjdk25_hs_extended.openjdk_ppc64le_linux_testList_3/jvmtest/openjdk/jtreg/lib/javatest.jar:/home/jenkins/workspace/Test_openjdk25_hs_extended.openjdk_ppc64le_linux_testList_3/jvmtest/openjdk/jtreg/lib/jtreg.jar \
[2025-10-16T01:57:08.136Z] B6644726
[2025-10-16T01:57:08.136Z] STDERR:
[2025-10-16T01:57:08.136Z] java.lang.RuntimeException: Should have 5 cookies. Got only 3, expires probably didn't parse correctly
[2025-10-16T01:57:08.136Z] at B6644726.fail(B6644726.java:209)
[2025-10-16T01:57:08.136Z] at B6644726.testCookieStore(B6644726.java:67)
[2025-10-16T01:57:08.136Z] at B6644726.main(B6644726.java:35)
[2025-10-16T01:57:08.136Z] at java.base/jdk.internal.reflect.DirectMethodHandleAccessor.invoke(DirectMethodHandleAccessor.java:104)
[2025-10-16T01:57:08.136Z] at java.base/java.lang.reflect.Method.invoke(Method.java:565)
[2025-10-16T01:57:08.136Z] at com.sun.javatest.regtest.agent.MainActionHelper$AgentVMRunnable.run(MainActionHelper.java:335)
[2025-10-16T01:57:08.136Z] at java.base/java.lang.Thread.run(Thread.java:1474)
[2025-10-16T01:57:08.136Z]
[2025-10-16T01:57:08.136Z] JavaTest Message: Test threw exception: java.lang.RuntimeException
[2025-10-16T01:57:08.136Z] JavaTest Message: shutting down test
[2025-10-16T01:57:08.136Z]
[2025-10-16T01:57:08.136Z]
[2025-10-16T01:57:08.136Z] TEST RESULT: Failed. Execution failed: `main' threw exception: java.lang.RuntimeException: Should have 5 cookies. Got only 3, expires probably didn't parse correctly
[2025-10-16T01:57:08.136Z] --------------------------------------------------
[2025-10-16T02:17:21.653Z] Test results: passed: 867; failed: 1; excluded: 50; did not match keywords: 7; did not meet platform requirements: 7
[2025-10-16T02:17:37.344Z] Report written to /home/jenkins/workspace/Test_openjdk25_hs_extended.openjdk_ppc64le_linux_testList_3/aqa-tests/TKG/output_17605780863629/jdk_net_1/report/html/report.html
[2025-10-16T02:17:37.344Z] Results written to /home/jenkins/workspace/Test_openjdk25_hs_extended.openjdk_ppc64le_linux_testList_3/aqa-tests/TKG/output_17605780863629/jdk_net_1/work
[2025-10-16T02:17:37.344Z] Error: Some tests failed or other problems occurred.
[2025-10-16T02:17:37.344Z] -----------------------------------
[2025-10-16T02:17:37.344Z] jdk_net_1_FAILED
[2025-10-16T02:17:37.344Z] -----------------------------------
[2025-10-16T02:17:37.344Z]
[2025-10-16T02:17:37.344Z] TEST TEARDOWN:
[2025-10-16T02:17:37.344Z] Nothing to be done for teardown.
[2025-10-16T02:17:37.344Z] jdk_net_1 Finish Time: Thu Oct 16 02:17:36 2025 Epoch Time (ms): 1760581056324