jdk_net_0
[2025-08-20T22:29:40.098Z] Running test jdk_net_0 ...
[2025-08-20T22:29:40.098Z] ===============================================
[2025-08-20T22:29:40.098Z] jdk_net_0 Start Time: Wed Aug 20 22:29:39 2025 Epoch Time (ms): 1755728979317
[2025-08-20T22:29:40.098Z] variation: Mode150
[2025-08-20T22:29:40.098Z] JVM_OPTIONS: -XX:+UseCompressedOops
[2025-08-20T22:29:40.098Z] { \
[2025-08-20T22:29:40.098Z] echo ""; echo "TEST SETUP:"; \
[2025-08-20T22:29:40.098Z] echo "Nothing to be done for setup."; \
[2025-08-20T22:29:40.098Z] mkdir -p "/home/jenkins/workspace/Test_openjdk21_hs_extended.openjdk_ppc64_aix_testList_2/aqa-tests/TKG/../TKG/output_17557289531492/jdk_net_0"; \
[2025-08-20T22:29:40.098Z] cd "/home/jenkins/workspace/Test_openjdk21_hs_extended.openjdk_ppc64_aix_testList_2/aqa-tests/TKG/../TKG/output_17557289531492/jdk_net_0"; \
[2025-08-20T22:29:40.098Z] echo ""; echo "TESTING:"; \
[2025-08-20T22:29:40.098Z] "/home/jenkins/workspace/Test_openjdk21_hs_extended.openjdk_ppc64_aix_testList_2/jdkbinary/j2sdk-image/bin/java" -Xmx512m -jar "/home/jenkins/workspace/Test_openjdk21_hs_extended.openjdk_ppc64_aix_testList_2/aqa-tests/TKG/../../jvmtest/openjdk/jtreg/lib/jtreg.jar" \
[2025-08-20T22:29:40.099Z] -agentvm -a -ea -esa -v:fail,error,time,nopass -retain:fail,error,*.dmp,javacore.*,heapdump.*,*.trc -ignore:quiet -timeoutFactor:8 -xml:verify -concurrency:1 -nativepath:"/home/jenkins/workspace/Test_openjdk21_hs_extended.openjdk_ppc64_aix_testList_2/jdkbinary/openjdk-test-image/jdk/jtreg/native" -vmoptions:"-Xmx512m -XX:+UseCompressedOops " \
[2025-08-20T22:29:40.099Z] -w ""/home/jenkins/workspace/Test_openjdk21_hs_extended.openjdk_ppc64_aix_testList_2/aqa-tests/TKG/../TKG/output_17557289531492/jdk_net_0"/work" \
[2025-08-20T22:29:40.099Z] -r ""/home/jenkins/workspace/Test_openjdk21_hs_extended.openjdk_ppc64_aix_testList_2/aqa-tests/TKG/../TKG/output_17557289531492/jdk_net_0"/report" \
[2025-08-20T22:29:40.099Z] -jdk:"/home/jenkins/workspace/Test_openjdk21_hs_extended.openjdk_ppc64_aix_testList_2/jdkbinary/j2sdk-image" \
[2025-08-20T22:29:40.099Z] -exclude:"/home/jenkins/workspace/Test_openjdk21_hs_extended.openjdk_ppc64_aix_testList_2/aqa-tests/TKG/../openjdk/openjdk-jdk/test/jdk/ProblemList.txt" \
[2025-08-20T22:29:40.099Z] -exclude:"/home/jenkins/workspace/Test_openjdk21_hs_extended.openjdk_ppc64_aix_testList_2/aqa-tests/TKG/../../jvmtest/openjdk/excludes/ProblemList_openjdk21.txt" \
[2025-08-20T22:29:40.099Z] \
[2025-08-20T22:29:40.099Z] -exclude:"/home/jenkins/workspace/Test_openjdk21_hs_extended.openjdk_ppc64_aix_testList_2/aqa-tests/TKG/../openjdk/excludes/vendors/eclipse/ProblemList_openjdk21.txt" \
[2025-08-20T22:29:40.099Z] "/home/jenkins/workspace/Test_openjdk21_hs_extended.openjdk_ppc64_aix_testList_2/aqa-tests/TKG/../openjdk/openjdk-jdk/test/jdk:jdk_net"; \
[2025-08-20T22:29:40.099Z] if [ $? -eq 0 ]; then echo "-----------------------------------"; echo "jdk_net_0""_PASSED"; echo "-----------------------------------"; cd /home/jenkins/workspace/Test_openjdk21_hs_extended.openjdk_ppc64_aix_testList_2/aqa-tests/TKG/..; else echo "-----------------------------------"; echo "jdk_net_0""_FAILED"; echo "-----------------------------------"; fi; \
[2025-08-20T22:29:40.099Z] echo ""; echo "TEST TEARDOWN:"; \
[2025-08-20T22:29:40.099Z] echo "Nothing to be done for teardown."; \
[2025-08-20T22:29:40.099Z] } 2>&1 | tee -a "/home/jenkins/workspace/Test_openjdk21_hs_extended.openjdk_ppc64_aix_testList_2/aqa-tests/TKG/../TKG/output_17557289531492/TestTargetResult";
[2025-08-20T22:29:40.099Z]
[2025-08-20T22:29:40.099Z] TEST SETUP:
[2025-08-20T22:29:40.099Z] Nothing to be done for setup.
[2025-08-20T22:29:40.099Z]
[2025-08-20T22:29:40.099Z] TESTING:
[2025-08-20T22:29:40.099Z] Directory "/home/jenkins/workspace/Test_openjdk21_hs_extended.openjdk_ppc64_aix_testList_2/aqa-tests/TKG/../TKG/output_17557289531492/jdk_net_0/work" not found: creating
[2025-08-20T22:29:40.099Z] Directory "/home/jenkins/workspace/Test_openjdk21_hs_extended.openjdk_ppc64_aix_testList_2/aqa-tests/TKG/../TKG/output_17557289531492/jdk_net_0/report" not found: creating
[2025-08-20T22:29:45.710Z] XML output with verification to /home/jenkins/workspace/Test_openjdk21_hs_extended.openjdk_ppc64_aix_testList_2/aqa-tests/TKG/output_17557289531492/jdk_net_0/work
[2025-08-20T22:42:42.410Z] --------------------------------------------------
[2025-08-20T22:42:42.410Z] TEST: java/net/CookieHandler/B6644726.java
[2025-08-20T22:42:42.410Z] TEST JDK: /home/jenkins/workspace/Test_openjdk21_hs_extended.openjdk_ppc64_aix_testList_2/jdkbinary/j2sdk-image
[2025-08-20T22:42:42.410Z]
[2025-08-20T22:42:42.410Z] ACTION: build -- Passed. Build successful
[2025-08-20T22:42:42.410Z] REASON: Named class compiled on demand
[2025-08-20T22:42:42.410Z] TIME: 0.173 seconds
[2025-08-20T22:42:42.410Z] messages:
[2025-08-20T22:42:42.410Z] command: build B6644726
[2025-08-20T22:42:42.410Z] reason: Named class compiled on demand
[2025-08-20T22:42:42.410Z] started: Wed Aug 20 22:42:38 UTC 2025
[2025-08-20T22:42:42.410Z] Test directory:
[2025-08-20T22:42:42.410Z] compile: B6644726
[2025-08-20T22:42:42.410Z] finished: Wed Aug 20 22:42:38 UTC 2025
[2025-08-20T22:42:42.410Z] elapsed time (seconds): 0.173
[2025-08-20T22:42:42.410Z]
[2025-08-20T22:42:42.410Z] ACTION: compile -- Passed. Compilation successful
[2025-08-20T22:42:42.410Z] REASON: .class file out of date or does not exist
[2025-08-20T22:42:42.410Z] TIME: 0.173 seconds
[2025-08-20T22:42:42.410Z] messages:
[2025-08-20T22:42:42.410Z] command: compile /home/jenkins/workspace/Test_openjdk21_hs_extended.openjdk_ppc64_aix_testList_2/aqa-tests/openjdk/openjdk-jdk/test/jdk/java/net/CookieHandler/B6644726.java
[2025-08-20T22:42:42.410Z] reason: .class file out of date or does not exist
[2025-08-20T22:42:42.410Z] started: Wed Aug 20 22:42:38 UTC 2025
[2025-08-20T22:42:42.410Z] Mode: agentvm
[2025-08-20T22:42:42.410Z] Agent id: 1
[2025-08-20T22:42:42.410Z] finished: Wed Aug 20 22:42:38 UTC 2025
[2025-08-20T22:42:42.410Z] elapsed time (seconds): 0.173
[2025-08-20T22:42:42.410Z] configuration:
[2025-08-20T22:42:42.410Z] Boot Layer (javac runtime environment)
[2025-08-20T22:42:42.410Z] class path: /home/jenkins/workspace/Test_openjdk21_hs_extended.openjdk_ppc64_aix_testList_2/jvmtest/openjdk/jtreg/lib/javatest.jar
[2025-08-20T22:42:42.410Z] /home/jenkins/workspace/Test_openjdk21_hs_extended.openjdk_ppc64_aix_testList_2/jvmtest/openjdk/jtreg/lib/jtreg.jar
[2025-08-20T22:42:42.410Z] patch: java.base /home/jenkins/workspace/Test_openjdk21_hs_extended.openjdk_ppc64_aix_testList_2/aqa-tests/TKG/output_17557289531492/jdk_net_0/work/patches/java.base
[2025-08-20T22:42:42.410Z]
[2025-08-20T22:42:42.410Z] javac compilation environment
[2025-08-20T22:42:42.410Z] source path: /home/jenkins/workspace/Test_openjdk21_hs_extended.openjdk_ppc64_aix_testList_2/aqa-tests/openjdk/openjdk-jdk/test/jdk/java/net/CookieHandler
[2025-08-20T22:42:42.410Z] class path: /home/jenkins/workspace/Test_openjdk21_hs_extended.openjdk_ppc64_aix_testList_2/aqa-tests/openjdk/openjdk-jdk/test/jdk/java/net/CookieHandler
[2025-08-20T22:42:42.410Z] /home/jenkins/workspace/Test_openjdk21_hs_extended.openjdk_ppc64_aix_testList_2/aqa-tests/TKG/output_17557289531492/jdk_net_0/work/classes/java/net/CookieHandler/B6644726.d
[2025-08-20T22:42:42.410Z]
[2025-08-20T22:42:42.410Z] rerun:
[2025-08-20T22:42:42.410Z] cd /home/jenkins/workspace/Test_openjdk21_hs_extended.openjdk_ppc64_aix_testList_2/aqa-tests/TKG/output_17557289531492/jdk_net_0/work/scratch && \
[2025-08-20T22:42:42.410Z] DISPLAY=unix:0 \
[2025-08-20T22:42:42.410Z] HOME=/home/jenkins \
[2025-08-20T22:42:42.410Z] LANG=en_US \
[2025-08-20T22:42:42.410Z] PATH=/bin:/usr/bin:/usr/sbin \
[2025-08-20T22:42:42.410Z] TZ=CUT0 \
[2025-08-20T22:42:42.410Z] /home/jenkins/workspace/Test_openjdk21_hs_extended.openjdk_ppc64_aix_testList_2/jdkbinary/j2sdk-image/bin/javac \
[2025-08-20T22:42:42.410Z] -J-ea \
[2025-08-20T22:42:42.410Z] -J-esa \
[2025-08-20T22:42:42.410Z] -J-Xmx512m \
[2025-08-20T22:42:42.410Z] -J-XX:+UseCompressedOops \
[2025-08-20T22:42:42.410Z] -J-Dtest.vm.opts='-ea -esa -Xmx512m -XX:+UseCompressedOops' \
[2025-08-20T22:42:42.410Z] -J-Dtest.tool.vm.opts='-J-ea -J-esa -J-Xmx512m -J-XX:+UseCompressedOops' \
[2025-08-20T22:42:42.410Z] -J-Dtest.compiler.opts= \
[2025-08-20T22:42:42.410Z] -J-Dtest.java.opts= \
[2025-08-20T22:42:42.410Z] -J-Dtest.jdk=/home/jenkins/workspace/Test_openjdk21_hs_extended.openjdk_ppc64_aix_testList_2/jdkbinary/j2sdk-image \
[2025-08-20T22:42:42.410Z] -J-Dcompile.jdk=/home/jenkins/workspace/Test_openjdk21_hs_extended.openjdk_ppc64_aix_testList_2/jdkbinary/j2sdk-image \
[2025-08-20T22:42:42.410Z] -J-Dtest.timeout.factor=8.0 \
[2025-08-20T22:42:42.410Z] -J-Dtest.nativepath=/home/jenkins/workspace/Test_openjdk21_hs_extended.openjdk_ppc64_aix_testList_2/jdkbinary/openjdk-test-image/jdk/jtreg/native \
[2025-08-20T22:42:42.410Z] -J-Dtest.root=/home/jenkins/workspace/Test_openjdk21_hs_extended.openjdk_ppc64_aix_testList_2/aqa-tests/openjdk/openjdk-jdk/test/jdk \
[2025-08-20T22:42:42.410Z] -J-Dtest.name=java/net/CookieHandler/B6644726.java \
[2025-08-20T22:42:42.410Z] -J-Dtest.file=/home/jenkins/workspace/Test_openjdk21_hs_extended.openjdk_ppc64_aix_testList_2/aqa-tests/openjdk/openjdk-jdk/test/jdk/java/net/CookieHandler/B6644726.java \
[2025-08-20T22:42:42.410Z] -J-Dtest.src=/home/jenkins/workspace/Test_openjdk21_hs_extended.openjdk_ppc64_aix_testList_2/aqa-tests/openjdk/openjdk-jdk/test/jdk/java/net/CookieHandler \
[2025-08-20T22:42:42.410Z] -J-Dtest.src.path=/home/jenkins/workspace/Test_openjdk21_hs_extended.openjdk_ppc64_aix_testList_2/aqa-tests/openjdk/openjdk-jdk/test/jdk/java/net/CookieHandler \
[2025-08-20T22:42:42.410Z] -J-Dtest.classes=/home/jenkins/workspace/Test_openjdk21_hs_extended.openjdk_ppc64_aix_testList_2/aqa-tests/TKG/output_17557289531492/jdk_net_0/work/classes/java/net/CookieHandler/B6644726.d \
[2025-08-20T22:42:42.410Z] -J-Dtest.class.path=/home/jenkins/workspace/Test_openjdk21_hs_extended.openjdk_ppc64_aix_testList_2/aqa-tests/TKG/output_17557289531492/jdk_net_0/work/classes/java/net/CookieHandler/B6644726.d \
[2025-08-20T22:42:42.410Z] -J-Dtest.class.path.prefix=/home/jenkins/workspace/Test_openjdk21_hs_extended.openjdk_ppc64_aix_testList_2/aqa-tests/TKG/output_17557289531492/jdk_net_0/work/classes/java/net/CookieHandler/B6644726.d:/home/jenkins/workspace/Test_openjdk21_hs_extended.openjdk_ppc64_aix_testList_2/aqa-tests/openjdk/openjdk-jdk/test/jdk/java/net/CookieHandler \
[2025-08-20T22:42:42.410Z] -d /home/jenkins/workspace/Test_openjdk21_hs_extended.openjdk_ppc64_aix_testList_2/aqa-tests/TKG/output_17557289531492/jdk_net_0/work/classes/java/net/CookieHandler/B6644726.d \
[2025-08-20T22:42:42.410Z] -sourcepath /home/jenkins/workspace/Test_openjdk21_hs_extended.openjdk_ppc64_aix_testList_2/aqa-tests/openjdk/openjdk-jdk/test/jdk/java/net/CookieHandler \
[2025-08-20T22:42:42.410Z] -classpath /home/jenkins/workspace/Test_openjdk21_hs_extended.openjdk_ppc64_aix_testList_2/aqa-tests/openjdk/openjdk-jdk/test/jdk/java/net/CookieHandler:/home/jenkins/workspace/Test_openjdk21_hs_extended.openjdk_ppc64_aix_testList_2/aqa-tests/TKG/output_17557289531492/jdk_net_0/work/classes/java/net/CookieHandler/B6644726.d /home/jenkins/workspace/Test_openjdk21_hs_extended.openjdk_ppc64_aix_testList_2/aqa-tests/openjdk/openjdk-jdk/test/jdk/java/net/CookieHandler/B6644726.java
[2025-08-20T22:42:42.410Z]
[2025-08-20T22:42:42.410Z] ACTION: main -- Failed. Execution failed: `main' threw exception: java.lang.RuntimeException: Should have 5 cookies. Got only 3, expires probably didn't parse correctly
[2025-08-20T22:42:42.410Z] REASON: Assumed action based on file name: run main B6644726
[2025-08-20T22:42:42.410Z] TIME: 0.394 seconds
[2025-08-20T22:42:42.411Z] messages:
[2025-08-20T22:42:42.411Z] command: main B6644726
[2025-08-20T22:42:42.411Z] reason: Assumed action based on file name: run main B6644726
[2025-08-20T22:42:42.411Z] started: Wed Aug 20 22:42:38 UTC 2025
[2025-08-20T22:42:42.411Z] Mode: agentvm
[2025-08-20T22:42:42.411Z] Agent id: 8
[2025-08-20T22:42:42.411Z] finished: Wed Aug 20 22:42:38 UTC 2025
[2025-08-20T22:42:42.411Z] elapsed time (seconds): 0.394
[2025-08-20T22:42:42.411Z] configuration:
[2025-08-20T22:42:42.411Z] Boot Layer
[2025-08-20T22:42:42.411Z] class path: /home/jenkins/workspace/Test_openjdk21_hs_extended.openjdk_ppc64_aix_testList_2/jvmtest/openjdk/jtreg/lib/javatest.jar
[2025-08-20T22:42:42.411Z] /home/jenkins/workspace/Test_openjdk21_hs_extended.openjdk_ppc64_aix_testList_2/jvmtest/openjdk/jtreg/lib/jtreg.jar
[2025-08-20T22:42:42.411Z] /home/jenkins/workspace/Test_openjdk21_hs_extended.openjdk_ppc64_aix_testList_2/jvmtest/openjdk/jtreg/lib/junit-platform-console-standalone-1.9.2.jar
[2025-08-20T22:42:42.411Z] /home/jenkins/workspace/Test_openjdk21_hs_extended.openjdk_ppc64_aix_testList_2/jvmtest/openjdk/jtreg/lib/testng-7.3.0.jar
[2025-08-20T22:42:42.411Z] /home/jenkins/workspace/Test_openjdk21_hs_extended.openjdk_ppc64_aix_testList_2/jvmtest/openjdk/jtreg/lib/guice-5.1.0.jar
[2025-08-20T22:42:42.411Z] /home/jenkins/workspace/Test_openjdk21_hs_extended.openjdk_ppc64_aix_testList_2/jvmtest/openjdk/jtreg/lib/jcommander-1.82.jar
[2025-08-20T22:42:42.411Z] patch: java.base /home/jenkins/workspace/Test_openjdk21_hs_extended.openjdk_ppc64_aix_testList_2/aqa-tests/TKG/output_17557289531492/jdk_net_0/work/patches/java.base
[2025-08-20T22:42:42.411Z]
[2025-08-20T22:42:42.411Z] Test Layer
[2025-08-20T22:42:42.411Z] class path: /home/jenkins/workspace/Test_openjdk21_hs_extended.openjdk_ppc64_aix_testList_2/aqa-tests/TKG/output_17557289531492/jdk_net_0/work/classes/java/net/CookieHandler/B6644726.d
[2025-08-20T22:42:42.411Z] /home/jenkins/workspace/Test_openjdk21_hs_extended.openjdk_ppc64_aix_testList_2/aqa-tests/openjdk/openjdk-jdk/test/jdk/java/net/CookieHandler
[2025-08-20T22:42:42.411Z]
[2025-08-20T22:42:42.411Z] rerun:
[2025-08-20T22:42:42.411Z] cd /home/jenkins/workspace/Test_openjdk21_hs_extended.openjdk_ppc64_aix_testList_2/aqa-tests/TKG/output_17557289531492/jdk_net_0/work/scratch && \
[2025-08-20T22:42:42.411Z] DISPLAY=unix:0 \
[2025-08-20T22:42:42.411Z] HOME=/home/jenkins \
[2025-08-20T22:42:42.411Z] LANG=en_US \
[2025-08-20T22:42:42.411Z] PATH=/bin:/usr/bin:/usr/sbin \
[2025-08-20T22:42:42.411Z] TZ=CUT0 \
[2025-08-20T22:42:42.411Z] /home/jenkins/workspace/Test_openjdk21_hs_extended.openjdk_ppc64_aix_testList_2/jdkbinary/j2sdk-image/bin/java \
[2025-08-20T22:42:42.411Z] -Dtest.vm.opts='-ea -esa -Xmx512m -XX:+UseCompressedOops' \
[2025-08-20T22:42:42.411Z] -Dtest.tool.vm.opts='-J-ea -J-esa -J-Xmx512m -J-XX:+UseCompressedOops' \
[2025-08-20T22:42:42.411Z] -Dtest.compiler.opts= \
[2025-08-20T22:42:42.411Z] -Dtest.java.opts= \
[2025-08-20T22:42:42.411Z] -Dtest.jdk=/home/jenkins/workspace/Test_openjdk21_hs_extended.openjdk_ppc64_aix_testList_2/jdkbinary/j2sdk-image \
[2025-08-20T22:42:42.411Z] -Dcompile.jdk=/home/jenkins/workspace/Test_openjdk21_hs_extended.openjdk_ppc64_aix_testList_2/jdkbinary/j2sdk-image \
[2025-08-20T22:42:42.411Z] -Dtest.timeout.factor=8.0 \
[2025-08-20T22:42:42.411Z] -Dtest.nativepath=/home/jenkins/workspace/Test_openjdk21_hs_extended.openjdk_ppc64_aix_testList_2/jdkbinary/openjdk-test-image/jdk/jtreg/native \
[2025-08-20T22:42:42.411Z] -Dtest.root=/home/jenkins/workspace/Test_openjdk21_hs_extended.openjdk_ppc64_aix_testList_2/aqa-tests/openjdk/openjdk-jdk/test/jdk \
[2025-08-20T22:42:42.411Z] -Dtest.name=java/net/CookieHandler/B6644726.java \
[2025-08-20T22:42:42.411Z] -Dtest.file=/home/jenkins/workspace/Test_openjdk21_hs_extended.openjdk_ppc64_aix_testList_2/aqa-tests/openjdk/openjdk-jdk/test/jdk/java/net/CookieHandler/B6644726.java \
[2025-08-20T22:42:42.411Z] -Dtest.src=/home/jenkins/workspace/Test_openjdk21_hs_extended.openjdk_ppc64_aix_testList_2/aqa-tests/openjdk/openjdk-jdk/test/jdk/java/net/CookieHandler \
[2025-08-20T22:42:42.411Z] -Dtest.src.path=/home/jenkins/workspace/Test_openjdk21_hs_extended.openjdk_ppc64_aix_testList_2/aqa-tests/openjdk/openjdk-jdk/test/jdk/java/net/CookieHandler \
[2025-08-20T22:42:42.411Z] -Dtest.classes=/home/jenkins/workspace/Test_openjdk21_hs_extended.openjdk_ppc64_aix_testList_2/aqa-tests/TKG/output_17557289531492/jdk_net_0/work/classes/java/net/CookieHandler/B6644726.d \
[2025-08-20T22:42:42.411Z] -Dtest.class.path=/home/jenkins/workspace/Test_openjdk21_hs_extended.openjdk_ppc64_aix_testList_2/aqa-tests/TKG/output_17557289531492/jdk_net_0/work/classes/java/net/CookieHandler/B6644726.d \
[2025-08-20T22:42:42.411Z] -Dtest.class.path.prefix=/home/jenkins/workspace/Test_openjdk21_hs_extended.openjdk_ppc64_aix_testList_2/aqa-tests/TKG/output_17557289531492/jdk_net_0/work/classes/java/net/CookieHandler/B6644726.d:/home/jenkins/workspace/Test_openjdk21_hs_extended.openjdk_ppc64_aix_testList_2/aqa-tests/openjdk/openjdk-jdk/test/jdk/java/net/CookieHandler \
[2025-08-20T22:42:42.411Z] -classpath /home/jenkins/workspace/Test_openjdk21_hs_extended.openjdk_ppc64_aix_testList_2/aqa-tests/TKG/output_17557289531492/jdk_net_0/work/classes/java/net/CookieHandler/B6644726.d:/home/jenkins/workspace/Test_openjdk21_hs_extended.openjdk_ppc64_aix_testList_2/aqa-tests/openjdk/openjdk-jdk/test/jdk/java/net/CookieHandler:/home/jenkins/workspace/Test_openjdk21_hs_extended.openjdk_ppc64_aix_testList_2/jvmtest/openjdk/jtreg/lib/javatest.jar:/home/jenkins/workspace/Test_openjdk21_hs_extended.openjdk_ppc64_aix_testList_2/jvmtest/openjdk/jtreg/lib/jtreg.jar \
[2025-08-20T22:42:42.411Z] B6644726
[2025-08-20T22:42:42.411Z] STDERR:
[2025-08-20T22:42:42.411Z] java.lang.RuntimeException: Should have 5 cookies. Got only 3, expires probably didn't parse correctly
[2025-08-20T22:42:42.411Z] at B6644726.fail(B6644726.java:209)
[2025-08-20T22:42:42.411Z] at B6644726.testCookieStore(B6644726.java:67)
[2025-08-20T22:42:42.411Z] at B6644726.main(B6644726.java:35)
[2025-08-20T22:42:42.411Z] at java.base/jdk.internal.reflect.DirectMethodHandleAccessor.invoke(DirectMethodHandleAccessor.java:103)
[2025-08-20T22:42:42.411Z] at java.base/java.lang.reflect.Method.invoke(Method.java:580)
[2025-08-20T22:42:42.411Z] at com.sun.javatest.regtest.agent.MainActionHelper$AgentVMRunnable.run(MainActionHelper.java:333)
[2025-08-20T22:42:42.411Z] at java.base/java.lang.Thread.run(Thread.java:1583)
[2025-08-20T22:42:42.411Z]
[2025-08-20T22:42:42.411Z] JavaTest Message: Test threw exception: java.lang.RuntimeException
[2025-08-20T22:42:42.411Z] JavaTest Message: shutting down test
[2025-08-20T22:42:42.411Z]
[2025-08-20T22:42:42.411Z]
[2025-08-20T22:42:42.411Z] TEST RESULT: Failed. Execution failed: `main' threw exception: java.lang.RuntimeException: Should have 5 cookies. Got only 3, expires probably didn't parse correctly
[2025-08-20T22:42:42.411Z] --------------------------------------------------
[2025-08-21T00:07:08.890Z] Test results: passed: 872; failed: 1
[2025-08-21T00:07:31.136Z] Report written to /home/jenkins/workspace/Test_openjdk21_hs_extended.openjdk_ppc64_aix_testList_2/aqa-tests/TKG/output_17557289531492/jdk_net_0/report/html/report.html
[2025-08-21T00:07:31.136Z] Results written to /home/jenkins/workspace/Test_openjdk21_hs_extended.openjdk_ppc64_aix_testList_2/aqa-tests/TKG/output_17557289531492/jdk_net_0/work
[2025-08-21T00:07:31.136Z] Error: Some tests failed or other problems occurred.
[2025-08-21T00:07:31.136Z] -----------------------------------
[2025-08-21T00:07:31.136Z] jdk_net_0_FAILED
[2025-08-21T00:07:31.136Z] -----------------------------------
[2025-08-21T00:07:31.136Z]
[2025-08-21T00:07:31.136Z] TEST TEARDOWN:
[2025-08-21T00:07:31.136Z] Nothing to be done for teardown.
[2025-08-21T00:07:31.136Z] jdk_net_0 Finish Time: Thu Aug 21 00:07:29 2025 Epoch Time (ms): 1755734849673