Post Test
[2025-08-02T08:56:16.817Z] make[3]: Leaving directory '/home/jenkins/workspace/Test_openjdk11_hs_sanity.openjdk_x86-64_alpine-linux_rerun/aqa-tests/openjdk'
[2025-08-02T08:56:16.817Z] make[2]: Leaving directory '/home/jenkins/workspace/Test_openjdk11_hs_sanity.openjdk_x86-64_alpine-linux_rerun/aqa-tests'
[2025-08-02T08:56:16.817Z]
[2025-08-02T08:56:16.817Z]
[2025-08-02T08:56:16.817Z] All tests finished, run result summary:
[2025-08-02T08:56:16.817Z] cd "/home/jenkins/workspace/Test_openjdk11_hs_sanity.openjdk_x86-64_alpine-linux_rerun/aqa-tests/TKG/../TKG/scripts"; \
[2025-08-02T08:56:16.817Z] perl "resultsSum.pl" --failuremk="/home/jenkins/workspace/Test_openjdk11_hs_sanity.openjdk_x86-64_alpine-linux_rerun/aqa-tests/TKG/../TKG/failedtargets.mk" --resultFile="/home/jenkins/workspace/Test_openjdk11_hs_sanity.openjdk_x86-64_alpine-linux_rerun/aqa-tests/TKG/../TKG/output_17541249742740/TestTargetResult" --platFile="/home/jenkins/workspace/Test_openjdk11_hs_sanity.openjdk_x86-64_alpine-linux_rerun/aqa-tests/TKG/../TKG/resources/buildPlatformMap.properties" --diagnostic=failure --jdkVersion=11 --jdkImpl=hotspot --jdkVendor="eclipse" --spec=alpine-linux_x86-64 --buildList=openjdk --customTarget="tools/pack200/Pack200Props.java " --testTarget=hotspot_custom --tapPath=/home/jenkins/workspace/Test_openjdk11_hs_sanity.openjdk_x86-64_alpine-linux_rerun/aqa-tests/TKG/../TKG/output_17541249742740/ --tapName=Test_openjdk11_hs_sanity.openjdk_x86-64_alpine-linux_rerun.tap --comment=""
[2025-08-02T08:56:16.817Z]
[2025-08-02T08:56:16.817Z]
[2025-08-02T08:56:16.817Z] TEST TARGETS SUMMARY
[2025-08-02T08:56:16.817Z] ++++++++++++++++++++++++++++++++++++++++++++++++++++++++++++++++++++++++++
[2025-08-02T08:56:16.817Z] FAILED test targets:
[2025-08-02T08:56:16.817Z] hotspot_custom_0
[2025-08-02T08:56:16.817Z]
[2025-08-02T08:56:16.817Z] TOTAL: 1 EXECUTED: 1 PASSED: 0 FAILED: 1 DISABLED: 0 SKIPPED: 0
[2025-08-02T08:56:16.817Z] ++++++++++++++++++++++++++++++++++++++++++++++++++++++++++++++++++++++++++
[2025-08-02T08:56:16.817Z]
[2025-08-02T08:56:16.817Z] make[1]: *** [settings.mk:454: resultsSummary] Error 2
[2025-08-02T08:56:16.817Z] make[1]: Leaving directory '/home/jenkins/workspace/Test_openjdk11_hs_sanity.openjdk_x86-64_alpine-linux_rerun/aqa-tests/TKG'
[2025-08-02T08:56:16.817Z] make: *** [makefile:62: _hotspot_custom] Error 2
[Pipeline] sh
[2025-08-02T08:56:18.765Z] + uname
[2025-08-02T08:56:18.765Z] + '[' Linux '=' AIX ]
[2025-08-02T08:56:18.765Z] + uname
[2025-08-02T08:56:18.765Z] + '[' Linux '=' SunOS ]
[2025-08-02T08:56:18.765Z] + uname
[2025-08-02T08:56:18.765Z] + '[' Linux '=' '*BSD' ]
[2025-08-02T08:56:18.765Z] + MAKE=make
[2025-08-02T08:56:18.765Z] + make -f ./aqa-tests/TKG/testEnv.mk testEnvTeardown
[2025-08-02T08:56:18.765Z] make: Nothing to be done for 'testEnvTeardown'.
[Pipeline] }
[2025-08-02T08:56:19.216Z] $ ssh-agent -k
[2025-08-02T08:56:19.224Z] unset SSH_AUTH_SOCK;
[2025-08-02T08:56:19.224Z] unset SSH_AGENT_PID;
[2025-08-02T08:56:19.224Z] echo Agent pid 3454985 killed;
[2025-08-02T08:56:19.829Z] [ssh-agent] Stopped.
[Pipeline] // sshagent
[Pipeline] }
[2025-08-02T08:56:19.865Z] Xvfb stopping
[Pipeline] // wrap
[Pipeline] echo
[2025-08-02T08:56:20.329Z] There were test failures, current build status is UNSTABLE.
[Pipeline] }
[Pipeline] // stage
[Pipeline] stage
[Pipeline] { (Post)
[Pipeline] echo
[2025-08-02T08:56:20.436Z] Saving aqa-tests/testenv/testenv.properties file on jenkins.
[Pipeline] archiveArtifacts
[2025-08-02T08:56:20.578Z] Archiving artifacts
[2025-08-02T08:56:20.844Z] Recording fingerprints
[Pipeline] echo
[2025-08-02T08:56:20.996Z] Saving aqa-tests/TKG/**/*.tap file on jenkins.
[Pipeline] archiveArtifacts
[2025-08-02T08:56:21.138Z] Archiving artifacts
[2025-08-02T08:56:21.404Z] Recording fingerprints
[Pipeline] sh
[2025-08-02T08:56:22.999Z] + tar -cf - ./aqa-tests/TKG/output_17541249742740
[2025-08-02T08:56:22.999Z] + pigz -9
[2025-08-02T08:56:22.999Z] + gzip -9
[Pipeline] echo
[2025-08-02T08:56:23.397Z] ARTIFACTORY_SERVER is not set. Saving artifacts on jenkins.
[Pipeline] archiveArtifacts
[2025-08-02T08:56:23.541Z] Archiving artifacts
[2025-08-02T08:56:23.805Z] Recording fingerprints
[Pipeline] findFiles
[Pipeline] echo
[2025-08-02T08:56:27.411Z] Tap file found: aqa-tests/TKG/output_17541249742740/Test_openjdk11_hs_sanity.openjdk_x86-64_alpine-linux_rerun.tap...
[Pipeline] readFile
[Pipeline] junit
[2025-08-02T08:56:27.715Z] Recording test results
[2025-08-02T08:56:30.362Z] None of the test reports contained any result
[2025-08-02T08:56:30.363Z] [Checks API] No suitable checks publisher found.
[Pipeline] }
[Pipeline] // stage
[Pipeline] echo
[2025-08-02T08:56:30.403Z] PROCESSCATCH: Terminating any hung/left over test processes:
[Pipeline] sh
[2025-08-02T08:56:30.268Z] No test report files were found. Configuration error?
[2025-08-02T08:56:31.971Z] + aqa-tests/terminateTestProcesses.sh jenkins
[2025-08-02T08:56:31.971Z] Unix type machine..
[2025-08-02T08:56:31.971Z] Running on a Linux host
[2025-08-02T08:56:31.971Z] Woohoo - no rogue processes detected!
[Pipeline] cleanWs
[2025-08-02T08:56:32.632Z] [WS-CLEANUP] Deleting project workspace...
[2025-08-02T08:56:32.632Z] [WS-CLEANUP] Deferred wipeout is disabled by the job configuration...
[2025-08-02T08:56:44.631Z] [WS-CLEANUP] done
[Pipeline] sh
[2025-08-02T08:56:46.310Z] + find /tmp -name '*core*' -print -exec rm -f '{}' ';'
[Pipeline] }
[Pipeline] // timeout
[Pipeline] timeout
[2025-08-02T08:56:46.728Z] Timeout set to expire in 5 min 0 sec
[Pipeline] {
[Pipeline] }
[Pipeline] // timeout
[Pipeline] }
[Pipeline] // node
[Pipeline] }
[Pipeline] // stage
[Pipeline] echo
[2025-08-02T08:56:46.854Z] None paralle and after rerun job status is UNSTABLE
[Pipeline] }
[Pipeline] // timestamps
[Pipeline] End of Pipeline
Finished: UNSTABLE