DBBLoadTest_5m_1
[2025-07-15T13:31:35.653Z] Running test DBBLoadTest_5m_1 ...
[2025-07-15T13:31:35.653Z] ===============================================
[2025-07-15T13:31:35.653Z] DBBLoadTest_5m_1 Start Time: Tue Jul 15 08:31:35 2025 Epoch Time (ms): 1752586295411
[2025-07-15T13:31:35.653Z] variation: Mode650
[2025-07-15T13:31:35.653Z] JVM_OPTIONS: -XX:-UseCompressedOops
[2025-07-15T13:31:35.653Z] { \
[2025-07-15T13:31:35.653Z] echo ""; echo "TEST SETUP:"; \
[2025-07-15T13:31:35.653Z] echo "Nothing to be done for setup."; \
[2025-07-15T13:31:35.653Z] mkdir -p "/home/jenkins/workspace/Test_openjdk11_hs_extended.system_s390x_linux_testList_1/aqa-tests/TKG/../TKG/output_17525859769152/DBBLoadTest_5m_1"; \
[2025-07-15T13:31:35.653Z] cd "/home/jenkins/workspace/Test_openjdk11_hs_extended.system_s390x_linux_testList_1/aqa-tests/TKG/../TKG/output_17525859769152/DBBLoadTest_5m_1"; \
[2025-07-15T13:31:35.653Z] echo ""; echo "TESTING:"; \
[2025-07-15T13:31:35.653Z] perl /home/jenkins/workspace/Test_openjdk11_hs_extended.system_s390x_linux_testList_1/aqa-tests/TKG/../../jvmtest/system/otherLoadTest/..//STF/stf.core/scripts/stf.pl -test-root="/home/jenkins/workspace/Test_openjdk11_hs_extended.system_s390x_linux_testList_1/aqa-tests/TKG/../../jvmtest/system/otherLoadTest/..//STF;/home/jenkins/workspace/Test_openjdk11_hs_extended.system_s390x_linux_testList_1/aqa-tests/TKG/../../jvmtest/system/otherLoadTest/..//aqa-systemtest""" -systemtest-prereqs="/home/jenkins/workspace/Test_openjdk11_hs_extended.system_s390x_linux_testList_1/../../testDependency/system_lib/" -java-args=' -XX:-UseCompressedOops ' -results-root="/home/jenkins/workspace/Test_openjdk11_hs_extended.system_s390x_linux_testList_1/aqa-tests/TKG/../TKG/output_17525859769152/DBBLoadTest_5m_1" -test=DirectByteBufferLoadTest -test-args="timeLimit=5m"; \
[2025-07-15T13:31:35.653Z] if [ $? -eq 0 ]; then echo "-----------------------------------"; echo "DBBLoadTest_5m_1""_PASSED"; echo "-----------------------------------"; cd /home/jenkins/workspace/Test_openjdk11_hs_extended.system_s390x_linux_testList_1/aqa-tests/TKG/..; rm -f -r "/home/jenkins/workspace/Test_openjdk11_hs_extended.system_s390x_linux_testList_1/aqa-tests/TKG/../TKG/output_17525859769152/DBBLoadTest_5m_1"; else echo "-----------------------------------"; echo "DBBLoadTest_5m_1""_FAILED"; echo "-----------------------------------"; fi; \
[2025-07-15T13:31:35.653Z] echo ""; echo "TEST TEARDOWN:"; \
[2025-07-15T13:31:35.653Z] echo "Nothing to be done for teardown."; \
[2025-07-15T13:31:35.653Z] } 2>&1 | tee -a "/home/jenkins/workspace/Test_openjdk11_hs_extended.system_s390x_linux_testList_1/aqa-tests/TKG/../TKG/output_17525859769152/TestTargetResult";
[2025-07-15T13:31:35.653Z]
[2025-07-15T13:31:35.653Z] TEST SETUP:
[2025-07-15T13:31:35.653Z] Nothing to be done for setup.
[2025-07-15T13:31:35.653Z]
[2025-07-15T13:31:35.653Z] TESTING:
[2025-07-15T13:31:35.653Z] STF 08:31:35.459 - ========================= S T F =========================
[2025-07-15T13:31:35.653Z] systemtest-prereqs has been processed, and set to: /home/jenkins/testDependency/system_libRetrieving amount of free space on drive containing /home/jenkins/workspace/Test_openjdk11_hs_extended.system_s390x_linux_testList_1/aqa-tests/TKG/../TKG/output_17525859769152/DBBLoadTest_5m_1
[2025-07-15T13:31:35.653Z] There is 59837 Mb free
[2025-07-15T13:31:35.653Z] STF 08:31:35.464 - ================== G E N E R A T I O N ==================
[2025-07-15T13:31:35.653Z] STF 08:31:35.465 - Checking JVM: /home/jenkins/workspace/Test_openjdk11_hs_extended.system_s390x_linux_testList_1/jdkbinary/j2sdk-image
[2025-07-15T13:31:35.654Z] STF 08:31:35.465 - Starting process to generate scripts: /home/jenkins/workspace/Test_openjdk11_hs_extended.system_s390x_linux_testList_1/jdkbinary/j2sdk-image/bin/java -Dlog4j.skipJansi=true -Djava.system.class.loader=net.adoptopenjdk.stf.runner.StfClassLoader -Dload.agent.path=/home/jenkins/workspace/Test_openjdk11_hs_extended.system_s390x_linux_testList_1/jvmtest/system/STF/stf.core/scripts/../../stf.load/bin/stf.load.jar -classpath /home/jenkins/workspace/Test_openjdk11_hs_extended.system_s390x_linux_testList_1/../../testDependency/system_lib//asm/asm.jar:/home/jenkins/workspace/Test_openjdk11_hs_extended.system_s390x_linux_testList_1/../../testDependency/system_lib//asm/asm-commons.jar:/home/jenkins/workspace/Test_openjdk11_hs_extended.system_s390x_linux_testList_1/../../testDependency/system_lib//log4j/log4j-api.jar:/home/jenkins/workspace/Test_openjdk11_hs_extended.system_s390x_linux_testList_1/../../testDependency/system_lib//log4j/log4j-core.jar:/home/jenkins/workspace/Test_openjdk11_hs_extended.system_s390x_linux_testList_1/jvmtest/system/STF/stf.core/scripts/../bin net.adoptopenjdk.stf.runner.StfRunner -properties "/home/jenkins/workspace/Test_openjdk11_hs_extended.system_s390x_linux_testList_1/aqa-tests/TKG/../TKG/output_17525859769152/DBBLoadTest_5m_1/20250715-083135-DirectByteBufferLoadTest/stf_parameters.properties, , /home/jenkins/workspace/Test_openjdk11_hs_extended.system_s390x_linux_testList_1/jvmtest/system/STF/stf.core/config/stf.properties" -testDir "/home/jenkins/workspace/Test_openjdk11_hs_extended.system_s390x_linux_testList_1/aqa-tests/TKG/../TKG/output_17525859769152/DBBLoadTest_5m_1/20250715-083135-DirectByteBufferLoadTest"
[2025-07-15T13:31:37.707Z] GEN 08:31:37.137 - Found test. Project: 'openjdk.test.load' class: 'DirectByteBufferLoadTest.class' Dir: '/home/jenkins/workspace/Test_openjdk11_hs_extended.system_s390x_linux_testList_1/jvmtest/system/aqa-systemtest/openjdk.test.load/bin'
[2025-07-15T13:31:37.707Z] GEN 08:31:37.149 - Found test. Project: 'openjdk.test.load' class: 'net.adoptopenjdk.stf.DirectByteBufferLoadTest'
[2025-07-15T13:31:37.707Z] GEN Classpath directories used by project 'openjdk.test.load':
[2025-07-15T13:31:37.707Z] GEN /home/jenkins/workspace/Test_openjdk11_hs_extended.system_s390x_linux_testList_1/jvmtest/system/aqa-systemtest/openjdk.test.load/bin
[2025-07-15T13:31:37.707Z] GEN /home/jenkins/workspace/Test_openjdk11_hs_extended.system_s390x_linux_testList_1/jvmtest/system/STF/stf.core/bin
[2025-07-15T13:31:37.707Z] GEN /home/jenkins/workspace/Test_openjdk11_hs_extended.system_s390x_linux_testList_1/jvmtest/system/STF/stf.load/bin
[2025-07-15T13:31:37.707Z] GEN /home/jenkins/testDependency/system_lib/log4j/log4j-api.jar
[2025-07-15T13:31:37.707Z] GEN /home/jenkins/testDependency/system_lib/log4j/log4j-core.jar
[2025-07-15T13:31:37.707Z] GEN /home/jenkins/testDependency/system_lib/junit/junit.jar
[2025-07-15T13:31:37.707Z] GEN /home/jenkins/testDependency/system_lib/junit/hamcrest-core.jar
[2025-07-15T13:31:37.707Z] GEN 08:31:37.375 - Using Mode NoOptions. Values = ''
[2025-07-15T13:31:37.707Z] GEN 08:31:37.503 -
[2025-07-15T13:31:37.707Z] GEN 08:31:37.504 - Test command summary:
[2025-07-15T13:31:37.707Z] GEN 08:31:37.504 - Step Stage Command Description
[2025-07-15T13:31:37.707Z] GEN 08:31:37.505 - -----+--------+-----------------+------------
[2025-07-15T13:31:37.707Z] GEN 08:31:37.505 - 1 execute Run java Run DirectByteBuffer load test
[2025-07-15T13:31:37.707Z] STF 08:31:37.600 -
[2025-07-15T13:31:37.707Z] STF 08:31:37.600 - Script generation completed
[2025-07-15T13:31:37.707Z] STF 08:31:37.600 -
[2025-07-15T13:31:37.707Z] STF 08:31:37.601 -
[2025-07-15T13:31:37.707Z] STF 08:31:37.601 - ======================= S E T U P =======================
[2025-07-15T13:31:37.707Z] STF 08:31:37.601 - Running setup: perl /home/jenkins/workspace/Test_openjdk11_hs_extended.system_s390x_linux_testList_1/aqa-tests/TKG/../TKG/output_17525859769152/DBBLoadTest_5m_1/20250715-083135-DirectByteBufferLoadTest/setUp.pl
[2025-07-15T13:31:37.707Z] STF 08:31:37.644 - SETUP stage completed
[2025-07-15T13:31:37.707Z] STF 08:31:37.647 -
[2025-07-15T13:31:37.707Z] STF 08:31:37.647 - ==================== E X E C U T E - ====================
[2025-07-15T13:31:37.707Z] STF 08:31:37.647 - Running execute: perl /home/jenkins/workspace/Test_openjdk11_hs_extended.system_s390x_linux_testList_1/aqa-tests/TKG/../TKG/output_17525859769152/DBBLoadTest_5m_1/20250715-083135-DirectByteBufferLoadTest/execute.pl
[2025-07-15T13:31:38.407Z] STF 08:31:37.688 -
[2025-07-15T13:31:38.407Z] STF 08:31:37.688 - Java version
[2025-07-15T13:31:38.407Z] STF 08:31:37.688 - Running: /home/jenkins/workspace/Test_openjdk11_hs_extended.system_s390x_linux_testList_1/jdkbinary/j2sdk-image/bin/java -version
[2025-07-15T13:31:38.407Z] openjdk version "11.0.28" 2025-07-15
[2025-07-15T13:31:38.407Z] OpenJDK Runtime Environment Temurin-11.0.28+4 (build 11.0.28+4)
[2025-07-15T13:31:38.407Z] OpenJDK 64-Bit Server VM Temurin-11.0.28+4 (build 11.0.28+4, mixed mode)
[2025-07-15T13:31:38.407Z] STF 08:31:37.816 -
[2025-07-15T13:31:38.407Z] STF 08:31:37.816 - +------ Step 1 - Run DirectByteBuffer load test
[2025-07-15T13:31:38.407Z] STF 08:31:37.816 - | Run foreground process
[2025-07-15T13:31:38.407Z] STF 08:31:37.816 - | Program: /home/jenkins/workspace/Test_openjdk11_hs_extended.system_s390x_linux_testList_1/jdkbinary/j2sdk-image/bin/java
[2025-07-15T13:31:38.407Z] STF 08:31:37.816 - | Mnemonic: DBLT
[2025-07-15T13:31:38.407Z] STF 08:31:37.816 - | Echo: ECHO_ON
[2025-07-15T13:31:38.407Z] STF 08:31:37.816 - | Expectation: CLEAN_RUN within 1h5m
[2025-07-15T13:31:38.407Z] STF 08:31:37.816 - |
[2025-07-15T13:31:38.407Z] STF 08:31:37.817 - Running command: /home/jenkins/workspace/Test_openjdk11_hs_extended.system_s390x_linux_testList_1/jdkbinary/j2sdk-image/bin/java -javaagent:/home/jenkins/workspace/Test_openjdk11_hs_extended.system_s390x_linux_testList_1/jvmtest/system/STF/stf.core/scripts/../../stf.load/bin/stf.load.jar -Xmx512m -XX:-UseCompressedOops -classpath /home/jenkins/workspace/Test_openjdk11_hs_extended.system_s390x_linux_testList_1/jvmtest/system/STF/stf.load/bin:/home/jenkins/workspace/Test_openjdk11_hs_extended.system_s390x_linux_testList_1/jvmtest/system/STF/stf.core/bin:/home/jenkins/testDependency/system_lib/log4j/log4j-api.jar:/home/jenkins/testDependency/system_lib/log4j/log4j-core.jar:/home/jenkins/testDependency/system_lib/asm/asm.jar:/home/jenkins/testDependency/system_lib/asm/asm-commons.jar:/home/jenkins/testDependency/system_lib/junit/junit.jar:/home/jenkins/testDependency/system_lib/junit/hamcrest-core.jar:/home/jenkins/workspace/Test_openjdk11_hs_extended.system_s390x_linux_testList_1/jvmtest/system/aqa-systemtest/openjdk.test.nio/bin/lib/filesystem.jar:/home/jenkins/workspace/Test_openjdk11_hs_extended.system_s390x_linux_testList_1/jvmtest/system/aqa-systemtest/openjdk.test.gc/bin:/home/jenkins/workspace/Test_openjdk11_hs_extended.system_s390x_linux_testList_1/jvmtest/system/aqa-systemtest/openjdk.test.nio/bin net.adoptopenjdk.loadTest.LoadTest -resultsDir /home/jenkins/workspace/Test_openjdk11_hs_extended.system_s390x_linux_testList_1/aqa-tests/TKG/output_17525859769152/DBBLoadTest_5m_1/20250715-083135-DirectByteBufferLoadTest/results -resultsPrefix 1.DBLT. -timeLimit 5m -reportFailureLimit 1 -abortAtFailureLimit 10 -maxTotalLogFileSpace 200M -maxSingleLogSize 1/25 -suite.DirectByteBuffer.thinkingTime 1ms..1ms -suite.DirectByteBuffer.threadCount 2 -suite.DirectByteBuffer.inventoryFile /home/jenkins/workspace/Test_openjdk11_hs_extended.system_s390x_linux_testList_1/aqa-tests/TKG/output_17525859769152/DBBLoadTest_5m_1/20250715-083135-DirectByteBufferLoadTest/results/1.DBLT.inventory/openjdk.test.load/config/inventories/gc/directByteBuffer.xml -suite.DirectByteBuffer.inventoryExcludeFile none -suite.DirectByteBuffer.selection random -suite.DirectByteBuffer.seed -1 -suite.DirectByteBuffer.repeatCount 1
[2025-07-15T13:31:38.407Z] STF 08:31:37.817 - Redirecting stderr to /home/jenkins/workspace/Test_openjdk11_hs_extended.system_s390x_linux_testList_1/aqa-tests/TKG/output_17525859769152/DBBLoadTest_5m_1/20250715-083135-DirectByteBufferLoadTest/results/1.DBLT.stderr
[2025-07-15T13:31:38.407Z] STF 08:31:37.817 - Redirecting stdout to /home/jenkins/workspace/Test_openjdk11_hs_extended.system_s390x_linux_testList_1/aqa-tests/TKG/output_17525859769152/DBBLoadTest_5m_1/20250715-083135-DirectByteBufferLoadTest/results/1.DBLT.stdout
[2025-07-15T13:31:38.407Z] STF 08:31:37.824 - Monitoring processes: DBLT
[2025-07-15T13:31:40.470Z] DBLT 08:31:40.038 - Load test parameters
[2025-07-15T13:31:40.470Z] DBLT 08:31:40.042 - Time limited = true
[2025-07-15T13:31:40.470Z] DBLT 08:31:40.042 - Time limit = 5m
[2025-07-15T13:31:40.470Z] DBLT 08:31:40.043 - abortIfOutOfMemory = true
[2025-07-15T13:31:40.470Z] DBLT 08:31:40.043 - reportFailureLimit = 1
[2025-07-15T13:31:40.470Z] DBLT 08:31:40.044 - abortAtFailureLimit = 10
[2025-07-15T13:31:40.470Z] DBLT 08:31:40.058 - maxTotalLogFileSpace = 209715200
[2025-07-15T13:31:40.470Z] DBLT 08:31:40.059 - maxSingleLogSize = 8388608
[2025-07-15T13:31:40.470Z] DBLT 08:31:40.059 - Parameters for suite 0
[2025-07-15T13:31:40.470Z] DBLT 08:31:40.060 - Suite name = DirectByteBuffer
[2025-07-15T13:31:40.470Z] DBLT 08:31:40.060 - Number threads = 2
[2025-07-15T13:31:40.470Z] DBLT 08:31:40.061 - Supplied seed = -1
[2025-07-15T13:31:40.470Z] DBLT 08:31:40.062 - Inventory file = /home/jenkins/workspace/Test_openjdk11_hs_extended.system_s390x_linux_testList_1/aqa-tests/TKG/output_17525859769152/DBBLoadTest_5m_1/20250715-083135-DirectByteBufferLoadTest/results/1.DBLT.inventory/openjdk.test.load/config/inventories/gc/directByteBuffer.xml
[2025-07-15T13:31:40.470Z] DBLT 08:31:40.062 - Exclude file = none
[2025-07-15T13:31:40.470Z] DBLT 08:31:40.063 - Number tests = -1
[2025-07-15T13:31:40.470Z] DBLT 08:31:40.063 - Repeat count = 1
[2025-07-15T13:31:40.470Z] DBLT 08:31:40.067 - Thinking time = 1ms..1ms
[2025-07-15T13:31:40.470Z] DBLT 08:31:40.067 - Selection mode = random
[2025-07-15T13:31:40.470Z] DBLT 08:31:40.070 - Actual seed = 1754322617524
[2025-07-15T13:31:40.470Z] DBLT 08:31:40.101 - Parsing inventory file. Root=/home/jenkins/workspace/Test_openjdk11_hs_extended.system_s390x_linux_testList_1/aqa-tests/TKG/output_17525859769152/DBBLoadTest_5m_1/20250715-083135-DirectByteBufferLoadTest/results/1.DBLT.inventory File=openjdk.test.load/config/inventories/gc/directByteBuffer.xml
[2025-07-15T13:31:40.470Z] DBLT 08:31:40.109 - Found included inventory. File=/openjdk.test.load/config/inventories/nio/nio.xml
[2025-07-15T13:31:40.470Z] DBLT 08:31:40.109 - Parsing inventory file. Root=/home/jenkins/workspace/Test_openjdk11_hs_extended.system_s390x_linux_testList_1/aqa-tests/TKG/output_17525859769152/DBBLoadTest_5m_1/20250715-083135-DirectByteBufferLoadTest/results/1.DBLT.inventory File=/openjdk.test.load/config/inventories/nio/nio.xml
[2025-07-15T13:31:40.470Z] DBLT 08:31:40.125 - Final test list:
[2025-07-15T13:31:40.470Z] DBLT 08:31:40.143 - 0 ArbitraryJava[net.adoptopenjdk.test.nio.WordCount run] Weighting=1
[2025-07-15T13:31:40.470Z] DBLT 08:31:40.143 - 1 ArbitraryJava[net.adoptopenjdk.test.nio.NioApp run] Weighting=1
[2025-07-15T13:31:40.470Z] DBLT 08:31:40.143 - 2 ArbitraryJava[net.adoptopenjdk.test.nio.NioBuffers run] Weighting=1
[2025-07-15T13:31:40.470Z] DBLT 08:31:40.143 - 3 ArbitraryJava[net.adoptopenjdk.test.nio.NioBuffersTest run] Weighting=1
[2025-07-15T13:31:40.470Z] DBLT 08:31:40.144 - 4 JUnit[net.adoptopenjdk.test.nio2.asyncio.client.MultipleConnectFutureTest] Weighting=1
[2025-07-15T13:31:40.470Z] DBLT 08:31:40.144 - 5 JUnit[net.adoptopenjdk.test.nio2.asyncio.client.MultipleConnectAsyncTest] Weighting=1
[2025-07-15T13:31:40.470Z] DBLT 08:31:40.144 - 6 JUnit[net.adoptopenjdk.test.nio2.asyncio.client.MultipleReadWriteAsyncTest] Weighting=1
[2025-07-15T13:31:40.470Z] DBLT 08:31:40.145 - 7 JUnit[net.adoptopenjdk.test.nio2.asyncio.client.MultipleReadWriteFutureTest] Weighting=1
[2025-07-15T13:31:40.470Z] DBLT 08:31:40.145 - 8 JUnit[net.adoptopenjdk.test.nio2.asyncio.file.AsynchronousFileChannelTest] Weighting=1
[2025-07-15T13:31:40.470Z] DBLT 08:31:40.145 - 9 JUnit[net.adoptopenjdk.test.nio2.mxbean.ByteBufferMXBeanTest] Weighting=1
[2025-07-15T13:31:40.470Z] DBLT 08:31:40.145 - 10 JUnit[net.adoptopenjdk.test.nio2.filesystem.FileSystemsTest] Weighting=1
[2025-07-15T13:31:40.470Z] DBLT 08:31:40.145 - 11 JUnit[net.adoptopenjdk.test.nio2.path.PathDeleteDirectoryTest] Weighting=1
[2025-07-15T13:31:40.470Z] DBLT 08:31:40.146 - 12 JUnit[net.adoptopenjdk.test.nio2.path.PathDirectoryStreamTest] Weighting=1
[2025-07-15T13:31:40.470Z] DBLT 08:31:40.146 - 13 JUnit[net.adoptopenjdk.test.nio2.path.ScannerTest] Weighting=1
[2025-07-15T13:31:40.470Z] DBLT 08:31:40.146 - 14 JUnit[net.adoptopenjdk.test.nio2.path.WalkFileTreeTest] Weighting=1
[2025-07-15T13:31:40.470Z] DBLT 08:31:40.146 - 15 JUnit[net.adoptopenjdk.test.gc.directbytebuffer.DirectMemoryTest] Weighting=1
[2025-07-15T13:31:40.470Z] DBLT 08:31:40.187 - Starting thread. Suite=0 thread=0
[2025-07-15T13:31:40.470Z] DBLT 08:31:40.195 - Starting thread. Suite=0 thread=1
[2025-07-15T13:31:44.228Z] DBLT 08:31:43.995 - First failure detected by thread: load-0. Not creating dumps as no dump generation is requested for this load test
[2025-07-15T13:31:45.623Z] DBLT 08:31:45.001 - suite.getInventory().getInventoryFileRef(): openjdk.test.load/config/inventories/gc/directByteBuffer.xml
[2025-07-15T13:31:45.623Z] DBLT 08:31:45.001 - suite.isCreateDump() : false
[2025-07-15T13:31:45.623Z] DBLT 08:31:45.037 - Test failed
[2025-07-15T13:31:45.623Z] DBLT Failure num. = 1
[2025-07-15T13:31:45.623Z] DBLT Test number = 5
[2025-07-15T13:31:45.623Z] DBLT Test details = 'JUnit[net.adoptopenjdk.test.nio2.asyncio.client.MultipleConnectAsyncTest]'
[2025-07-15T13:31:45.623Z] DBLT Suite number = 0
[2025-07-15T13:31:45.623Z] DBLT Thread number = 0
[2025-07-15T13:31:45.623Z] DBLT >>> Captured test output >>>
[2025-07-15T13:31:45.623Z] DBLT testStarted : testMultipleSequentialConnect(net.adoptopenjdk.test.nio2.asyncio.client.MultipleConnectAsyncTest)
[2025-07-15T13:31:45.623Z] DBLT MultipleConnectAsyncTest.testMultipleSequentialConnect() creating 3 connections
[2025-07-15T13:31:45.623Z] DBLT testFailure: testMultipleSequentialConnect(net.adoptopenjdk.test.nio2.asyncio.client.MultipleConnectAsyncTest): [Failed Assertion Exceptions:
[2025-07-15T13:31:45.623Z] DBLT net.adoptopenjdk.test.nio2.util.AssertionFailedException: java.net.NoRouteToHostException: No route to host
[2025-07-15T13:31:45.623Z] DBLT at net.adoptopenjdk.test.nio2.asyncio.client.MultipleConnectAsyncTest$1.failed(MultipleConnectAsyncTest.java:124)
[2025-07-15T13:31:45.623Z] DBLT at net.adoptopenjdk.test.nio2.asyncio.client.MultipleConnectAsyncTest$1.failed(MultipleConnectAsyncTest.java:84)
[2025-07-15T13:31:45.623Z] DBLT at java.base/sun.nio.ch.Invoker.invokeUnchecked(Invoker.java:129)
[2025-07-15T13:31:45.623Z] DBLT at java.base/sun.nio.ch.UnixAsynchronousSocketChannelImpl.finishConnect(UnixAsynchronousSocketChannelImpl.java:283)
[2025-07-15T13:31:45.623Z] DBLT at java.base/sun.nio.ch.UnixAsynchronousSocketChannelImpl.finish(UnixAsynchronousSocketChannelImpl.java:198)
[2025-07-15T13:31:45.623Z] DBLT at java.base/sun.nio.ch.UnixAsynchronousSocketChannelImpl.onEvent(UnixAsynchronousSocketChannelImpl.java:213)
[2025-07-15T13:31:45.623Z] DBLT at java.base/sun.nio.ch.EPollPort$EventHandlerTask.run(EPollPort.java:306)
[2025-07-15T13:31:45.623Z] DBLT at java.base/sun.nio.ch.AsynchronousChannelGroupImpl$1.run(AsynchronousChannelGroupImpl.java:112)
[2025-07-15T13:31:45.623Z] DBLT at java.base/java.util.concurrent.ThreadPoolExecutor.runWorker(ThreadPoolExecutor.java:1128)
[2025-07-15T13:31:45.623Z] DBLT at java.base/java.util.concurrent.ThreadPoolExecutor$Worker.run(ThreadPoolExecutor.java:628)
[2025-07-15T13:31:45.623Z] DBLT at java.base/java.lang.Thread.run(Thread.java:829)
[2025-07-15T13:31:45.623Z] DBLT Caused by: java.net.NoRouteToHostException: No route to host
[2025-07-15T13:31:45.623Z] DBLT at java.base/sun.nio.ch.UnixAsynchronousSocketChannelImpl.checkConnect(Native Method)
[2025-07-15T13:31:45.623Z] DBLT at java.base/sun.nio.ch.UnixAsynchronousSocketChannelImpl.finishConnect(UnixAsynchronousSocketChannelImpl.java:252)
[2025-07-15T13:31:45.623Z] DBLT ... 7 more
[2025-07-15T13:31:45.623Z] DBLT ---
[2025-07-15T13:31:45.623Z] DBLT , Failed Assertion Exceptions:
[2025-07-15T13:31:45.623Z] DBLT net.adoptopenjdk.test.nio2.util.AssertionFailedException: java.net.NoRouteToHostException: No route to host
[2025-07-15T13:31:45.623Z] DBLT at net.adoptopenjdk.test.nio2.asyncio.client.MultipleConnectAsyncTest$1.failed(MultipleConnectAsyncTest.java:124)
[2025-07-15T13:31:45.623Z] DBLT at net.adoptopenjdk.test.nio2.asyncio.client.MultipleConnectAsyncTest$1.failed(MultipleConnectAsyncTest.java:84)
[2025-07-15T13:31:45.623Z] DBLT at java.base/sun.nio.ch.Invoker.invokeUnchecked(Invoker.java:129)
[2025-07-15T13:31:45.623Z] DBLT at java.base/sun.nio.ch.UnixAsynchronousSocketChannelImpl.finishConnect(UnixAsynchronousSocketChannelImpl.java:283)
[2025-07-15T13:31:45.623Z] DBLT at java.base/sun.nio.ch.UnixAsynchronousSocketChannelImpl.finish(UnixAsynchronousSocketChannelImpl.java:198)
[2025-07-15T13:31:45.623Z] DBLT at java.base/sun.nio.ch.UnixAsynchronousSocketChannelImpl.onEvent(UnixAsynchronousSocketChannelImpl.java:213)
[2025-07-15T13:31:45.623Z] DBLT at java.base/sun.nio.ch.EPollPort$EventHandlerTask.run(EPollPort.java:306)
[2025-07-15T13:31:45.623Z] DBLT at java.base/sun.nio.ch.AsynchronousChannelGroupImpl$1.run(AsynchronousChannelGroupImpl.java:112)
[2025-07-15T13:31:45.623Z] DBLT at java.base/java.util.concurrent.ThreadPoolExecutor.runWorker(ThreadPoolExecutor.java:1128)
[2025-07-15T13:31:45.623Z] DBLT at java.base/java.util.concurrent.ThreadPoolExecutor$Worker.run(ThreadPoolExecutor.java:628)
[2025-07-15T13:31:45.623Z] DBLT at java.base/java.lang.Thread.run(Thread.java:829)
[2025-07-15T13:31:45.623Z] DBLT Caused by: java.net.NoRouteToHostException: No route to host
[2025-07-15T13:31:45.623Z] DBLT at java.base/sun.nio.ch.UnixAsynchronousSocketChannelImpl.checkConnect(Native Method)
[2025-07-15T13:31:45.623Z] DBLT at java.base/sun.nio.ch.UnixAsynchronousSocketChannelImpl.finishConnect(UnixAsynchronousSocketChannelImpl.java:252)
[2025-07-15T13:31:45.623Z] DBLT ... 7 more
[2025-07-15T13:31:45.623Z] DBLT ---
[2025-07-15T13:31:45.623Z] DBLT , Failed Assertion Exceptions:
[2025-07-15T13:31:45.623Z] DBLT net.adoptopenjdk.test.nio2.util.AssertionFailedException: java.net.NoRouteToHostException: No route to host
[2025-07-15T13:31:45.623Z] DBLT at net.adoptopenjdk.test.nio2.asyncio.client.MultipleConnectAsyncTest$1.failed(MultipleConnectAsyncTest.java:124)
[2025-07-15T13:31:45.623Z] DBLT at net.adoptopenjdk.test.nio2.asyncio.client.MultipleConnectAsyncTest$1.failed(MultipleConnectAsyncTest.java:84)
[2025-07-15T13:31:45.623Z] DBLT at java.base/sun.nio.ch.Invoker.invokeUnchecked(Invoker.java:129)
[2025-07-15T13:31:45.623Z] DBLT at java.base/sun.nio.ch.Invoker$2.run(Invoker.java:219)
[2025-07-15T13:31:45.623Z] DBLT at java.base/sun.nio.ch.AsynchronousChannelGroupImpl$1.run(AsynchronousChannelGroupImpl.java:112)
[2025-07-15T13:31:45.623Z] DBLT at java.base/java.util.concurrent.ThreadPoolExecutor.runWorker(ThreadPoolExecutor.java:1128)
[2025-07-15T13:31:45.623Z] DBLT at java.base/java.util.concurrent.ThreadPoolExecutor$Worker.run(ThreadPoolExecutor.java:628)
[2025-07-15T13:31:45.623Z] DBLT at java.base/java.lang.Thread.run(Thread.java:829)
[2025-07-15T13:31:45.623Z] DBLT Caused by: java.net.NoRouteToHostException: No route to host
[2025-07-15T13:31:45.623Z] DBLT at java.base/sun.nio.ch.UnixAsynchronousSocketChannelImpl.checkConnect(Native Method)
[2025-07-15T13:31:45.623Z] DBLT at java.base/sun.nio.ch.UnixAsynchronousSocketChannelImpl.finishConnect(UnixAsynchronousSocketChannelImpl.java:252)
[2025-07-15T13:31:45.623Z] DBLT at java.base/sun.nio.ch.UnixAsynchronousSocketChannelImpl.finish(UnixAsynchronousSocketChannelImpl.java:198)
[2025-07-15T13:31:45.623Z] DBLT at java.base/sun.nio.ch.UnixAsynchronousSocketChannelImpl.onEvent(UnixAsynchronousSocketChannelImpl.java:213)
[2025-07-15T13:31:45.623Z] DBLT at java.base/sun.nio.ch.EPollPort$EventHandlerTask.run(EPollPort.java:306)
[2025-07-15T13:31:45.623Z] DBLT ... 1 more
[2025-07-15T13:31:45.623Z] DBLT ---
[2025-07-15T13:31:45.623Z] DBLT ]
[2025-07-15T13:31:45.623Z] DBLT junit.framework.AssertionFailedError: [Failed Assertion Exceptions:
[2025-07-15T13:31:45.623Z] DBLT net.adoptopenjdk.test.nio2.util.AssertionFailedException: java.net.NoRouteToHostException: No route to host
[2025-07-15T13:31:45.623Z] DBLT at net.adoptopenjdk.test.nio2.asyncio.client.MultipleConnectAsyncTest$1.failed(MultipleConnectAsyncTest.java:124)
[2025-07-15T13:31:45.623Z] DBLT at net.adoptopenjdk.test.nio2.asyncio.client.MultipleConnectAsyncTest$1.failed(MultipleConnectAsyncTest.java:84)
[2025-07-15T13:31:45.623Z] DBLT at java.base/sun.nio.ch.Invoker.invokeUnchecked(Invoker.java:129)
[2025-07-15T13:31:45.623Z] DBLT at java.base/sun.nio.ch.UnixAsynchronousSocketChannelImpl.finishConnect(UnixAsynchronousSocketChannelImpl.java:283)
[2025-07-15T13:31:45.623Z] DBLT at java.base/sun.nio.ch.UnixAsynchronousSocketChannelImpl.finish(UnixAsynchronousSocketChannelImpl.java:198)
[2025-07-15T13:31:45.623Z] DBLT at java.base/sun.nio.ch.UnixAsynchronousSocketChannelImpl.onEvent(UnixAsynchronousSocketChannelImpl.java:213)
[2025-07-15T13:31:45.623Z] DBLT at java.base/sun.nio.ch.EPollPort$EventHandlerTask.run(EPollPort.java:306)
[2025-07-15T13:31:45.623Z] DBLT at java.base/sun.nio.ch.AsynchronousChannelGroupImpl$1.run(AsynchronousChannelGroupImpl.java:112)
[2025-07-15T13:31:45.623Z] DBLT at java.base/java.util.concurrent.ThreadPoolExecutor.runWorker(ThreadPoolExecutor.java:1128)
[2025-07-15T13:31:45.623Z] DBLT at java.base/java.util.concurrent.ThreadPoolExecutor$Worker.run(ThreadPoolExecutor.java:628)
[2025-07-15T13:31:45.623Z] DBLT at java.base/java.lang.Thread.run(Thread.java:829)
[2025-07-15T13:31:45.623Z] DBLT Caused by: java.net.NoRouteToHostException: No route to host
[2025-07-15T13:31:45.623Z] DBLT at java.base/sun.nio.ch.UnixAsynchronousSocketChannelImpl.checkConnect(Native Method)
[2025-07-15T13:31:45.623Z] DBLT at java.base/sun.nio.ch.UnixAsynchronousSocketChannelImpl.finishConnect(UnixAsynchronousSocketChannelImpl.java:252)
[2025-07-15T13:31:45.623Z] DBLT ... 7 more
[2025-07-15T13:31:45.623Z] DBLT ---
[2025-07-15T13:31:45.623Z] DBLT , Failed Assertion Exceptions:
[2025-07-15T13:31:45.624Z] DBLT net.adoptopenjdk.test.nio2.util.AssertionFailedException: java.net.NoRouteToHostException: No route to host
[2025-07-15T13:31:45.624Z] DBLT at net.adoptopenjdk.test.nio2.asyncio.client.MultipleConnectAsyncTest$1.failed(MultipleConnectAsyncTest.java:124)
[2025-07-15T13:31:45.624Z] DBLT at net.adoptopenjdk.test.nio2.asyncio.client.MultipleConnectAsyncTest$1.failed(MultipleConnectAsyncTest.java:84)
[2025-07-15T13:31:45.624Z] DBLT at java.base/sun.nio.ch.Invoker.invokeUnchecked(Invoker.java:129)
[2025-07-15T13:31:45.624Z] DBLT at java.base/sun.nio.ch.UnixAsynchronousSocketChannelImpl.finishConnect(UnixAsynchronousSocketChannelImpl.java:283)
[2025-07-15T13:31:45.624Z] DBLT at java.base/sun.nio.ch.UnixAsynchronousSocketChannelImpl.finish(UnixAsynchronousSocketChannelImpl.java:198)
[2025-07-15T13:31:45.624Z] DBLT at java.base/sun.nio.ch.UnixAsynchronousSocketChannelImpl.onEvent(UnixAsynchronousSocketChannelImpl.java:213)
[2025-07-15T13:31:45.624Z] DBLT at java.base/sun.nio.ch.EPollPort$EventHandlerTask.run(EPollPort.java:306)
[2025-07-15T13:31:45.624Z] DBLT at java.base/sun.nio.ch.AsynchronousChannelGroupImpl$1.run(AsynchronousChannelGroupImpl.java:112)
[2025-07-15T13:31:45.624Z] DBLT at java.base/java.util.concurrent.ThreadPoolExecutor.runWorker(ThreadPoolExecutor.java:1128)
[2025-07-15T13:31:45.624Z] DBLT at java.base/java.util.concurrent.ThreadPoolExecutor$Worker.run(ThreadPoolExecutor.java:628)
[2025-07-15T13:31:45.624Z] DBLT at java.base/java.lang.Thread.run(Thread.java:829)
[2025-07-15T13:31:45.624Z] DBLT Caused by: java.net.NoRouteToHostException: No route to host
[2025-07-15T13:31:45.624Z] DBLT at java.base/sun.nio.ch.UnixAsynchronousSocketChannelImpl.checkConnect(Native Method)
[2025-07-15T13:31:45.624Z] DBLT at java.base/sun.nio.ch.UnixAsynchronousSocketChannelImpl.finishConnect(UnixAsynchronousSocketChannelImpl.java:252)
[2025-07-15T13:31:45.624Z] DBLT ... 7 more
[2025-07-15T13:31:45.624Z] DBLT ---
[2025-07-15T13:31:45.624Z] DBLT , Failed Assertion Exceptions:
[2025-07-15T13:31:45.624Z] DBLT net.adoptopenjdk.test.nio2.util.AssertionFailedException: java.net.NoRouteToHostException: No route to host
[2025-07-15T13:31:45.624Z] DBLT at net.adoptopenjdk.test.nio2.asyncio.client.MultipleConnectAsyncTest$1.failed(MultipleConnectAsyncTest.java:124)
[2025-07-15T13:31:45.624Z] DBLT at net.adoptopenjdk.test.nio2.asyncio.client.MultipleConnectAsyncTest$1.failed(MultipleConnectAsyncTest.java:84)
[2025-07-15T13:31:45.624Z] DBLT at java.base/sun.nio.ch.Invoker.invokeUnchecked(Invoker.java:129)
[2025-07-15T13:31:45.624Z] DBLT at java.base/sun.nio.ch.Invoker$2.run(Invoker.java:219)
[2025-07-15T13:31:45.624Z] DBLT at java.base/sun.nio.ch.AsynchronousChannelGroupImpl$1.run(AsynchronousChannelGroupImpl.java:112)
[2025-07-15T13:31:45.624Z] DBLT at java.base/java.util.concurrent.ThreadPoolExecutor.runWorker(ThreadPoolExecutor.java:1128)
[2025-07-15T13:31:45.624Z] DBLT at java.base/java.util.concurrent.ThreadPoolExecutor$Worker.run(ThreadPoolExecutor.java:628)
[2025-07-15T13:31:45.624Z] DBLT at java.base/java.lang.Thread.run(Thread.java:829)
[2025-07-15T13:31:45.624Z] DBLT Caused by: java.net.NoRouteToHostException: No route to host
[2025-07-15T13:31:45.624Z] DBLT at java.base/sun.nio.ch.UnixAsynchronousSocketChannelImpl.checkConnect(Native Method)
[2025-07-15T13:31:45.624Z] DBLT at java.base/sun.nio.ch.UnixAsynchronousSocketChannelImpl.finishConnect(UnixAsynchronousSocketChannelImpl.java:252)
[2025-07-15T13:31:45.624Z] DBLT at java.base/sun.nio.ch.UnixAsynchronousSocketChannelImpl.finish(UnixAsynchronousSocketChannelImpl.java:198)
[2025-07-15T13:31:45.624Z] DBLT at java.base/sun.nio.ch.UnixAsynchronousSocketChannelImpl.onEvent(UnixAsynchronousSocketChannelImpl.java:213)
[2025-07-15T13:31:45.624Z] DBLT at java.base/sun.nio.ch.EPollPort$EventHandlerTask.run(EPollPort.java:306)
[2025-07-15T13:31:45.624Z] DBLT ... 1 more
[2025-07-15T13:31:45.624Z] DBLT ---
[2025-07-15T13:31:45.624Z] DBLT ]
[2025-07-15T13:31:45.624Z] DBLT at junit.framework.Assert.fail(Assert.java:57)
[2025-07-15T13:31:45.624Z] DBLT at junit.framework.TestCase.fail(TestCase.java:227)
[2025-07-15T13:31:45.624Z] DBLT at net.adoptopenjdk.test.nio2.asyncio.client.MultipleConnectAsyncTest.testMultipleSequentialConnect(MultipleConnectAsyncTest.java:191)
[2025-07-15T13:31:45.624Z] DBLT at java.base/jdk.internal.reflect.NativeMethodAccessorImpl.invoke0(Native Method)
[2025-07-15T13:31:45.624Z] DBLT at java.base/jdk.internal.reflect.NativeMethodAccessorImpl.invoke(NativeMethodAccessorImpl.java:62)
[2025-07-15T13:31:45.624Z] DBLT at java.base/jdk.internal.reflect.DelegatingMethodAccessorImpl.invoke(DelegatingMethodAccessorImpl.java:43)
[2025-07-15T13:31:45.624Z] DBLT at java.base/java.lang.reflect.Method.invoke(Method.java:566)
[2025-07-15T13:31:45.624Z] DBLT at junit.framework.TestCase.runTest(TestCase.java:176)
[2025-07-15T13:31:45.624Z] DBLT at junit.framework.TestCase.runBare(TestCase.java:141)
[2025-07-15T13:31:45.624Z] DBLT at junit.framework.TestResult$1.protect(TestResult.java:122)
[2025-07-15T13:31:45.624Z] DBLT at junit.framework.TestResult.runProtected(TestResult.java:142)
[2025-07-15T13:31:45.624Z] DBLT at junit.framework.TestResult.run(TestResult.java:125)
[2025-07-15T13:31:45.624Z] DBLT at junit.framework.TestCase.run(TestCase.java:129)
[2025-07-15T13:31:45.624Z] DBLT at junit.framework.TestSuite.runTest(TestSuite.java:252)
[2025-07-15T13:31:45.624Z] DBLT at junit.framework.TestSuite.run(TestSuite.java:247)
[2025-07-15T13:31:45.624Z] DBLT at org.junit.internal.runners.JUnit38ClassRunner.run(JUnit38ClassRunner.java:86)
[2025-07-15T13:31:45.624Z] DBLT at org.junit.runners.Suite.runChild(Suite.java:128)
[2025-07-15T13:31:45.624Z] DBLT at org.junit.runners.Suite.runChild(Suite.java:27)
[2025-07-15T13:31:45.624Z] DBLT at org.junit.runners.ParentRunner$3.run(ParentRunner.java:290)
[2025-07-15T13:31:45.624Z] DBLT at org.junit.runners.ParentRunner$1.schedule(ParentRunner.java:71)
[2025-07-15T13:31:45.624Z] DBLT at org.junit.runners.ParentRunner.runChildren(ParentRunner.java:288)
[2025-07-15T13:31:45.624Z] DBLT at org.junit.runners.ParentRunner.access$000(ParentRunner.java:58)
[2025-07-15T13:31:45.624Z] DBLT at org.junit.runners.ParentRunner$2.evaluate(ParentRunner.java:268)
[2025-07-15T13:31:45.624Z] DBLT at org.junit.runners.ParentRunner.run(ParentRunner.java:363)
[2025-07-15T13:31:45.624Z] DBLT at org.junit.runner.JUnitCore.run(JUnitCore.java:137)
[2025-07-15T13:31:45.624Z] DBLT at org.junit.runner.JUnitCore.run(JUnitCore.java:115)
[2025-07-15T13:31:45.624Z] DBLT at net.adoptopenjdk.loadTest.adaptors.JUnitAdaptor.executeTest(JUnitAdaptor.java:130)
[2025-07-15T13:31:45.624Z] DBLT at net.adoptopenjdk.loadTest.LoadTestRunner$2.run(LoadTestRunner.java:182)
[2025-07-15T13:31:45.624Z] DBLT at java.base/java.util.concurrent.ThreadPoolExecutor.runWorker(ThreadPoolExecutor.java:1128)
[2025-07-15T13:31:45.624Z] DBLT at java.base/java.util.concurrent.ThreadPoolExecutor$Worker.run(ThreadPoolExecutor.java:628)
[2025-07-15T13:31:45.624Z] DBLT at java.base/java.lang.Thread.run(Thread.java:829)
[2025-07-15T13:31:45.624Z] DBLT testFinished: testMultipleSequentialConnect(net.adoptopenjdk.test.nio2.asyncio.client.MultipleConnectAsyncTest)
[2025-07-15T13:31:45.624Z] DBLT testStarted : testSingleConnect(net.adoptopenjdk.test.nio2.asyncio.client.MultipleConnectAsyncTest)
[2025-07-15T13:31:45.624Z] DBLT testFailure: testSingleConnect(net.adoptopenjdk.test.nio2.asyncio.client.MultipleConnectAsyncTest): Failed Assertion Exceptions:
[2025-07-15T13:31:45.624Z] DBLT net.adoptopenjdk.test.nio2.util.AssertionFailedException: java.net.NoRouteToHostException: No route to host
[2025-07-15T13:31:45.624Z] DBLT at net.adoptopenjdk.test.nio2.asyncio.client.MultipleConnectAsyncTest$2.failed(MultipleConnectAsyncTest.java:248)
[2025-07-15T13:31:45.624Z] DBLT at net.adoptopenjdk.test.nio2.asyncio.client.MultipleConnectAsyncTest$2.failed(MultipleConnectAsyncTest.java:206)
[2025-07-15T13:31:45.624Z] DBLT at java.base/sun.nio.ch.Invoker.invokeUnchecked(Invoker.java:129)
[2025-07-15T13:31:45.624Z] DBLT at java.base/sun.nio.ch.UnixAsynchronousSocketChannelImpl.finishConnect(UnixAsynchronousSocketChannelImpl.java:283)
[2025-07-15T13:31:45.624Z] DBLT at java.base/sun.nio.ch.UnixAsynchronousSocketChannelImpl.finish(UnixAsynchronousSocketChannelImpl.java:198)
[2025-07-15T13:31:45.624Z] DBLT at java.base/sun.nio.ch.UnixAsynchronousSocketChannelImpl.onEvent(UnixAsynchronousSocketChannelImpl.java:213)
[2025-07-15T13:31:45.624Z] DBLT at java.base/sun.nio.ch.EPollPort$EventHandlerTask.run(EPollPort.java:306)
[2025-07-15T13:31:45.624Z] DBLT at java.base/sun.nio.ch.AsynchronousChannelGroupImpl$1.run(AsynchronousChannelGroupImpl.java:112)
[2025-07-15T13:31:45.624Z] DBLT at java.base/java.util.concurrent.ThreadPoolExecutor.runWorker(ThreadPoolExecutor.java:1128)
[2025-07-15T13:31:45.624Z] DBLT at java.base/java.util.concurrent.ThreadPoolExecutor$Worker.run(ThreadPoolExecutor.java:628)
[2025-07-15T13:31:45.624Z] DBLT at java.base/java.lang.Thread.run(Thread.java:829)
[2025-07-15T13:31:45.624Z] DBLT Caused by: java.net.NoRouteToHostException: No route to host
[2025-07-15T13:31:45.624Z] DBLT at java.base/sun.nio.ch.UnixAsynchronousSocketChannelImpl.checkConnect(Native Method)
[2025-07-15T13:31:45.624Z] DBLT at java.base/sun.nio.ch.UnixAsynchronousSocketChannelImpl.finishConnect(UnixAsynchronousSocketChannelImpl.java:252)
[2025-07-15T13:31:45.624Z] DBLT ... 7 more
[2025-07-15T13:31:45.624Z] DBLT ---
[2025-07-15T13:31:45.624Z] DBLT
[2025-07-15T13:31:45.624Z] DBLT junit.framework.AssertionFailedError: Failed Assertion Exceptions:
[2025-07-15T13:31:45.624Z] DBLT net.adoptopenjdk.test.nio2.util.AssertionFailedException: java.net.NoRouteToHostException: No route to host
[2025-07-15T13:31:45.624Z] DBLT at net.adoptopenjdk.test.nio2.asyncio.client.MultipleConnectAsyncTest$2.failed(MultipleConnectAsyncTest.java:248)
[2025-07-15T13:31:45.624Z] DBLT at net.adoptopenjdk.test.nio2.asyncio.client.MultipleConnectAsyncTest$2.failed(MultipleConnectAsyncTest.java:206)
[2025-07-15T13:31:45.624Z] DBLT at java.base/sun.nio.ch.Invoker.invokeUnchecked(Invoker.java:129)
[2025-07-15T13:31:45.624Z] DBLT at java.base/sun.nio.ch.UnixAsynchronousSocketChannelImpl.finishConnect(UnixAsynchronousSocketChannelImpl.java:283)
[2025-07-15T13:31:45.624Z] DBLT at java.base/sun.nio.ch.UnixAsynchronousSocketChannelImpl.finish(UnixAsynchronousSocketChannelImpl.java:198)
[2025-07-15T13:31:45.624Z] DBLT at java.base/sun.nio.ch.UnixAsynchronousSocketChannelImpl.onEvent(UnixAsynchronousSocketChannelImpl.java:213)
[2025-07-15T13:31:45.624Z] DBLT at java.base/sun.nio.ch.EPollPort$EventHandlerTask.run(EPollPort.java:306)
[2025-07-15T13:31:45.624Z] DBLT at java.base/sun.nio.ch.AsynchronousChannelGroupImpl$1.run(AsynchronousChannelGroupImpl.java:112)
[2025-07-15T13:31:45.624Z] DBLT at java.base/java.util.concurrent.ThreadPoolExecutor.runWorker(ThreadPoolExecutor.java:1128)
[2025-07-15T13:31:45.624Z] DBLT at java.base/java.util.concurrent.ThreadPoolExecutor$Worker.run(ThreadPoolExecutor.java:628)
[2025-07-15T13:31:45.624Z] DBLT at java.base/java.lang.Thread.run(Thread.java:829)
[2025-07-15T13:31:45.624Z] DBLT Caused by: java.net.NoRouteToHostException: No route to host
[2025-07-15T13:31:45.624Z] DBLT at java.base/sun.nio.ch.UnixAsynchronousSocketChannelImpl.checkConnect(Native Method)
[2025-07-15T13:31:45.624Z] DBLT at java.base/sun.nio.ch.UnixAsynchronousSocketChannelImpl.finishConnect(UnixAsynchronousSocketChannelImpl.java:252)
[2025-07-15T13:31:45.624Z] DBLT ... 7 more
[2025-07-15T13:31:45.624Z] DBLT ---
[2025-07-15T13:31:45.624Z] DBLT
[2025-07-15T13:31:45.624Z] DBLT at junit.framework.Assert.fail(Assert.java:57)
[2025-07-15T13:31:45.624Z] DBLT at junit.framework.TestCase.fail(TestCase.java:227)
[2025-07-15T13:31:45.624Z] DBLT at net.adoptopenjdk.test.nio2.asyncio.client.MultipleConnectAsyncTest.testSingleConnect(MultipleConnectAsyncTest.java:281)
[2025-07-15T13:31:45.624Z] DBLT at java.base/jdk.internal.reflect.NativeMethodAccessorImpl.invoke0(Native Method)
[2025-07-15T13:31:45.625Z] DBLT at java.base/jdk.internal.reflect.NativeMethodAccessorImpl.invoke(NativeMethodAccessorImpl.java:62)
[2025-07-15T13:31:45.625Z] DBLT at java.base/jdk.internal.reflect.DelegatingMethodAccessorImpl.invoke(DelegatingMethodAccessorImpl.java:43)
[2025-07-15T13:31:45.625Z] DBLT at java.base/java.lang.reflect.Method.invoke(Method.java:566)
[2025-07-15T13:31:45.625Z] DBLT at junit.framework.TestCase.runTest(TestCase.java:176)
[2025-07-15T13:31:45.625Z] DBLT at junit.framework.TestCase.runBare(TestCase.java:141)
[2025-07-15T13:31:45.625Z] DBLT at junit.framework.TestResult$1.protect(TestResult.java:122)
[2025-07-15T13:31:45.625Z] DBLT at junit.framework.TestResult.runProtected(TestResult.java:142)
[2025-07-15T13:31:45.625Z] DBLT at junit.framework.TestResult.run(TestResult.java:125)
[2025-07-15T13:31:45.625Z] DBLT at junit.framework.TestCase.run(TestCase.java:129)
[2025-07-15T13:31:45.625Z] DBLT at junit.framework.TestSuite.runTest(TestSuite.java:252)
[2025-07-15T13:31:45.625Z] DBLT at junit.framework.TestSuite.run(TestSuite.java:247)
[2025-07-15T13:31:45.625Z] DBLT at org.junit.internal.runners.JUnit38ClassRunner.run(JUnit38ClassRunner.java:86)
[2025-07-15T13:31:45.625Z] DBLT at org.junit.runners.Suite.runChild(Suite.java:128)
[2025-07-15T13:31:45.625Z] DBLT at org.junit.runners.Suite.runChild(Suite.java:27)
[2025-07-15T13:31:45.625Z] DBLT at org.junit.runners.ParentRunner$3.run(ParentRunner.java:290)
[2025-07-15T13:31:45.625Z] DBLT at org.junit.runners.ParentRunner$1.schedule(ParentRunner.java:71)
[2025-07-15T13:31:45.625Z] DBLT at org.junit.runners.ParentRunner.runChildren(ParentRunner.java:288)
[2025-07-15T13:31:45.625Z] DBLT at org.junit.runners.ParentRunner.access$000(ParentRunner.java:58)
[2025-07-15T13:31:45.625Z] DBLT at org.junit.runners.ParentRunner$2.evaluate(ParentRunner.java:268)
[2025-07-15T13:31:45.625Z] DBLT at org.junit.runners.ParentRunner.run(ParentRunner.java:363)
[2025-07-15T13:31:45.625Z] DBLT at org.junit.runner.JUnitCore.run(JUnitCore.java:137)
[2025-07-15T13:31:45.625Z] DBLT at org.junit.runner.JUnitCore.run(JUnitCore.java:115)
[2025-07-15T13:31:45.625Z] DBLT at net.adoptopenjdk.loadTest.adaptors.JUnitAdaptor.executeTest(JUnitAdaptor.java:130)
[2025-07-15T13:31:45.625Z] DBLT at net.adoptopenjdk.loadTest.LoadTestRunner$2.run(LoadTestRunner.java:182)
[2025-07-15T13:31:45.625Z] DBLT at java.base/java.util.concurrent.ThreadPoolExecutor.runWorker(ThreadPoolExecutor.java:1128)
[2025-07-15T13:31:45.625Z] DBLT at java.base/java.util.concurrent.ThreadPoolExecutor$Worker.run(ThreadPoolExecutor.java:628)
[2025-07-15T13:31:45.625Z] DBLT at java.base/java.lang.Thread.run(Thread.java:829)
[2025-07-15T13:31:45.625Z] DBLT testFinished: testSingleConnect(net.adoptopenjdk.test.nio2.asyncio.client.MultipleConnectAsyncTest)
[2025-07-15T13:31:45.625Z] DBLT
[2025-07-15T13:31:45.625Z] DBLT JUnit Test Results for: net.adoptopenjdk.test.nio2.asyncio.client.MultipleConnectAsyncTest
[2025-07-15T13:31:45.625Z] DBLT Ran : 2
[2025-07-15T13:31:45.625Z] DBLT Passed : 0
[2025-07-15T13:31:45.625Z] DBLT Failed : 2
[2025-07-15T13:31:45.625Z] DBLT Ignored: 0
[2025-07-15T13:31:45.625Z] DBLT Result : FAILED
[2025-07-15T13:31:45.625Z] DBLT <<<
[2025-07-15T13:31:45.625Z] DBLT
[2025-07-15T13:31:46.241Z] DBLT 08:31:45.364 - suite.getInventory().getInventoryFileRef(): openjdk.test.load/config/inventories/gc/directByteBuffer.xml
[2025-07-15T13:31:46.241Z] DBLT 08:31:45.365 - suite.isCreateDump() : false
[2025-07-15T13:31:46.241Z] DBLT 08:31:45.365 - Test failed. Details recorded in execution log.
[2025-07-15T13:31:52.063Z] DBLT 08:31:51.066 - suite.getInventory().getInventoryFileRef(): openjdk.test.load/config/inventories/gc/directByteBuffer.xml
[2025-07-15T13:31:52.063Z] DBLT 08:31:51.067 - suite.isCreateDump() : false
[2025-07-15T13:31:52.063Z] DBLT 08:31:51.067 - Test failed. Details recorded in execution log.
[2025-07-15T13:31:52.063Z] DBLT 08:31:51.587 - suite.getInventory().getInventoryFileRef(): openjdk.test.load/config/inventories/gc/directByteBuffer.xml
[2025-07-15T13:31:52.063Z] DBLT 08:31:51.587 - suite.isCreateDump() : false
[2025-07-15T13:31:52.063Z] DBLT 08:31:51.587 - Test failed. Details recorded in execution log.
[2025-07-15T13:31:54.502Z] DBLT 08:31:54.087 - suite.getInventory().getInventoryFileRef(): openjdk.test.load/config/inventories/gc/directByteBuffer.xml
[2025-07-15T13:31:54.502Z] DBLT 08:31:54.087 - suite.isCreateDump() : false
[2025-07-15T13:31:54.502Z] DBLT 08:31:54.088 - Test failed. Details recorded in execution log.
[2025-07-15T13:31:58.236Z] DBLT 08:31:57.758 - suite.getInventory().getInventoryFileRef(): openjdk.test.load/config/inventories/gc/directByteBuffer.xml
[2025-07-15T13:31:58.236Z] DBLT 08:31:57.758 - suite.isCreateDump() : false
[2025-07-15T13:31:58.236Z] DBLT 08:31:57.758 - Test failed. Details recorded in execution log.
[2025-07-15T13:31:59.550Z] DBLT 08:31:58.778 - suite.getInventory().getInventoryFileRef(): openjdk.test.load/config/inventories/gc/directByteBuffer.xml
[2025-07-15T13:31:59.550Z] DBLT 08:31:58.778 - suite.isCreateDump() : false
[2025-07-15T13:31:59.550Z] DBLT 08:31:58.778 - Test failed. Details recorded in execution log.
[2025-07-15T13:32:00.183Z] DBLT 08:31:59.866 - suite.getInventory().getInventoryFileRef(): openjdk.test.load/config/inventories/gc/directByteBuffer.xml
[2025-07-15T13:32:00.183Z] DBLT 08:31:59.866 - suite.isCreateDump() : false
[2025-07-15T13:32:00.183Z] DBLT 08:31:59.866 - Test failed. Details recorded in execution log.
[2025-07-15T13:32:00.814Z] DBLT 08:32:00.298 - Completed 6.7%. Number of tests started=40 (with 8 failure(s))
[2025-07-15T13:32:08.044Z] DBLT 08:32:06.437 - suite.getInventory().getInventoryFileRef(): openjdk.test.load/config/inventories/gc/directByteBuffer.xml
[2025-07-15T13:32:08.044Z] DBLT 08:32:06.437 - suite.isCreateDump() : false
[2025-07-15T13:32:08.044Z] DBLT 08:32:06.437 - Test failed. Details recorded in execution log.
[2025-07-15T13:32:10.870Z] DBLT 08:32:09.962 - suite.getInventory().getInventoryFileRef(): openjdk.test.load/config/inventories/gc/directByteBuffer.xml
[2025-07-15T13:32:10.870Z] DBLT 08:32:09.963 - suite.isCreateDump() : false
[2025-07-15T13:32:10.870Z] DBLT 08:32:09.963 - Test failed. Details recorded in execution log.
[2025-07-15T13:32:10.870Z] DBLT 08:32:09.963 - Number of test failures has reached 'AbortAtFailureLimit' (10). Terminating load test
[2025-07-15T13:32:10.870Z] DBLT 08:32:09.964 - Thread completed. Suite=0 thread=1
[2025-07-15T13:32:11.485Z] DBLT 08:32:10.719 - suite.getInventory().getInventoryFileRef(): openjdk.test.load/config/inventories/gc/directByteBuffer.xml
[2025-07-15T13:32:11.485Z] DBLT 08:32:10.720 - suite.isCreateDump() : false
[2025-07-15T13:32:11.485Z] DBLT 08:32:10.720 - Test failed. Details recorded in execution log.
[2025-07-15T13:32:11.485Z] DBLT 08:32:10.723 - Thread completed. Suite=0 thread=0
[2025-07-15T13:32:11.485Z] DBLT 08:32:10.724 - Load test completed
[2025-07-15T13:32:11.485Z] DBLT 08:32:10.725 - Ran : 52
[2025-07-15T13:32:11.485Z] DBLT 08:32:10.726 - Passed : 41
[2025-07-15T13:32:11.485Z] DBLT 08:32:10.726 - Failed : 11
[2025-07-15T13:32:11.485Z] DBLT 08:32:10.726 - Result : FAILED
[2025-07-15T13:32:11.485Z] DBLT 08:32:10.727 - Note that only the first 1 failures have been reported
[2025-07-15T13:32:12.108Z] STF 08:32:11.390 - **FAILED** Process DBLT ended with exit code (1) and not the expected exit code/s (0)
[2025-07-15T13:32:12.108Z] STF 08:32:11.390 - Monitoring Report Summary:
[2025-07-15T13:32:12.108Z] STF 08:32:11.390 - o Process DBLT ended with exit code (1) and not the expected exit code/s (0)
[2025-07-15T13:32:12.108Z] STF 08:32:11.390 - Killing processes: DBLT
[2025-07-15T13:32:12.108Z] STF 08:32:11.390 - o Process DBLT pid 21116 is not running
[2025-07-15T13:32:12.108Z] **FAILED** at step 1 (Run DirectByteBuffer load test). Expected return value=0 Actual=1 at /home/jenkins/workspace/Test_openjdk11_hs_extended.system_s390x_linux_testList_1/aqa-tests/TKG/../TKG/output_17525859769152/DBBLoadTest_5m_1/20250715-083135-DirectByteBufferLoadTest/execute.pl line 94.
[2025-07-15T13:32:12.108Z] STF 08:32:11.730 - **FAILED** execute script failed. Expected return value=0 Actual=1
[2025-07-15T13:32:12.108Z] STF 08:32:11.730 -
[2025-07-15T13:32:12.108Z] STF 08:32:11.730 - ==================== T E A R D O W N ====================
[2025-07-15T13:32:12.108Z] STF 08:32:11.730 - Running teardown: perl /home/jenkins/workspace/Test_openjdk11_hs_extended.system_s390x_linux_testList_1/aqa-tests/TKG/../TKG/output_17525859769152/DBBLoadTest_5m_1/20250715-083135-DirectByteBufferLoadTest/tearDown.pl
[2025-07-15T13:32:12.108Z] STF 08:32:11.775 - TEARDOWN stage completed
[2025-07-15T13:32:12.108Z] STF 08:32:11.779 -
[2025-07-15T13:32:12.108Z] STF 08:32:11.779 - ===================== R E S U L T S =====================
[2025-07-15T13:32:12.108Z] STF 08:32:11.779 - Stage results:
[2025-07-15T13:32:12.108Z] STF 08:32:11.779 - setUp: pass
[2025-07-15T13:32:12.108Z] STF 08:32:11.779 - execute: *fail*
[2025-07-15T13:32:12.108Z] STF 08:32:11.779 - teardown: pass
[2025-07-15T13:32:12.108Z] STF 08:32:11.779 -
[2025-07-15T13:32:12.108Z] STF 08:32:11.779 - Overall result: **FAILED**
[2025-07-15T13:32:12.108Z] -----------------------------------
[2025-07-15T13:32:12.108Z] DBBLoadTest_5m_1_FAILED
[2025-07-15T13:32:12.108Z] -----------------------------------
[2025-07-15T13:32:12.108Z]
[2025-07-15T13:32:12.108Z] TEST TEARDOWN:
[2025-07-15T13:32:12.108Z] Nothing to be done for teardown.
[2025-07-15T13:32:12.108Z] DBBLoadTest_5m_1 Finish Time: Tue Jul 15 08:32:11 2025 Epoch Time (ms): 1752586331793