hotspot_runtime_0
[2025-06-27T02:23:18.400Z] Running test hotspot_runtime_0 ...
[2025-06-27T02:23:18.401Z] ===============================================
[2025-06-27T02:23:18.401Z] hotspot_runtime_0 Start Time: Thu Jun 26 22:23:18 2025 Epoch Time (ms): 1750990998252
[2025-06-27T02:23:18.401Z] variation: NoOptions
[2025-06-27T02:23:18.401Z] JVM_OPTIONS:
[2025-06-27T02:23:18.401Z] { \
[2025-06-27T02:23:18.401Z] echo ""; echo "TEST SETUP:"; \
[2025-06-27T02:23:18.401Z] echo "Nothing to be done for setup."; \
[2025-06-27T02:23:18.401Z] mkdir -p "/home/jenkins/workspace/Test_openjdk21_hs_extended.openjdk_s390x_linux_testList_0/aqa-tests/TKG/../TKG/output_17509909975678/hotspot_runtime_0"; \
[2025-06-27T02:23:18.401Z] cd "/home/jenkins/workspace/Test_openjdk21_hs_extended.openjdk_s390x_linux_testList_0/aqa-tests/TKG/../TKG/output_17509909975678/hotspot_runtime_0"; \
[2025-06-27T02:23:18.401Z] echo ""; echo "TESTING:"; \
[2025-06-27T02:23:18.401Z] "/home/jenkins/workspace/Test_openjdk21_hs_extended.openjdk_s390x_linux_testList_0/jdkbinary/j2sdk-image/bin/java" -Xmx512m -jar "/home/jenkins/workspace/Test_openjdk21_hs_extended.openjdk_s390x_linux_testList_0/aqa-tests/TKG/../../jvmtest/openjdk/jtreg/lib/jtreg.jar" \
[2025-06-27T02:23:18.401Z] -agentvm -a -ea -esa -v:fail,error,time,nopass -retain:fail,error,*.dmp,javacore.*,heapdump.*,*.trc -ignore:quiet -timeoutFactor:8 -xml:verify -concurrency:1 -nativepath:"/home/jenkins/workspace/Test_openjdk21_hs_extended.openjdk_s390x_linux_testList_0/jdkbinary/openjdk-test-image/hotspot/jtreg/native" -vmoptions:"-Xmx512m " \
[2025-06-27T02:23:18.401Z] -w ""/home/jenkins/workspace/Test_openjdk21_hs_extended.openjdk_s390x_linux_testList_0/aqa-tests/TKG/../TKG/output_17509909975678/hotspot_runtime_0"/work" \
[2025-06-27T02:23:18.401Z] -r ""/home/jenkins/workspace/Test_openjdk21_hs_extended.openjdk_s390x_linux_testList_0/aqa-tests/TKG/../TKG/output_17509909975678/hotspot_runtime_0"/report" \
[2025-06-27T02:23:18.401Z] -jdk:"/home/jenkins/workspace/Test_openjdk21_hs_extended.openjdk_s390x_linux_testList_0/jdkbinary/j2sdk-image" \
[2025-06-27T02:23:18.401Z] -exclude:"/home/jenkins/workspace/Test_openjdk21_hs_extended.openjdk_s390x_linux_testList_0/aqa-tests/TKG/../openjdk/openjdk-jdk/test/hotspot/jtreg/ProblemList.txt" \
[2025-06-27T02:23:18.401Z] -exclude:"/home/jenkins/workspace/Test_openjdk21_hs_extended.openjdk_s390x_linux_testList_0/aqa-tests/TKG/../../jvmtest/openjdk/excludes/ProblemList_openjdk21.txt" \
[2025-06-27T02:23:18.401Z] \
[2025-06-27T02:23:18.401Z] -exclude:"/home/jenkins/workspace/Test_openjdk21_hs_extended.openjdk_s390x_linux_testList_0/aqa-tests/TKG/../openjdk/excludes/vendors/eclipse/ProblemList_openjdk21.txt" \
[2025-06-27T02:23:18.401Z] "/home/jenkins/workspace/Test_openjdk21_hs_extended.openjdk_s390x_linux_testList_0/aqa-tests/TKG/../openjdk/openjdk-jdk/test/hotspot/jtreg:hotspot_runtime"; \
[2025-06-27T02:23:18.401Z] if [ $? -eq 0 ]; then echo "-----------------------------------"; echo "hotspot_runtime_0""_PASSED"; echo "-----------------------------------"; cd /home/jenkins/workspace/Test_openjdk21_hs_extended.openjdk_s390x_linux_testList_0/aqa-tests/TKG/..; else echo "-----------------------------------"; echo "hotspot_runtime_0""_FAILED"; echo "-----------------------------------"; fi; \
[2025-06-27T02:23:18.401Z] echo ""; echo "TEST TEARDOWN:"; \
[2025-06-27T02:23:18.401Z] echo "Nothing to be done for teardown."; \
[2025-06-27T02:23:18.401Z] } 2>&1 | tee -a "/home/jenkins/workspace/Test_openjdk21_hs_extended.openjdk_s390x_linux_testList_0/aqa-tests/TKG/../TKG/output_17509909975678/TestTargetResult";
[2025-06-27T02:23:18.401Z]
[2025-06-27T02:23:18.401Z] TEST SETUP:
[2025-06-27T02:23:18.401Z] Nothing to be done for setup.
[2025-06-27T02:23:18.401Z]
[2025-06-27T02:23:18.401Z] TESTING:
[2025-06-27T02:23:19.051Z] Directory "/home/jenkins/workspace/Test_openjdk21_hs_extended.openjdk_s390x_linux_testList_0/aqa-tests/TKG/../TKG/output_17509909975678/hotspot_runtime_0/work" not found: creating
[2025-06-27T02:23:19.739Z] Directory "/home/jenkins/workspace/Test_openjdk21_hs_extended.openjdk_s390x_linux_testList_0/aqa-tests/TKG/../TKG/output_17509909975678/hotspot_runtime_0/report" not found: creating
[2025-06-27T02:23:28.855Z] XML output with verification to /home/jenkins/workspace/Test_openjdk21_hs_extended.openjdk_s390x_linux_testList_0/aqa-tests/TKG/output_17509909975678/hotspot_runtime_0/work
[2025-06-27T03:26:41.961Z] --------------------------------------------------
[2025-06-27T03:26:41.961Z] TEST: runtime/CommandLine/OptionsValidation/TestOptionsWithRanges.java#id4
[2025-06-27T03:26:41.961Z] TEST JDK: /home/jenkins/workspace/Test_openjdk21_hs_extended.openjdk_s390x_linux_testList_0/jdkbinary/j2sdk-image
[2025-06-27T03:26:41.961Z]
[2025-06-27T03:26:41.961Z] ACTION: build -- Passed. Build successful
[2025-06-27T03:26:41.961Z] REASON: Named class compiled on demand
[2025-06-27T03:26:41.961Z] TIME: 0.417 seconds
[2025-06-27T03:26:41.961Z] messages:
[2025-06-27T03:26:41.961Z] command: build TestOptionsWithRanges
[2025-06-27T03:26:41.961Z] reason: Named class compiled on demand
[2025-06-27T03:26:41.961Z] started: Thu Jun 26 23:25:57 EDT 2025
[2025-06-27T03:26:41.961Z] Test directory:
[2025-06-27T03:26:41.961Z] compile: TestOptionsWithRanges
[2025-06-27T03:26:41.961Z] finished: Thu Jun 26 23:25:58 EDT 2025
[2025-06-27T03:26:41.961Z] elapsed time (seconds): 0.417
[2025-06-27T03:26:41.961Z]
[2025-06-27T03:26:41.961Z] ACTION: compile -- Passed. Compilation successful
[2025-06-27T03:26:41.961Z] REASON: .class file out of date or does not exist
[2025-06-27T03:26:41.961Z] TIME: 0.416 seconds
[2025-06-27T03:26:41.961Z] messages:
[2025-06-27T03:26:41.961Z] command: compile /home/jenkins/workspace/Test_openjdk21_hs_extended.openjdk_s390x_linux_testList_0/aqa-tests/openjdk/openjdk-jdk/test/hotspot/jtreg/runtime/CommandLine/OptionsValidation/TestOptionsWithRanges.java
[2025-06-27T03:26:41.961Z] reason: .class file out of date or does not exist
[2025-06-27T03:26:41.961Z] started: Thu Jun 26 23:25:57 EDT 2025
[2025-06-27T03:26:41.961Z] Additional options from @modules: --add-modules java.base,java.management,jdk.attach,jdk.internal.jvmstat --add-exports java.base/jdk.internal.misc=ALL-UNNAMED --add-exports jdk.attach/sun.tools.attach=ALL-UNNAMED --add-exports jdk.internal.jvmstat/sun.jvmstat.monitor=ALL-UNNAMED
[2025-06-27T03:26:41.961Z] Mode: agentvm
[2025-06-27T03:26:41.961Z] Agent id: 1
[2025-06-27T03:26:41.961Z] finished: Thu Jun 26 23:25:58 EDT 2025
[2025-06-27T03:26:41.961Z] elapsed time (seconds): 0.416
[2025-06-27T03:26:41.961Z] configuration:
[2025-06-27T03:26:41.961Z] Boot Layer (javac runtime environment)
[2025-06-27T03:26:41.961Z] class path: /home/jenkins/workspace/Test_openjdk21_hs_extended.openjdk_s390x_linux_testList_0/jvmtest/openjdk/jtreg/lib/javatest.jar
[2025-06-27T03:26:41.961Z] /home/jenkins/workspace/Test_openjdk21_hs_extended.openjdk_s390x_linux_testList_0/jvmtest/openjdk/jtreg/lib/jtreg.jar
[2025-06-27T03:26:41.961Z] patch: java.base /home/jenkins/workspace/Test_openjdk21_hs_extended.openjdk_s390x_linux_testList_0/aqa-tests/TKG/output_17509909975678/hotspot_runtime_0/work/patches/java.base
[2025-06-27T03:26:41.961Z]
[2025-06-27T03:26:41.961Z] javac compilation environment
[2025-06-27T03:26:41.961Z] add modules: java.base java.management jdk.attach jdk.internal.jvmstat
[2025-06-27T03:26:41.961Z] add exports: java.base/jdk.internal.misc ALL-UNNAMED
[2025-06-27T03:26:41.961Z] jdk.attach/sun.tools.attach ALL-UNNAMED
[2025-06-27T03:26:41.961Z] jdk.internal.jvmstat/sun.jvmstat.monitor ALL-UNNAMED
[2025-06-27T03:26:41.961Z] source path: /home/jenkins/workspace/Test_openjdk21_hs_extended.openjdk_s390x_linux_testList_0/aqa-tests/openjdk/openjdk-jdk/test/hotspot/jtreg/runtime/CommandLine/OptionsValidation
[2025-06-27T03:26:41.961Z] /home/jenkins/workspace/Test_openjdk21_hs_extended.openjdk_s390x_linux_testList_0/aqa-tests/openjdk/openjdk-jdk/test/lib
[2025-06-27T03:26:41.961Z] /home/jenkins/workspace/Test_openjdk21_hs_extended.openjdk_s390x_linux_testList_0/aqa-tests/openjdk/openjdk-jdk/test/hotspot/jtreg/runtime/CommandLine/OptionsValidation/common
[2025-06-27T03:26:41.961Z] class path: /home/jenkins/workspace/Test_openjdk21_hs_extended.openjdk_s390x_linux_testList_0/aqa-tests/openjdk/openjdk-jdk/test/hotspot/jtreg/runtime/CommandLine/OptionsValidation
[2025-06-27T03:26:41.961Z] /home/jenkins/workspace/Test_openjdk21_hs_extended.openjdk_s390x_linux_testList_0/aqa-tests/TKG/output_17509909975678/hotspot_runtime_0/work/classes/runtime/CommandLine/OptionsValidation/TestOptionsWithRanges_id4.d
[2025-06-27T03:26:41.961Z] /home/jenkins/workspace/Test_openjdk21_hs_extended.openjdk_s390x_linux_testList_0/aqa-tests/TKG/output_17509909975678/hotspot_runtime_0/work/classes/test/lib
[2025-06-27T03:26:41.961Z] /home/jenkins/workspace/Test_openjdk21_hs_extended.openjdk_s390x_linux_testList_0/aqa-tests/TKG/output_17509909975678/hotspot_runtime_0/work/classes/runtime/CommandLine/OptionsValidation/common
[2025-06-27T03:26:41.961Z]
[2025-06-27T03:26:41.961Z] rerun:
[2025-06-27T03:26:41.961Z] cd /home/jenkins/workspace/Test_openjdk21_hs_extended.openjdk_s390x_linux_testList_0/aqa-tests/TKG/output_17509909975678/hotspot_runtime_0/work/scratch && \
[2025-06-27T03:26:41.961Z] DBUS_SESSION_BUS_ADDRESS=unix:path=/run/user/1002/bus \
[2025-06-27T03:26:41.961Z] DISPLAY=:0 \
[2025-06-27T03:26:41.961Z] HOME=/home/jenkins \
[2025-06-27T03:26:41.961Z] LANG=en_US.UTF-8 \
[2025-06-27T03:26:41.961Z] PATH=/bin:/usr/bin:/usr/sbin \
[2025-06-27T03:26:41.961Z] XDG_RUNTIME_DIR=/run/user/1002 \
[2025-06-27T03:26:41.961Z] XDG_SESSION_ID=216332 \
[2025-06-27T03:26:41.961Z] /home/jenkins/workspace/Test_openjdk21_hs_extended.openjdk_s390x_linux_testList_0/jdkbinary/j2sdk-image/bin/javac \
[2025-06-27T03:26:41.961Z] -J-ea \
[2025-06-27T03:26:41.961Z] -J-esa \
[2025-06-27T03:26:41.961Z] -J-Xmx512m \
[2025-06-27T03:26:41.961Z] -J-Dtest.vm.opts='-ea -esa -Xmx512m' \
[2025-06-27T03:26:41.961Z] -J-Dtest.tool.vm.opts='-J-ea -J-esa -J-Xmx512m' \
[2025-06-27T03:26:41.961Z] -J-Dtest.compiler.opts= \
[2025-06-27T03:26:41.961Z] -J-Dtest.java.opts= \
[2025-06-27T03:26:41.961Z] -J-Dtest.jdk=/home/jenkins/workspace/Test_openjdk21_hs_extended.openjdk_s390x_linux_testList_0/jdkbinary/j2sdk-image \
[2025-06-27T03:26:41.961Z] -J-Dcompile.jdk=/home/jenkins/workspace/Test_openjdk21_hs_extended.openjdk_s390x_linux_testList_0/jdkbinary/j2sdk-image \
[2025-06-27T03:26:41.961Z] -J-Dtest.timeout.factor=8.0 \
[2025-06-27T03:26:41.961Z] -J-Dtest.nativepath=/home/jenkins/workspace/Test_openjdk21_hs_extended.openjdk_s390x_linux_testList_0/jdkbinary/openjdk-test-image/hotspot/jtreg/native \
[2025-06-27T03:26:41.961Z] -J-Dtest.root=/home/jenkins/workspace/Test_openjdk21_hs_extended.openjdk_s390x_linux_testList_0/aqa-tests/openjdk/openjdk-jdk/test/hotspot/jtreg \
[2025-06-27T03:26:41.961Z] -J-Dtest.name=runtime/CommandLine/OptionsValidation/TestOptionsWithRanges.java#id4 \
[2025-06-27T03:26:41.961Z] -J-Dtest.file=/home/jenkins/workspace/Test_openjdk21_hs_extended.openjdk_s390x_linux_testList_0/aqa-tests/openjdk/openjdk-jdk/test/hotspot/jtreg/runtime/CommandLine/OptionsValidation/TestOptionsWithRanges.java \
[2025-06-27T03:26:41.961Z] -J-Dtest.src=/home/jenkins/workspace/Test_openjdk21_hs_extended.openjdk_s390x_linux_testList_0/aqa-tests/openjdk/openjdk-jdk/test/hotspot/jtreg/runtime/CommandLine/OptionsValidation \
[2025-06-27T03:26:41.961Z] -J-Dtest.src.path=/home/jenkins/workspace/Test_openjdk21_hs_extended.openjdk_s390x_linux_testList_0/aqa-tests/openjdk/openjdk-jdk/test/hotspot/jtreg/runtime/CommandLine/OptionsValidation:/home/jenkins/workspace/Test_openjdk21_hs_extended.openjdk_s390x_linux_testList_0/aqa-tests/openjdk/openjdk-jdk/test/lib:/home/jenkins/workspace/Test_openjdk21_hs_extended.openjdk_s390x_linux_testList_0/aqa-tests/openjdk/openjdk-jdk/test/hotspot/jtreg/runtime/CommandLine/OptionsValidation/common \
[2025-06-27T03:26:41.961Z] -J-Dtest.classes=/home/jenkins/workspace/Test_openjdk21_hs_extended.openjdk_s390x_linux_testList_0/aqa-tests/TKG/output_17509909975678/hotspot_runtime_0/work/classes/runtime/CommandLine/OptionsValidation/TestOptionsWithRanges_id4.d \
[2025-06-27T03:26:41.961Z] -J-Dtest.class.path=/home/jenkins/workspace/Test_openjdk21_hs_extended.openjdk_s390x_linux_testList_0/aqa-tests/TKG/output_17509909975678/hotspot_runtime_0/work/classes/runtime/CommandLine/OptionsValidation/TestOptionsWithRanges_id4.d:/home/jenkins/workspace/Test_openjdk21_hs_extended.openjdk_s390x_linux_testList_0/aqa-tests/TKG/output_17509909975678/hotspot_runtime_0/work/classes/test/lib:/home/jenkins/workspace/Test_openjdk21_hs_extended.openjdk_s390x_linux_testList_0/aqa-tests/TKG/output_17509909975678/hotspot_runtime_0/work/classes/runtime/CommandLine/OptionsValidation/common \
[2025-06-27T03:26:41.961Z] -J-Dtest.class.path.prefix=/home/jenkins/workspace/Test_openjdk21_hs_extended.openjdk_s390x_linux_testList_0/aqa-tests/TKG/output_17509909975678/hotspot_runtime_0/work/classes/runtime/CommandLine/OptionsValidation/TestOptionsWithRanges_id4.d:/home/jenkins/workspace/Test_openjdk21_hs_extended.openjdk_s390x_linux_testList_0/aqa-tests/openjdk/openjdk-jdk/test/hotspot/jtreg/runtime/CommandLine/OptionsValidation:/home/jenkins/workspace/Test_openjdk21_hs_extended.openjdk_s390x_linux_testList_0/aqa-tests/TKG/output_17509909975678/hotspot_runtime_0/work/classes/test/lib:/home/jenkins/workspace/Test_openjdk21_hs_extended.openjdk_s390x_linux_testList_0/aqa-tests/TKG/output_17509909975678/hotspot_runtime_0/work/classes/runtime/CommandLine/OptionsValidation/common \
[2025-06-27T03:26:41.961Z] -J-Dtest.modules='java.base/jdk.internal.misc java.management jdk.attach/sun.tools.attach jdk.internal.jvmstat/sun.jvmstat.monitor' \
[2025-06-27T03:26:41.961Z] --add-modules java.base,java.management,jdk.attach,jdk.internal.jvmstat \
[2025-06-27T03:26:41.961Z] --add-exports java.base/jdk.internal.misc=ALL-UNNAMED \
[2025-06-27T03:26:41.961Z] --add-exports jdk.attach/sun.tools.attach=ALL-UNNAMED \
[2025-06-27T03:26:41.961Z] --add-exports jdk.internal.jvmstat/sun.jvmstat.monitor=ALL-UNNAMED \
[2025-06-27T03:26:41.961Z] -d /home/jenkins/workspace/Test_openjdk21_hs_extended.openjdk_s390x_linux_testList_0/aqa-tests/TKG/output_17509909975678/hotspot_runtime_0/work/classes/runtime/CommandLine/OptionsValidation/TestOptionsWithRanges_id4.d \
[2025-06-27T03:26:41.961Z] -sourcepath /home/jenkins/workspace/Test_openjdk21_hs_extended.openjdk_s390x_linux_testList_0/aqa-tests/openjdk/openjdk-jdk/test/hotspot/jtreg/runtime/CommandLine/OptionsValidation:/home/jenkins/workspace/Test_openjdk21_hs_extended.openjdk_s390x_linux_testList_0/aqa-tests/openjdk/openjdk-jdk/test/lib:/home/jenkins/workspace/Test_openjdk21_hs_extended.openjdk_s390x_linux_testList_0/aqa-tests/openjdk/openjdk-jdk/test/hotspot/jtreg/runtime/CommandLine/OptionsValidation/common \
[2025-06-27T03:26:41.961Z] -classpath /home/jenkins/workspace/Test_openjdk21_hs_extended.openjdk_s390x_linux_testList_0/aqa-tests/openjdk/openjdk-jdk/test/hotspot/jtreg/runtime/CommandLine/OptionsValidation:/home/jenkins/workspace/Test_openjdk21_hs_extended.openjdk_s390x_linux_testList_0/aqa-tests/TKG/output_17509909975678/hotspot_runtime_0/work/classes/runtime/CommandLine/OptionsValidation/TestOptionsWithRanges_id4.d:/home/jenkins/workspace/Test_openjdk21_hs_extended.openjdk_s390x_linux_testList_0/aqa-tests/TKG/output_17509909975678/hotspot_runtime_0/work/classes/test/lib:/home/jenkins/workspace/Test_openjdk21_hs_extended.openjdk_s390x_linux_testList_0/aqa-tests/TKG/output_17509909975678/hotspot_runtime_0/work/classes/runtime/CommandLine/OptionsValidation/common /home/jenkins/workspace/Test_openjdk21_hs_extended.openjdk_s390x_linux_testList_0/aqa-tests/openjdk/openjdk-jdk/test/hotspot/jtreg/runtime/CommandLine/OptionsValidation/TestOptionsWithRanges.java
[2025-06-27T03:26:41.961Z] direct:
[2025-06-27T03:26:41.961Z] Note: /home/jenkins/workspace/Test_openjdk21_hs_extended.openjdk_s390x_linux_testList_0/aqa-tests/openjdk/openjdk-jdk/test/lib/jdk/test/lib/Asserts.java uses unchecked or unsafe operations.
[2025-06-27T03:26:41.961Z] Note: Recompile with -Xlint:unchecked for details.
[2025-06-27T03:26:41.961Z]
[2025-06-27T03:26:41.961Z] ACTION: driver -- Failed. Execution failed: `main' threw exception: java.lang.RuntimeException: 1 tests failed! (Error processing option LogEventsBufferEntries with valid value '-server -XX:+UseG1GC -XX:LogEventsBufferEntries=1048576'! JVM exited with unexpected error code = 137 [0x89]) expected: 1 but was: 0
[2025-06-27T03:26:41.961Z] REASON: User specified action: run driver/timeout=1800 TestOptionsWithRanges 5 of 10
[2025-06-27T03:26:41.961Z] TIME: 38.324 seconds
[2025-06-27T03:26:41.961Z] messages:
[2025-06-27T03:26:41.961Z] command: driver TestOptionsWithRanges 5 of 10
[2025-06-27T03:26:41.961Z] reason: User specified action: run driver/timeout=1800 TestOptionsWithRanges 5 of 10
[2025-06-27T03:26:41.961Z] started: Thu Jun 26 23:25:58 EDT 2025
[2025-06-27T03:26:41.961Z] Mode: agentvm
[2025-06-27T03:26:41.961Z] Agent id: 43
[2025-06-27T03:26:41.961Z] Additional exports to unnamed modules from @modules: java.base/jdk.internal.misc jdk.attach/sun.tools.attach jdk.internal.jvmstat/sun.jvmstat.monitor
[2025-06-27T03:26:41.961Z] finished: Thu Jun 26 23:26:36 EDT 2025
[2025-06-27T03:26:41.961Z] elapsed time (seconds): 38.324
[2025-06-27T03:26:41.961Z] configuration:
[2025-06-27T03:26:41.961Z] Boot Layer
[2025-06-27T03:26:41.961Z] class path: /home/jenkins/workspace/Test_openjdk21_hs_extended.openjdk_s390x_linux_testList_0/jvmtest/openjdk/jtreg/lib/javatest.jar
[2025-06-27T03:26:41.961Z] /home/jenkins/workspace/Test_openjdk21_hs_extended.openjdk_s390x_linux_testList_0/jvmtest/openjdk/jtreg/lib/jtreg.jar
[2025-06-27T03:26:41.961Z] /home/jenkins/workspace/Test_openjdk21_hs_extended.openjdk_s390x_linux_testList_0/jvmtest/openjdk/jtreg/lib/junit-platform-console-standalone-1.9.2.jar
[2025-06-27T03:26:41.961Z] /home/jenkins/workspace/Test_openjdk21_hs_extended.openjdk_s390x_linux_testList_0/jvmtest/openjdk/jtreg/lib/testng-7.3.0.jar
[2025-06-27T03:26:41.961Z] /home/jenkins/workspace/Test_openjdk21_hs_extended.openjdk_s390x_linux_testList_0/jvmtest/openjdk/jtreg/lib/guice-5.1.0.jar
[2025-06-27T03:26:41.961Z] /home/jenkins/workspace/Test_openjdk21_hs_extended.openjdk_s390x_linux_testList_0/jvmtest/openjdk/jtreg/lib/jcommander-1.82.jar
[2025-06-27T03:26:41.961Z] patch: java.base /home/jenkins/workspace/Test_openjdk21_hs_extended.openjdk_s390x_linux_testList_0/aqa-tests/TKG/output_17509909975678/hotspot_runtime_0/work/patches/java.base
[2025-06-27T03:26:41.961Z]
[2025-06-27T03:26:41.961Z] Test Layer
[2025-06-27T03:26:41.961Z] add exports: java.base/jdk.internal.misc ALL-UNNAMED
[2025-06-27T03:26:41.961Z] jdk.attach/sun.tools.attach ALL-UNNAMED
[2025-06-27T03:26:41.961Z] jdk.internal.jvmstat/sun.jvmstat.monitor ALL-UNNAMED
[2025-06-27T03:26:41.961Z] class path: /home/jenkins/workspace/Test_openjdk21_hs_extended.openjdk_s390x_linux_testList_0/aqa-tests/TKG/output_17509909975678/hotspot_runtime_0/work/classes/runtime/CommandLine/OptionsValidation/TestOptionsWithRanges_id4.d
[2025-06-27T03:26:41.961Z] /home/jenkins/workspace/Test_openjdk21_hs_extended.openjdk_s390x_linux_testList_0/aqa-tests/openjdk/openjdk-jdk/test/hotspot/jtreg/runtime/CommandLine/OptionsValidation
[2025-06-27T03:26:41.961Z] /home/jenkins/workspace/Test_openjdk21_hs_extended.openjdk_s390x_linux_testList_0/aqa-tests/TKG/output_17509909975678/hotspot_runtime_0/work/classes/test/lib
[2025-06-27T03:26:41.961Z] /home/jenkins/workspace/Test_openjdk21_hs_extended.openjdk_s390x_linux_testList_0/aqa-tests/openjdk/openjdk-jdk/test/lib
[2025-06-27T03:26:41.961Z] /home/jenkins/workspace/Test_openjdk21_hs_extended.openjdk_s390x_linux_testList_0/aqa-tests/TKG/output_17509909975678/hotspot_runtime_0/work/classes/runtime/CommandLine/OptionsValidation/common
[2025-06-27T03:26:41.961Z] /home/jenkins/workspace/Test_openjdk21_hs_extended.openjdk_s390x_linux_testList_0/aqa-tests/openjdk/openjdk-jdk/test/hotspot/jtreg/runtime/CommandLine/OptionsValidation/common
[2025-06-27T03:26:41.961Z]
[2025-06-27T03:26:41.961Z] rerun:
[2025-06-27T03:26:41.961Z] cd /home/jenkins/workspace/Test_openjdk21_hs_extended.openjdk_s390x_linux_testList_0/aqa-tests/TKG/output_17509909975678/hotspot_runtime_0/work/scratch && \
[2025-06-27T03:26:41.961Z] DBUS_SESSION_BUS_ADDRESS=unix:path=/run/user/1002/bus \
[2025-06-27T03:26:41.961Z] DISPLAY=:0 \
[2025-06-27T03:26:41.962Z] HOME=/home/jenkins \
[2025-06-27T03:26:41.962Z] LANG=en_US.UTF-8 \
[2025-06-27T03:26:41.962Z] PATH=/bin:/usr/bin:/usr/sbin \
[2025-06-27T03:26:41.962Z] XDG_RUNTIME_DIR=/run/user/1002 \
[2025-06-27T03:26:41.962Z] XDG_SESSION_ID=216332 \
[2025-06-27T03:26:41.962Z] /home/jenkins/workspace/Test_openjdk21_hs_extended.openjdk_s390x_linux_testList_0/jdkbinary/j2sdk-image/bin/java \
[2025-06-27T03:26:41.962Z] -Dtest.vm.opts='-ea -esa -Xmx512m' \
[2025-06-27T03:26:41.962Z] -Dtest.tool.vm.opts='-J-ea -J-esa -J-Xmx512m' \
[2025-06-27T03:26:41.962Z] -Dtest.compiler.opts= \
[2025-06-27T03:26:41.962Z] -Dtest.java.opts= \
[2025-06-27T03:26:41.962Z] -Dtest.jdk=/home/jenkins/workspace/Test_openjdk21_hs_extended.openjdk_s390x_linux_testList_0/jdkbinary/j2sdk-image \
[2025-06-27T03:26:41.962Z] -Dcompile.jdk=/home/jenkins/workspace/Test_openjdk21_hs_extended.openjdk_s390x_linux_testList_0/jdkbinary/j2sdk-image \
[2025-06-27T03:26:41.962Z] -Dtest.timeout.factor=8.0 \
[2025-06-27T03:26:41.962Z] -Dtest.nativepath=/home/jenkins/workspace/Test_openjdk21_hs_extended.openjdk_s390x_linux_testList_0/jdkbinary/openjdk-test-image/hotspot/jtreg/native \
[2025-06-27T03:26:41.962Z] -Dtest.root=/home/jenkins/workspace/Test_openjdk21_hs_extended.openjdk_s390x_linux_testList_0/aqa-tests/openjdk/openjdk-jdk/test/hotspot/jtreg \
[2025-06-27T03:26:41.962Z] -Dtest.name=runtime/CommandLine/OptionsValidation/TestOptionsWithRanges.java#id4 \
[2025-06-27T03:26:41.962Z] -Dtest.file=/home/jenkins/workspace/Test_openjdk21_hs_extended.openjdk_s390x_linux_testList_0/aqa-tests/openjdk/openjdk-jdk/test/hotspot/jtreg/runtime/CommandLine/OptionsValidation/TestOptionsWithRanges.java \
[2025-06-27T03:26:41.962Z] -Dtest.src=/home/jenkins/workspace/Test_openjdk21_hs_extended.openjdk_s390x_linux_testList_0/aqa-tests/openjdk/openjdk-jdk/test/hotspot/jtreg/runtime/CommandLine/OptionsValidation \
[2025-06-27T03:26:41.962Z] -Dtest.src.path=/home/jenkins/workspace/Test_openjdk21_hs_extended.openjdk_s390x_linux_testList_0/aqa-tests/openjdk/openjdk-jdk/test/hotspot/jtreg/runtime/CommandLine/OptionsValidation:/home/jenkins/workspace/Test_openjdk21_hs_extended.openjdk_s390x_linux_testList_0/aqa-tests/openjdk/openjdk-jdk/test/lib:/home/jenkins/workspace/Test_openjdk21_hs_extended.openjdk_s390x_linux_testList_0/aqa-tests/openjdk/openjdk-jdk/test/hotspot/jtreg/runtime/CommandLine/OptionsValidation/common \
[2025-06-27T03:26:41.962Z] -Dtest.classes=/home/jenkins/workspace/Test_openjdk21_hs_extended.openjdk_s390x_linux_testList_0/aqa-tests/TKG/output_17509909975678/hotspot_runtime_0/work/classes/runtime/CommandLine/OptionsValidation/TestOptionsWithRanges_id4.d \
[2025-06-27T03:26:41.962Z] -Dtest.class.path=/home/jenkins/workspace/Test_openjdk21_hs_extended.openjdk_s390x_linux_testList_0/aqa-tests/TKG/output_17509909975678/hotspot_runtime_0/work/classes/runtime/CommandLine/OptionsValidation/TestOptionsWithRanges_id4.d:/home/jenkins/workspace/Test_openjdk21_hs_extended.openjdk_s390x_linux_testList_0/aqa-tests/TKG/output_17509909975678/hotspot_runtime_0/work/classes/test/lib:/home/jenkins/workspace/Test_openjdk21_hs_extended.openjdk_s390x_linux_testList_0/aqa-tests/TKG/output_17509909975678/hotspot_runtime_0/work/classes/runtime/CommandLine/OptionsValidation/common \
[2025-06-27T03:26:41.962Z] -Dtest.class.path.prefix=/home/jenkins/workspace/Test_openjdk21_hs_extended.openjdk_s390x_linux_testList_0/aqa-tests/TKG/output_17509909975678/hotspot_runtime_0/work/classes/runtime/CommandLine/OptionsValidation/TestOptionsWithRanges_id4.d:/home/jenkins/workspace/Test_openjdk21_hs_extended.openjdk_s390x_linux_testList_0/aqa-tests/openjdk/openjdk-jdk/test/hotspot/jtreg/runtime/CommandLine/OptionsValidation:/home/jenkins/workspace/Test_openjdk21_hs_extended.openjdk_s390x_linux_testList_0/aqa-tests/TKG/output_17509909975678/hotspot_runtime_0/work/classes/test/lib:/home/jenkins/workspace/Test_openjdk21_hs_extended.openjdk_s390x_linux_testList_0/aqa-tests/TKG/output_17509909975678/hotspot_runtime_0/work/classes/runtime/CommandLine/OptionsValidation/common \
[2025-06-27T03:26:41.962Z] -Dtest.modules='java.base/jdk.internal.misc java.management jdk.attach/sun.tools.attach jdk.internal.jvmstat/sun.jvmstat.monitor' \
[2025-06-27T03:26:41.962Z] -classpath /home/jenkins/workspace/Test_openjdk21_hs_extended.openjdk_s390x_linux_testList_0/aqa-tests/TKG/output_17509909975678/hotspot_runtime_0/work/classes/runtime/CommandLine/OptionsValidation/TestOptionsWithRanges_id4.d:/home/jenkins/workspace/Test_openjdk21_hs_extended.openjdk_s390x_linux_testList_0/aqa-tests/openjdk/openjdk-jdk/test/hotspot/jtreg/runtime/CommandLine/OptionsValidation:/home/jenkins/workspace/Test_openjdk21_hs_extended.openjdk_s390x_linux_testList_0/aqa-tests/TKG/output_17509909975678/hotspot_runtime_0/work/classes/test/lib:/home/jenkins/workspace/Test_openjdk21_hs_extended.openjdk_s390x_linux_testList_0/aqa-tests/openjdk/openjdk-jdk/test/lib:/home/jenkins/workspace/Test_openjdk21_hs_extended.openjdk_s390x_linux_testList_0/aqa-tests/TKG/output_17509909975678/hotspot_runtime_0/work/classes/runtime/CommandLine/OptionsValidation/common:/home/jenkins/workspace/Test_openjdk21_hs_extended.openjdk_s390x_linux_testList_0/aqa-tests/openjdk/openjdk-jdk/test/hotspot/jtreg/runtime/CommandLine/OptionsValidation/common:/home/jenkins/workspace/Test_openjdk21_hs_extended.openjdk_s390x_linux_testList_0/jvmtest/openjdk/jtreg/lib/javatest.jar:/home/jenkins/workspace/Test_openjdk21_hs_extended.openjdk_s390x_linux_testList_0/jvmtest/openjdk/jtreg/lib/jtreg.jar \
[2025-06-27T03:26:41.962Z] TestOptionsWithRanges 5 of 10
[2025-06-27T03:26:41.962Z] STDOUT:
[2025-06-27T03:26:41.962Z] Command line: [/home/jenkins/workspace/Test_openjdk21_hs_extended.openjdk_s390x_linux_testList_0/jdkbinary/j2sdk-image/bin/java -cp /home/jenkins/workspace/Test_openjdk21_hs_extended.openjdk_s390x_linux_testList_0/aqa-tests/TKG/output_17509909975678/hotspot_runtime_0/work/classes/runtime/CommandLine/OptionsValidation/TestOptionsWithRanges_id4.d:/home/jenkins/workspace/Test_openjdk21_hs_extended.openjdk_s390x_linux_testList_0/aqa-tests/openjdk/openjdk-jdk/test/hotspot/jtreg/runtime/CommandLine/OptionsValidation:/home/jenkins/workspace/Test_openjdk21_hs_extended.openjdk_s390x_linux_testList_0/aqa-tests/TKG/output_17509909975678/hotspot_runtime_0/work/classes/test/lib:/home/jenkins/workspace/Test_openjdk21_hs_extended.openjdk_s390x_linux_testList_0/aqa-tests/TKG/output_17509909975678/hotspot_runtime_0/work/classes/runtime/CommandLine/OptionsValidation/common:/home/jenkins/workspace/Test_openjdk21_hs_extended.openjdk_s390x_linux_testList_0/jvmtest/openjdk/jtreg/lib/javatest.jar:/home/jenkins/workspace/Test_openjdk21_hs_extended.openjdk_s390x_linux_testList_0/jvmtest/openjdk/jtreg/lib/jtreg.jar:/home/jenkins/workspace/Test_openjdk21_hs_extended.openjdk_s390x_linux_testList_0/jvmtest/openjdk/jtreg/lib/junit-platform-console-standalone-1.9.2.jar:/home/jenkins/workspace/Test_openjdk21_hs_extended.openjdk_s390x_linux_testList_0/jvmtest/openjdk/jtreg/lib/testng-7.3.0.jar:/home/jenkins/workspace/Test_openjdk21_hs_extended.openjdk_s390x_linux_testList_0/jvmtest/openjdk/jtreg/lib/guice-5.1.0.jar:/home/jenkins/workspace/Test_openjdk21_hs_extended.openjdk_s390x_linux_testList_0/jvmtest/openjdk/jtreg/lib/jcommander-1.82.jar -server -XX:+UseG1GC -XX:+UnlockDiagnosticVMOptions -XX:+UnlockExperimentalVMOptions -XX:+PrintFlagsRanges -version ]
[2025-06-27T03:26:41.962Z] Generating subset [126 ... 158) of 32 tests out of 317 total tests
[2025-06-27T03:26:41.962Z] Parsed 32 options with ranges. Start test!
[2025-06-27T03:26:41.962Z] Testing valid LargePageHeapSizeThreshold values.
[2025-06-27T03:26:41.962Z] Command line: [/home/jenkins/workspace/Test_openjdk21_hs_extended.openjdk_s390x_linux_testList_0/jdkbinary/j2sdk-image/bin/java -cp /home/jenkins/workspace/Test_openjdk21_hs_extended.openjdk_s390x_linux_testList_0/aqa-tests/TKG/output_17509909975678/hotspot_runtime_0/work/classes/runtime/CommandLine/OptionsValidation/TestOptionsWithRanges_id4.d:/home/jenkins/workspace/Test_openjdk21_hs_extended.openjdk_s390x_linux_testList_0/aqa-tests/openjdk/openjdk-jdk/test/hotspot/jtreg/runtime/CommandLine/OptionsValidation:/home/jenkins/workspace/Test_openjdk21_hs_extended.openjdk_s390x_linux_testList_0/aqa-tests/TKG/output_17509909975678/hotspot_runtime_0/work/classes/test/lib:/home/jenkins/workspace/Test_openjdk21_hs_extended.openjdk_s390x_linux_testList_0/aqa-tests/TKG/output_17509909975678/hotspot_runtime_0/work/classes/runtime/CommandLine/OptionsValidation/common:/home/jenkins/workspace/Test_openjdk21_hs_extended.openjdk_s390x_linux_testList_0/jvmtest/openjdk/jtreg/lib/javatest.jar:/home/jenkins/workspace/Test_openjdk21_hs_extended.openjdk_s390x_linux_testList_0/jvmtest/openjdk/jtreg/lib/jtreg.jar:/home/jenkins/workspace/Test_openjdk21_hs_extended.openjdk_s390x_linux_testList_0/jvmtest/openjdk/jtreg/lib/junit-platform-console-standalone-1.9.2.jar:/home/jenkins/workspace/Test_openjdk21_hs_extended.openjdk_s390x_linux_testList_0/jvmtest/openjdk/jtreg/lib/testng-7.3.0.jar:/home/jenkins/workspace/Test_openjdk21_hs_extended.openjdk_s390x_linux_testList_0/jvmtest/openjdk/jtreg/lib/guice-5.1.0.jar:/home/jenkins/workspace/Test_openjdk21_hs_extended.openjdk_s390x_linux_testList_0/jvmtest/openjdk/jtreg/lib/jcommander-1.82.jar -server -XX:+UseG1GC -XX:+UnlockDiagnosticVMOptions -XX:+UnlockExperimentalVMOptions -XX:LargePageHeapSizeThreshold=0 optionsvalidation.JVMStartup ]
[2025-06-27T03:26:41.962Z] [2025-06-27T03:25:58.582443466Z] Gathering output for process 848320
[2025-06-27T03:26:41.962Z] [2025-06-27T03:25:58.589161035Z] Waiting for completion for process 848320
[2025-06-27T03:26:41.962Z] [2025-06-27T03:25:58.664909486Z] Waiting for completion finished for process 848320
[2025-06-27T03:26:41.962Z]
[2025-06-27T03:26:41.962Z] Command line: [/home/jenkins/workspace/Test_openjdk21_hs_extended.openjdk_s390x_linux_testList_0/jdkbinary/j2sdk-image/bin/java -cp /home/jenkins/workspace/Test_openjdk21_hs_extended.openjdk_s390x_linux_testList_0/aqa-tests/TKG/output_17509909975678/hotspot_runtime_0/work/classes/runtime/CommandLine/OptionsValidation/TestOptionsWithRanges_id4.d:/home/jenkins/workspace/Test_openjdk21_hs_extended.openjdk_s390x_linux_testList_0/aqa-tests/openjdk/openjdk-jdk/test/hotspot/jtreg/runtime/CommandLine/OptionsValidation:/home/jenkins/workspace/Test_openjdk21_hs_extended.openjdk_s390x_linux_testList_0/aqa-tests/TKG/output_17509909975678/hotspot_runtime_0/work/classes/test/lib:/home/jenkins/workspace/Test_openjdk21_hs_extended.openjdk_s390x_linux_testList_0/aqa-tests/TKG/output_17509909975678/hotspot_runtime_0/work/classes/runtime/CommandLine/OptionsValidation/common:/home/jenkins/workspace/Test_openjdk21_hs_extended.openjdk_s390x_linux_testList_0/jvmtest/openjdk/jtreg/lib/javatest.jar:/home/jenkins/workspace/Test_openjdk21_hs_extended.openjdk_s390x_linux_testList_0/jvmtest/openjdk/jtreg/lib/jtreg.jar:/home/jenkins/workspace/Test_openjdk21_hs_extended.openjdk_s390x_linux_testList_0/jvmtest/openjdk/jtreg/lib/junit-platform-console-standalone-1.9.2.jar:/home/jenkins/workspace/Test_openjdk21_hs_extended.openjdk_s390x_linux_testList_0/jvmtest/openjdk/jtreg/lib/testng-7.3.0.jar:/home/jenkins/workspace/Test_openjdk21_hs_extended.openjdk_s390x_linux_testList_0/jvmtest/openjdk/jtreg/lib/guice-5.1.0.jar:/home/jenkins/workspace/Test_openjdk21_hs_extended.openjdk_s390x_linux_testList_0/jvmtest/openjdk/jtreg/lib/jcommander-1.82.jar -server -XX:+UseG1GC -XX:+UnlockDiagnosticVMOptions -XX:+UnlockExperimentalVMOptions -XX:LargePageHeapSizeThreshold=18446744073709551615 optionsvalidation.JVMStartup ]
[2025-06-27T03:26:41.962Z] [2025-06-27T03:25:58.676135451Z] Gathering output for process 848341
[2025-06-27T03:26:41.962Z] [2025-06-27T03:25:58.679063116Z] Waiting for completion for process 848341
[2025-06-27T03:26:41.962Z] [2025-06-27T03:25:58.767198866Z] Waiting for completion finished for process 848341
[2025-06-27T03:26:41.962Z]
[2025-06-27T03:26:41.962Z] Command line: [/home/jenkins/workspace/Test_openjdk21_hs_extended.openjdk_s390x_linux_testList_0/jdkbinary/j2sdk-image/bin/java -cp /home/jenkins/workspace/Test_openjdk21_hs_extended.openjdk_s390x_linux_testList_0/aqa-tests/TKG/output_17509909975678/hotspot_runtime_0/work/classes/runtime/CommandLine/OptionsValidation/TestOptionsWithRanges_id4.d:/home/jenkins/workspace/Test_openjdk21_hs_extended.openjdk_s390x_linux_testList_0/aqa-tests/openjdk/openjdk-jdk/test/hotspot/jtreg/runtime/CommandLine/OptionsValidation:/home/jenkins/workspace/Test_openjdk21_hs_extended.openjdk_s390x_linux_testList_0/aqa-tests/TKG/output_17509909975678/hotspot_runtime_0/work/classes/test/lib:/home/jenkins/workspace/Test_openjdk21_hs_extended.openjdk_s390x_linux_testList_0/aqa-tests/TKG/output_17509909975678/hotspot_runtime_0/work/classes/runtime/CommandLine/OptionsValidation/common:/home/jenkins/workspace/Test_openjdk21_hs_extended.openjdk_s390x_linux_testList_0/jvmtest/openjdk/jtreg/lib/javatest.jar:/home/jenkins/workspace/Test_openjdk21_hs_extended.openjdk_s390x_linux_testList_0/jvmtest/openjdk/jtreg/lib/jtreg.jar:/home/jenkins/workspace/Test_openjdk21_hs_extended.openjdk_s390x_linux_testList_0/jvmtest/openjdk/jtreg/lib/junit-platform-console-standalone-1.9.2.jar:/home/jenkins/workspace/Test_openjdk21_hs_extended.openjdk_s390x_linux_testList_0/jvmtest/openjdk/jtreg/lib/testng-7.3.0.jar:/home/jenkins/workspace/Test_openjdk21_hs_extended.openjdk_s390x_linux_testList_0/jvmtest/openjdk/jtreg/lib/guice-5.1.0.jar:/home/jenkins/workspace/Test_openjdk21_hs_extended.openjdk_s390x_linux_testList_0/jvmtest/openjdk/jtreg/lib/jcommander-1.82.jar -server -XX:+UseG1GC -XX:+UnlockDiagnosticVMOptions -XX:+UnlockExperimentalVMOptions -XX:LargePageHeapSizeThreshold=1 optionsvalidation.JVMStartup ]
[2025-06-27T03:26:41.962Z] [2025-06-27T03:25:58.776902697Z] Gathering output for process 848362
[2025-06-27T03:26:41.962Z] [2025-06-27T03:25:58.787439073Z] Waiting for completion for process 848362
[2025-06-27T03:26:41.962Z] [2025-06-27T03:25:58.921354145Z] Waiting for completion finished for process 848362
[2025-06-27T03:26:41.962Z]
[2025-06-27T03:26:41.962Z] Command line: [/home/jenkins/workspace/Test_openjdk21_hs_extended.openjdk_s390x_linux_testList_0/jdkbinary/j2sdk-image/bin/java -cp /home/jenkins/workspace/Test_openjdk21_hs_extended.openjdk_s390x_linux_testList_0/aqa-tests/TKG/output_17509909975678/hotspot_runtime_0/work/classes/runtime/CommandLine/OptionsValidation/TestOptionsWithRanges_id4.d:/home/jenkins/workspace/Test_openjdk21_hs_extended.openjdk_s390x_linux_testList_0/aqa-tests/openjdk/openjdk-jdk/test/hotspot/jtreg/runtime/CommandLine/OptionsValidation:/home/jenkins/workspace/Test_openjdk21_hs_extended.openjdk_s390x_linux_testList_0/aqa-tests/TKG/output_17509909975678/hotspot_runtime_0/work/classes/test/lib:/home/jenkins/workspace/Test_openjdk21_hs_extended.openjdk_s390x_linux_testList_0/aqa-tests/TKG/output_17509909975678/hotspot_runtime_0/work/classes/runtime/CommandLine/OptionsValidation/common:/home/jenkins/workspace/Test_openjdk21_hs_extended.openjdk_s390x_linux_testList_0/jvmtest/openjdk/jtreg/lib/javatest.jar:/home/jenkins/workspace/Test_openjdk21_hs_extended.openjdk_s390x_linux_testList_0/jvmtest/openjdk/jtreg/lib/jtreg.jar:/home/jenkins/workspace/Test_openjdk21_hs_extended.openjdk_s390x_linux_testList_0/jvmtest/openjdk/jtreg/lib/junit-platform-console-standalone-1.9.2.jar:/home/jenkins/workspace/Test_openjdk21_hs_extended.openjdk_s390x_linux_testList_0/jvmtest/openjdk/jtreg/lib/testng-7.3.0.jar:/home/jenkins/workspace/Test_openjdk21_hs_extended.openjdk_s390x_linux_testList_0/jvmtest/openjdk/jtreg/lib/guice-5.1.0.jar:/home/jenkins/workspace/Test_openjdk21_hs_extended.openjdk_s390x_linux_testList_0/jvmtest/openjdk/jtreg/lib/jcommander-1.82.jar -server -XX:+UseG1GC -XX:+UnlockDiagnosticVMOptions -XX:+UnlockExperimentalVMOptions -XX:LargePageHeapSizeThreshold=2147483648 optionsvalidation.JVMStartup ]
[2025-06-27T03:26:41.962Z] [2025-06-27T03:25:58.928092426Z] Gathering output for process 848383
[2025-06-27T03:26:41.962Z] [2025-06-27T03:25:58.932414344Z] Waiting for completion for process 848383
[2025-06-27T03:26:41.962Z] [2025-06-27T03:25:59.048960975Z] Waiting for completion finished for process 848383
[2025-06-27T03:26:41.962Z]
[2025-06-27T03:26:41.962Z] Command line: [/home/jenkins/workspace/Test_openjdk21_hs_extended.openjdk_s390x_linux_testList_0/jdkbinary/j2sdk-image/bin/java -cp /home/jenkins/workspace/Test_openjdk21_hs_extended.openjdk_s390x_linux_testList_0/aqa-tests/TKG/output_17509909975678/hotspot_runtime_0/work/classes/runtime/CommandLine/OptionsValidation/TestOptionsWithRanges_id4.d:/home/jenkins/workspace/Test_openjdk21_hs_extended.openjdk_s390x_linux_testList_0/aqa-tests/openjdk/openjdk-jdk/test/hotspot/jtreg/runtime/CommandLine/OptionsValidation:/home/jenkins/workspace/Test_openjdk21_hs_extended.openjdk_s390x_linux_testList_0/aqa-tests/TKG/output_17509909975678/hotspot_runtime_0/work/classes/test/lib:/home/jenkins/workspace/Test_openjdk21_hs_extended.openjdk_s390x_linux_testList_0/aqa-tests/TKG/output_17509909975678/hotspot_runtime_0/work/classes/runtime/CommandLine/OptionsValidation/common:/home/jenkins/workspace/Test_openjdk21_hs_extended.openjdk_s390x_linux_testList_0/jvmtest/openjdk/jtreg/lib/javatest.jar:/home/jenkins/workspace/Test_openjdk21_hs_extended.openjdk_s390x_linux_testList_0/jvmtest/openjdk/jtreg/lib/jtreg.jar:/home/jenkins/workspace/Test_openjdk21_hs_extended.openjdk_s390x_linux_testList_0/jvmtest/openjdk/jtreg/lib/junit-platform-console-standalone-1.9.2.jar:/home/jenkins/workspace/Test_openjdk21_hs_extended.openjdk_s390x_linux_testList_0/jvmtest/openjdk/jtreg/lib/testng-7.3.0.jar:/home/jenkins/workspace/Test_openjdk21_hs_extended.openjdk_s390x_linux_testList_0/jvmtest/openjdk/jtreg/lib/guice-5.1.0.jar:/home/jenkins/workspace/Test_openjdk21_hs_extended.openjdk_s390x_linux_testList_0/jvmtest/openjdk/jtreg/lib/jcommander-1.82.jar -server -XX:+UseG1GC -XX:+UnlockDiagnosticVMOptions -XX:+UnlockExperimentalVMOptions -XX:LargePageHeapSizeThreshold=4294967296 optionsvalidation.JVMStartup ]
[2025-06-27T03:26:41.962Z] [2025-06-27T03:25:59.051171544Z] Gathering output for process 848404
[2025-06-27T03:26:41.962Z] [2025-06-27T03:25:59.051489421Z] Waiting for completion for process 848404
[2025-06-27T03:26:41.962Z] [2025-06-27T03:25:59.205884374Z] Waiting for completion finished for process 848404
[2025-06-27T03:26:41.962Z]
[2025-06-27T03:26:41.962Z] Testing valid LargePageSizeInBytes values.
[2025-06-27T03:26:41.962Z] Command line: [/home/jenkins/workspace/Test_openjdk21_hs_extended.openjdk_s390x_linux_testList_0/jdkbinary/j2sdk-image/bin/java -cp /home/jenkins/workspace/Test_openjdk21_hs_extended.openjdk_s390x_linux_testList_0/aqa-tests/TKG/output_17509909975678/hotspot_runtime_0/work/classes/runtime/CommandLine/OptionsValidation/TestOptionsWithRanges_id4.d:/home/jenkins/workspace/Test_openjdk21_hs_extended.openjdk_s390x_linux_testList_0/aqa-tests/openjdk/openjdk-jdk/test/hotspot/jtreg/runtime/CommandLine/OptionsValidation:/home/jenkins/workspace/Test_openjdk21_hs_extended.openjdk_s390x_linux_testList_0/aqa-tests/TKG/output_17509909975678/hotspot_runtime_0/work/classes/test/lib:/home/jenkins/workspace/Test_openjdk21_hs_extended.openjdk_s390x_linux_testList_0/aqa-tests/TKG/output_17509909975678/hotspot_runtime_0/work/classes/runtime/CommandLine/OptionsValidation/common:/home/jenkins/workspace/Test_openjdk21_hs_extended.openjdk_s390x_linux_testList_0/jvmtest/openjdk/jtreg/lib/javatest.jar:/home/jenkins/workspace/Test_openjdk21_hs_extended.openjdk_s390x_linux_testList_0/jvmtest/openjdk/jtreg/lib/jtreg.jar:/home/jenkins/workspace/Test_openjdk21_hs_extended.openjdk_s390x_linux_testList_0/jvmtest/openjdk/jtreg/lib/junit-platform-console-standalone-1.9.2.jar:/home/jenkins/workspace/Test_openjdk21_hs_extended.openjdk_s390x_linux_testList_0/jvmtest/openjdk/jtreg/lib/testng-7.3.0.jar:/home/jenkins/workspace/Test_openjdk21_hs_extended.openjdk_s390x_linux_testList_0/jvmtest/openjdk/jtreg/lib/guice-5.1.0.jar:/home/jenkins/workspace/Test_openjdk21_hs_extended.openjdk_s390x_linux_testList_0/jvmtest/openjdk/jtreg/lib/jcommander-1.82.jar -server -XX:+UseG1GC -XX:+UnlockDiagnosticVMOptions -XX:+UnlockExperimentalVMOptions -XX:LargePageSizeInBytes=0 optionsvalidation.JVMStartup ]
[2025-06-27T03:26:41.962Z] [2025-06-27T03:25:59.218431980Z] Gathering output for process 848425
[2025-06-27T03:26:41.962Z] [2025-06-27T03:25:59.219299482Z] Waiting for completion for process 848425
[2025-06-27T03:26:41.962Z] [2025-06-27T03:25:59.296175453Z] Waiting for completion finished for process 848425
[2025-06-27T03:26:41.962Z]
[2025-06-27T03:26:41.962Z] Command line: [/home/jenkins/workspace/Test_openjdk21_hs_extended.openjdk_s390x_linux_testList_0/jdkbinary/j2sdk-image/bin/java -cp /home/jenkins/workspace/Test_openjdk21_hs_extended.openjdk_s390x_linux_testList_0/aqa-tests/TKG/output_17509909975678/hotspot_runtime_0/work/classes/runtime/CommandLine/OptionsValidation/TestOptionsWithRanges_id4.d:/home/jenkins/workspace/Test_openjdk21_hs_extended.openjdk_s390x_linux_testList_0/aqa-tests/openjdk/openjdk-jdk/test/hotspot/jtreg/runtime/CommandLine/OptionsValidation:/home/jenkins/workspace/Test_openjdk21_hs_extended.openjdk_s390x_linux_testList_0/aqa-tests/TKG/output_17509909975678/hotspot_runtime_0/work/classes/test/lib:/home/jenkins/workspace/Test_openjdk21_hs_extended.openjdk_s390x_linux_testList_0/aqa-tests/TKG/output_17509909975678/hotspot_runtime_0/work/classes/runtime/CommandLine/OptionsValidation/common:/home/jenkins/workspace/Test_openjdk21_hs_extended.openjdk_s390x_linux_testList_0/jvmtest/openjdk/jtreg/lib/javatest.jar:/home/jenkins/workspace/Test_openjdk21_hs_extended.openjdk_s390x_linux_testList_0/jvmtest/openjdk/jtreg/lib/jtreg.jar:/home/jenkins/workspace/Test_openjdk21_hs_extended.openjdk_s390x_linux_testList_0/jvmtest/openjdk/jtreg/lib/junit-platform-console-standalone-1.9.2.jar:/home/jenkins/workspace/Test_openjdk21_hs_extended.openjdk_s390x_linux_testList_0/jvmtest/openjdk/jtreg/lib/testng-7.3.0.jar:/home/jenkins/workspace/Test_openjdk21_hs_extended.openjdk_s390x_linux_testList_0/jvmtest/openjdk/jtreg/lib/guice-5.1.0.jar:/home/jenkins/workspace/Test_openjdk21_hs_extended.openjdk_s390x_linux_testList_0/jvmtest/openjdk/jtreg/lib/jcommander-1.82.jar -server -XX:+UseG1GC -XX:+UnlockDiagnosticVMOptions -XX:+UnlockExperimentalVMOptions -XX:LargePageSizeInBytes=18446744073709551615 optionsvalidation.JVMStartup ]
[2025-06-27T03:26:41.962Z] [2025-06-27T03:25:59.304961909Z] Gathering output for process 848448
[2025-06-27T03:26:41.962Z] [2025-06-27T03:25:59.305285159Z] Waiting for completion for process 848448
[2025-06-27T03:26:41.962Z] [2025-06-27T03:25:59.486204070Z] Waiting for completion finished for process 848448
[2025-06-27T03:26:41.962Z]
[2025-06-27T03:26:41.962Z] Command line: [/home/jenkins/workspace/Test_openjdk21_hs_extended.openjdk_s390x_linux_testList_0/jdkbinary/j2sdk-image/bin/java -cp /home/jenkins/workspace/Test_openjdk21_hs_extended.openjdk_s390x_linux_testList_0/aqa-tests/TKG/output_17509909975678/hotspot_runtime_0/work/classes/runtime/CommandLine/OptionsValidation/TestOptionsWithRanges_id4.d:/home/jenkins/workspace/Test_openjdk21_hs_extended.openjdk_s390x_linux_testList_0/aqa-tests/openjdk/openjdk-jdk/test/hotspot/jtreg/runtime/CommandLine/OptionsValidation:/home/jenkins/workspace/Test_openjdk21_hs_extended.openjdk_s390x_linux_testList_0/aqa-tests/TKG/output_17509909975678/hotspot_runtime_0/work/classes/test/lib:/home/jenkins/workspace/Test_openjdk21_hs_extended.openjdk_s390x_linux_testList_0/aqa-tests/TKG/output_17509909975678/hotspot_runtime_0/work/classes/runtime/CommandLine/OptionsValidation/common:/home/jenkins/workspace/Test_openjdk21_hs_extended.openjdk_s390x_linux_testList_0/jvmtest/openjdk/jtreg/lib/javatest.jar:/home/jenkins/workspace/Test_openjdk21_hs_extended.openjdk_s390x_linux_testList_0/jvmtest/openjdk/jtreg/lib/jtreg.jar:/home/jenkins/workspace/Test_openjdk21_hs_extended.openjdk_s390x_linux_testList_0/jvmtest/openjdk/jtreg/lib/junit-platform-console-standalone-1.9.2.jar:/home/jenkins/workspace/Test_openjdk21_hs_extended.openjdk_s390x_linux_testList_0/jvmtest/openjdk/jtreg/lib/testng-7.3.0.jar:/home/jenkins/workspace/Test_openjdk21_hs_extended.openjdk_s390x_linux_testList_0/jvmtest/openjdk/jtreg/lib/guice-5.1.0.jar:/home/jenkins/workspace/Test_openjdk21_hs_extended.openjdk_s390x_linux_testList_0/jvmtest/openjdk/jtreg/lib/jcommander-1.82.jar -server -XX:+UseG1GC -XX:+UnlockDiagnosticVMOptions -XX:+UnlockExperimentalVMOptions -XX:LargePageSizeInBytes=1 optionsvalidation.JVMStartup ]
[2025-06-27T03:26:41.962Z] [2025-06-27T03:25:59.495140268Z] Gathering output for process 848469
[2025-06-27T03:26:41.962Z] [2025-06-27T03:25:59.495499258Z] Waiting for completion for process 848469
[2025-06-27T03:26:41.962Z] [2025-06-27T03:25:59.597149480Z] Waiting for completion finished for process 848469
[2025-06-27T03:26:41.962Z]
[2025-06-27T03:26:41.963Z] Command line: [/home/jenkins/workspace/Test_openjdk21_hs_extended.openjdk_s390x_linux_testList_0/jdkbinary/j2sdk-image/bin/java -cp /home/jenkins/workspace/Test_openjdk21_hs_extended.openjdk_s390x_linux_testList_0/aqa-tests/TKG/output_17509909975678/hotspot_runtime_0/work/classes/runtime/CommandLine/OptionsValidation/TestOptionsWithRanges_id4.d:/home/jenkins/workspace/Test_openjdk21_hs_extended.openjdk_s390x_linux_testList_0/aqa-tests/openjdk/openjdk-jdk/test/hotspot/jtreg/runtime/CommandLine/OptionsValidation:/home/jenkins/workspace/Test_openjdk21_hs_extended.openjdk_s390x_linux_testList_0/aqa-tests/TKG/output_17509909975678/hotspot_runtime_0/work/classes/test/lib:/home/jenkins/workspace/Test_openjdk21_hs_extended.openjdk_s390x_linux_testList_0/aqa-tests/TKG/output_17509909975678/hotspot_runtime_0/work/classes/runtime/CommandLine/OptionsValidation/common:/home/jenkins/workspace/Test_openjdk21_hs_extended.openjdk_s390x_linux_testList_0/jvmtest/openjdk/jtreg/lib/javatest.jar:/home/jenkins/workspace/Test_openjdk21_hs_extended.openjdk_s390x_linux_testList_0/jvmtest/openjdk/jtreg/lib/jtreg.jar:/home/jenkins/workspace/Test_openjdk21_hs_extended.openjdk_s390x_linux_testList_0/jvmtest/openjdk/jtreg/lib/junit-platform-console-standalone-1.9.2.jar:/home/jenkins/workspace/Test_openjdk21_hs_extended.openjdk_s390x_linux_testList_0/jvmtest/openjdk/jtreg/lib/testng-7.3.0.jar:/home/jenkins/workspace/Test_openjdk21_hs_extended.openjdk_s390x_linux_testList_0/jvmtest/openjdk/jtreg/lib/guice-5.1.0.jar:/home/jenkins/workspace/Test_openjdk21_hs_extended.openjdk_s390x_linux_testList_0/jvmtest/openjdk/jtreg/lib/jcommander-1.82.jar -server -XX:+UseG1GC -XX:+UnlockDiagnosticVMOptions -XX:+UnlockExperimentalVMOptions -XX:LargePageSizeInBytes=2147483648 optionsvalidation.JVMStartup ]
[2025-06-27T03:26:41.963Z] [2025-06-27T03:25:59.603336069Z] Gathering output for process 848490
[2025-06-27T03:26:41.963Z] [2025-06-27T03:25:59.603642271Z] Waiting for completion for process 848490
[2025-06-27T03:26:41.963Z] [2025-06-27T03:25:59.714438957Z] Waiting for completion finished for process 848490
[2025-06-27T03:26:41.963Z]
[2025-06-27T03:26:41.963Z] Command line: [/home/jenkins/workspace/Test_openjdk21_hs_extended.openjdk_s390x_linux_testList_0/jdkbinary/j2sdk-image/bin/java -cp /home/jenkins/workspace/Test_openjdk21_hs_extended.openjdk_s390x_linux_testList_0/aqa-tests/TKG/output_17509909975678/hotspot_runtime_0/work/classes/runtime/CommandLine/OptionsValidation/TestOptionsWithRanges_id4.d:/home/jenkins/workspace/Test_openjdk21_hs_extended.openjdk_s390x_linux_testList_0/aqa-tests/openjdk/openjdk-jdk/test/hotspot/jtreg/runtime/CommandLine/OptionsValidation:/home/jenkins/workspace/Test_openjdk21_hs_extended.openjdk_s390x_linux_testList_0/aqa-tests/TKG/output_17509909975678/hotspot_runtime_0/work/classes/test/lib:/home/jenkins/workspace/Test_openjdk21_hs_extended.openjdk_s390x_linux_testList_0/aqa-tests/TKG/output_17509909975678/hotspot_runtime_0/work/classes/runtime/CommandLine/OptionsValidation/common:/home/jenkins/workspace/Test_openjdk21_hs_extended.openjdk_s390x_linux_testList_0/jvmtest/openjdk/jtreg/lib/javatest.jar:/home/jenkins/workspace/Test_openjdk21_hs_extended.openjdk_s390x_linux_testList_0/jvmtest/openjdk/jtreg/lib/jtreg.jar:/home/jenkins/workspace/Test_openjdk21_hs_extended.openjdk_s390x_linux_testList_0/jvmtest/openjdk/jtreg/lib/junit-platform-console-standalone-1.9.2.jar:/home/jenkins/workspace/Test_openjdk21_hs_extended.openjdk_s390x_linux_testList_0/jvmtest/openjdk/jtreg/lib/testng-7.3.0.jar:/home/jenkins/workspace/Test_openjdk21_hs_extended.openjdk_s390x_linux_testList_0/jvmtest/openjdk/jtreg/lib/guice-5.1.0.jar:/home/jenkins/workspace/Test_openjdk21_hs_extended.openjdk_s390x_linux_testList_0/jvmtest/openjdk/jtreg/lib/jcommander-1.82.jar -server -XX:+UseG1GC -XX:+UnlockDiagnosticVMOptions -XX:+UnlockExperimentalVMOptions -XX:LargePageSizeInBytes=4294967296 optionsvalidation.JVMStartup ]
[2025-06-27T03:26:41.963Z] [2025-06-27T03:25:59.720854689Z] Gathering output for process 848511
[2025-06-27T03:26:41.963Z] [2025-06-27T03:25:59.723043071Z] Waiting for completion for process 848511
[2025-06-27T03:26:41.963Z] [2025-06-27T03:25:59.769096874Z] Waiting for completion finished for process 848511
[2025-06-27T03:26:41.963Z]
[2025-06-27T03:26:41.963Z] Testing valid LiveNodeCountInliningCutoff values.
[2025-06-27T03:26:41.963Z] Command line: [/home/jenkins/workspace/Test_openjdk21_hs_extended.openjdk_s390x_linux_testList_0/jdkbinary/j2sdk-image/bin/java -cp /home/jenkins/workspace/Test_openjdk21_hs_extended.openjdk_s390x_linux_testList_0/aqa-tests/TKG/output_17509909975678/hotspot_runtime_0/work/classes/runtime/CommandLine/OptionsValidation/TestOptionsWithRanges_id4.d:/home/jenkins/workspace/Test_openjdk21_hs_extended.openjdk_s390x_linux_testList_0/aqa-tests/openjdk/openjdk-jdk/test/hotspot/jtreg/runtime/CommandLine/OptionsValidation:/home/jenkins/workspace/Test_openjdk21_hs_extended.openjdk_s390x_linux_testList_0/aqa-tests/TKG/output_17509909975678/hotspot_runtime_0/work/classes/test/lib:/home/jenkins/workspace/Test_openjdk21_hs_extended.openjdk_s390x_linux_testList_0/aqa-tests/TKG/output_17509909975678/hotspot_runtime_0/work/classes/runtime/CommandLine/OptionsValidation/common:/home/jenkins/workspace/Test_openjdk21_hs_extended.openjdk_s390x_linux_testList_0/jvmtest/openjdk/jtreg/lib/javatest.jar:/home/jenkins/workspace/Test_openjdk21_hs_extended.openjdk_s390x_linux_testList_0/jvmtest/openjdk/jtreg/lib/jtreg.jar:/home/jenkins/workspace/Test_openjdk21_hs_extended.openjdk_s390x_linux_testList_0/jvmtest/openjdk/jtreg/lib/junit-platform-console-standalone-1.9.2.jar:/home/jenkins/workspace/Test_openjdk21_hs_extended.openjdk_s390x_linux_testList_0/jvmtest/openjdk/jtreg/lib/testng-7.3.0.jar:/home/jenkins/workspace/Test_openjdk21_hs_extended.openjdk_s390x_linux_testList_0/jvmtest/openjdk/jtreg/lib/guice-5.1.0.jar:/home/jenkins/workspace/Test_openjdk21_hs_extended.openjdk_s390x_linux_testList_0/jvmtest/openjdk/jtreg/lib/jcommander-1.82.jar -server -XX:+UseG1GC -XX:+UnlockDiagnosticVMOptions -XX:+UnlockExperimentalVMOptions -XX:LiveNodeCountInliningCutoff=0 optionsvalidation.JVMStartup ]
[2025-06-27T03:26:41.963Z] [2025-06-27T03:25:59.775628976Z] Gathering output for process 848532
[2025-06-27T03:26:41.963Z] [2025-06-27T03:25:59.777875139Z] Waiting for completion for process 848532
[2025-06-27T03:26:41.963Z] [2025-06-27T03:25:59.847754097Z] Waiting for completion finished for process 848532
[2025-06-27T03:26:41.963Z]
[2025-06-27T03:26:41.963Z] Command line: [/home/jenkins/workspace/Test_openjdk21_hs_extended.openjdk_s390x_linux_testList_0/jdkbinary/j2sdk-image/bin/java -cp /home/jenkins/workspace/Test_openjdk21_hs_extended.openjdk_s390x_linux_testList_0/aqa-tests/TKG/output_17509909975678/hotspot_runtime_0/work/classes/runtime/CommandLine/OptionsValidation/TestOptionsWithRanges_id4.d:/home/jenkins/workspace/Test_openjdk21_hs_extended.openjdk_s390x_linux_testList_0/aqa-tests/openjdk/openjdk-jdk/test/hotspot/jtreg/runtime/CommandLine/OptionsValidation:/home/jenkins/workspace/Test_openjdk21_hs_extended.openjdk_s390x_linux_testList_0/aqa-tests/TKG/output_17509909975678/hotspot_runtime_0/work/classes/test/lib:/home/jenkins/workspace/Test_openjdk21_hs_extended.openjdk_s390x_linux_testList_0/aqa-tests/TKG/output_17509909975678/hotspot_runtime_0/work/classes/runtime/CommandLine/OptionsValidation/common:/home/jenkins/workspace/Test_openjdk21_hs_extended.openjdk_s390x_linux_testList_0/jvmtest/openjdk/jtreg/lib/javatest.jar:/home/jenkins/workspace/Test_openjdk21_hs_extended.openjdk_s390x_linux_testList_0/jvmtest/openjdk/jtreg/lib/jtreg.jar:/home/jenkins/workspace/Test_openjdk21_hs_extended.openjdk_s390x_linux_testList_0/jvmtest/openjdk/jtreg/lib/junit-platform-console-standalone-1.9.2.jar:/home/jenkins/workspace/Test_openjdk21_hs_extended.openjdk_s390x_linux_testList_0/jvmtest/openjdk/jtreg/lib/testng-7.3.0.jar:/home/jenkins/workspace/Test_openjdk21_hs_extended.openjdk_s390x_linux_testList_0/jvmtest/openjdk/jtreg/lib/guice-5.1.0.jar:/home/jenkins/workspace/Test_openjdk21_hs_extended.openjdk_s390x_linux_testList_0/jvmtest/openjdk/jtreg/lib/jcommander-1.82.jar -server -XX:+UseG1GC -XX:+UnlockDiagnosticVMOptions -XX:+UnlockExperimentalVMOptions -XX:LiveNodeCountInliningCutoff=536870911 optionsvalidation.JVMStartup ]
[2025-06-27T03:26:41.963Z] [2025-06-27T03:25:59.852557780Z] Gathering output for process 848553
[2025-06-27T03:26:41.963Z] [2025-06-27T03:25:59.852962912Z] Waiting for completion for process 848553
[2025-06-27T03:26:41.963Z] [2025-06-27T03:25:59.928797857Z] Waiting for completion finished for process 848553
[2025-06-27T03:26:41.963Z]
[2025-06-27T03:26:41.963Z] Command line: [/home/jenkins/workspace/Test_openjdk21_hs_extended.openjdk_s390x_linux_testList_0/jdkbinary/j2sdk-image/bin/java -cp /home/jenkins/workspace/Test_openjdk21_hs_extended.openjdk_s390x_linux_testList_0/aqa-tests/TKG/output_17509909975678/hotspot_runtime_0/work/classes/runtime/CommandLine/OptionsValidation/TestOptionsWithRanges_id4.d:/home/jenkins/workspace/Test_openjdk21_hs_extended.openjdk_s390x_linux_testList_0/aqa-tests/openjdk/openjdk-jdk/test/hotspot/jtreg/runtime/CommandLine/OptionsValidation:/home/jenkins/workspace/Test_openjdk21_hs_extended.openjdk_s390x_linux_testList_0/aqa-tests/TKG/output_17509909975678/hotspot_runtime_0/work/classes/test/lib:/home/jenkins/workspace/Test_openjdk21_hs_extended.openjdk_s390x_linux_testList_0/aqa-tests/TKG/output_17509909975678/hotspot_runtime_0/work/classes/runtime/CommandLine/OptionsValidation/common:/home/jenkins/workspace/Test_openjdk21_hs_extended.openjdk_s390x_linux_testList_0/jvmtest/openjdk/jtreg/lib/javatest.jar:/home/jenkins/workspace/Test_openjdk21_hs_extended.openjdk_s390x_linux_testList_0/jvmtest/openjdk/jtreg/lib/jtreg.jar:/home/jenkins/workspace/Test_openjdk21_hs_extended.openjdk_s390x_linux_testList_0/jvmtest/openjdk/jtreg/lib/junit-platform-console-standalone-1.9.2.jar:/home/jenkins/workspace/Test_openjdk21_hs_extended.openjdk_s390x_linux_testList_0/jvmtest/openjdk/jtreg/lib/testng-7.3.0.jar:/home/jenkins/workspace/Test_openjdk21_hs_extended.openjdk_s390x_linux_testList_0/jvmtest/openjdk/jtreg/lib/guice-5.1.0.jar:/home/jenkins/workspace/Test_openjdk21_hs_extended.openjdk_s390x_linux_testList_0/jvmtest/openjdk/jtreg/lib/jcommander-1.82.jar -server -XX:+UseG1GC -XX:+UnlockDiagnosticVMOptions -XX:+UnlockExperimentalVMOptions -XX:LiveNodeCountInliningCutoff=1 optionsvalidation.JVMStartup ]
[2025-06-27T03:26:41.963Z] [2025-06-27T03:25:59.935106358Z] Gathering output for process 848574
[2025-06-27T03:26:41.963Z] [2025-06-27T03:25:59.937598187Z] Waiting for completion for process 848574
[2025-06-27T03:26:41.963Z] [2025-06-27T03:26:00.009410425Z] Waiting for completion finished for process 848574
[2025-06-27T03:26:41.963Z]
[2025-06-27T03:26:41.963Z] Testing invalid LiveNodeCountInliningCutoff values.
[2025-06-27T03:26:41.963Z] Command line: [/home/jenkins/workspace/Test_openjdk21_hs_extended.openjdk_s390x_linux_testList_0/jdkbinary/j2sdk-image/bin/java -cp /home/jenkins/workspace/Test_openjdk21_hs_extended.openjdk_s390x_linux_testList_0/aqa-tests/TKG/output_17509909975678/hotspot_runtime_0/work/classes/runtime/CommandLine/OptionsValidation/TestOptionsWithRanges_id4.d:/home/jenkins/workspace/Test_openjdk21_hs_extended.openjdk_s390x_linux_testList_0/aqa-tests/openjdk/openjdk-jdk/test/hotspot/jtreg/runtime/CommandLine/OptionsValidation:/home/jenkins/workspace/Test_openjdk21_hs_extended.openjdk_s390x_linux_testList_0/aqa-tests/TKG/output_17509909975678/hotspot_runtime_0/work/classes/test/lib:/home/jenkins/workspace/Test_openjdk21_hs_extended.openjdk_s390x_linux_testList_0/aqa-tests/TKG/output_17509909975678/hotspot_runtime_0/work/classes/runtime/CommandLine/OptionsValidation/common:/home/jenkins/workspace/Test_openjdk21_hs_extended.openjdk_s390x_linux_testList_0/jvmtest/openjdk/jtreg/lib/javatest.jar:/home/jenkins/workspace/Test_openjdk21_hs_extended.openjdk_s390x_linux_testList_0/jvmtest/openjdk/jtreg/lib/jtreg.jar:/home/jenkins/workspace/Test_openjdk21_hs_extended.openjdk_s390x_linux_testList_0/jvmtest/openjdk/jtreg/lib/junit-platform-console-standalone-1.9.2.jar:/home/jenkins/workspace/Test_openjdk21_hs_extended.openjdk_s390x_linux_testList_0/jvmtest/openjdk/jtreg/lib/testng-7.3.0.jar:/home/jenkins/workspace/Test_openjdk21_hs_extended.openjdk_s390x_linux_testList_0/jvmtest/openjdk/jtreg/lib/guice-5.1.0.jar:/home/jenkins/workspace/Test_openjdk21_hs_extended.openjdk_s390x_linux_testList_0/jvmtest/openjdk/jtreg/lib/jcommander-1.82.jar -server -XX:+UseG1GC -XX:+UnlockDiagnosticVMOptions -XX:+UnlockExperimentalVMOptions -XX:LiveNodeCountInliningCutoff=-1 optionsvalidation.JVMStartup ]
[2025-06-27T03:26:41.963Z] [2025-06-27T03:26:00.011778475Z] Gathering output for process 848595
[2025-06-27T03:26:41.963Z] [2025-06-27T03:26:00.016636092Z] Waiting for completion for process 848595
[2025-06-27T03:26:41.963Z] [2025-06-27T03:26:00.017580932Z] Waiting for completion finished for process 848595
[2025-06-27T03:26:41.963Z]
[2025-06-27T03:26:41.963Z] Command line: [/home/jenkins/workspace/Test_openjdk21_hs_extended.openjdk_s390x_linux_testList_0/jdkbinary/j2sdk-image/bin/java -cp /home/jenkins/workspace/Test_openjdk21_hs_extended.openjdk_s390x_linux_testList_0/aqa-tests/TKG/output_17509909975678/hotspot_runtime_0/work/classes/runtime/CommandLine/OptionsValidation/TestOptionsWithRanges_id4.d:/home/jenkins/workspace/Test_openjdk21_hs_extended.openjdk_s390x_linux_testList_0/aqa-tests/openjdk/openjdk-jdk/test/hotspot/jtreg/runtime/CommandLine/OptionsValidation:/home/jenkins/workspace/Test_openjdk21_hs_extended.openjdk_s390x_linux_testList_0/aqa-tests/TKG/output_17509909975678/hotspot_runtime_0/work/classes/test/lib:/home/jenkins/workspace/Test_openjdk21_hs_extended.openjdk_s390x_linux_testList_0/aqa-tests/TKG/output_17509909975678/hotspot_runtime_0/work/classes/runtime/CommandLine/OptionsValidation/common:/home/jenkins/workspace/Test_openjdk21_hs_extended.openjdk_s390x_linux_testList_0/jvmtest/openjdk/jtreg/lib/javatest.jar:/home/jenkins/workspace/Test_openjdk21_hs_extended.openjdk_s390x_linux_testList_0/jvmtest/openjdk/jtreg/lib/jtreg.jar:/home/jenkins/workspace/Test_openjdk21_hs_extended.openjdk_s390x_linux_testList_0/jvmtest/openjdk/jtreg/lib/junit-platform-console-standalone-1.9.2.jar:/home/jenkins/workspace/Test_openjdk21_hs_extended.openjdk_s390x_linux_testList_0/jvmtest/openjdk/jtreg/lib/testng-7.3.0.jar:/home/jenkins/workspace/Test_openjdk21_hs_extended.openjdk_s390x_linux_testList_0/jvmtest/openjdk/jtreg/lib/guice-5.1.0.jar:/home/jenkins/workspace/Test_openjdk21_hs_extended.openjdk_s390x_linux_testList_0/jvmtest/openjdk/jtreg/lib/jcommander-1.82.jar -server -XX:+UseG1GC -XX:+UnlockDiagnosticVMOptions -XX:+UnlockExperimentalVMOptions -XX:LiveNodeCountInliningCutoff=536870912 optionsvalidation.JVMStartup ]
[2025-06-27T03:26:41.963Z] [2025-06-27T03:26:00.022801029Z] Gathering output for process 848599
[2025-06-27T03:26:41.963Z] [2025-06-27T03:26:00.024403850Z] Waiting for completion for process 848599
[2025-06-27T03:26:41.963Z] [2025-06-27T03:26:00.024424366Z] Waiting for completion finished for process 848599
[2025-06-27T03:26:41.963Z]
[2025-06-27T03:26:41.963Z] Testing valid LockingMode values.
[2025-06-27T03:26:41.963Z] Command line: [/home/jenkins/workspace/Test_openjdk21_hs_extended.openjdk_s390x_linux_testList_0/jdkbinary/j2sdk-image/bin/java -cp /home/jenkins/workspace/Test_openjdk21_hs_extended.openjdk_s390x_linux_testList_0/aqa-tests/TKG/output_17509909975678/hotspot_runtime_0/work/classes/runtime/CommandLine/OptionsValidation/TestOptionsWithRanges_id4.d:/home/jenkins/workspace/Test_openjdk21_hs_extended.openjdk_s390x_linux_testList_0/aqa-tests/openjdk/openjdk-jdk/test/hotspot/jtreg/runtime/CommandLine/OptionsValidation:/home/jenkins/workspace/Test_openjdk21_hs_extended.openjdk_s390x_linux_testList_0/aqa-tests/TKG/output_17509909975678/hotspot_runtime_0/work/classes/test/lib:/home/jenkins/workspace/Test_openjdk21_hs_extended.openjdk_s390x_linux_testList_0/aqa-tests/TKG/output_17509909975678/hotspot_runtime_0/work/classes/runtime/CommandLine/OptionsValidation/common:/home/jenkins/workspace/Test_openjdk21_hs_extended.openjdk_s390x_linux_testList_0/jvmtest/openjdk
[2025-06-27T03:26:41.963Z]
[2025-06-27T03:26:41.963Z] ...
[2025-06-27T03:26:41.963Z] Output overflow:
[2025-06-27T03:26:41.963Z] JT Harness has limited the test output to the text
[2025-06-27T03:26:41.963Z] at the beginning and the end, so that you can see how the
[2025-06-27T03:26:41.963Z] test began, and how it completed.
[2025-06-27T03:26:41.963Z]
[2025-06-27T03:26:41.963Z] If you need to see more of the output from the test,
[2025-06-27T03:26:41.963Z] set the system property javatest.maxOutputSize to a higher
[2025-06-27T03:26:41.963Z] value. The current value is 100000
[2025-06-27T03:26:41.963Z] ...
[2025-06-27T03:26:41.963Z]
[2025-06-27T03:26:41.963Z] space/Test_openjdk21_hs_extended.openjdk_s390x_linux_testList_0/jvmtest/openjdk/jtreg/lib/javatest.jar:/home/jenkins/workspace/Test_openjdk21_hs_extended.openjdk_s390x_linux_testList_0/jvmtest/openjdk/jtreg/lib/jtreg.jar:/home/jenkins/workspace/Test_openjdk21_hs_extended.openjdk_s390x_linux_testList_0/jvmtest/openjdk/jtreg/lib/junit-platform-console-standalone-1.9.2.jar:/home/jenkins/workspace/Test_openjdk21_hs_extended.openjdk_s390x_linux_testList_0/jvmtest/openjdk/jtreg/lib/testng-7.3.0.jar:/home/jenkins/workspace/Test_openjdk21_hs_extended.openjdk_s390x_linux_testList_0/jvmtest/openjdk/jtreg/lib/guice-5.1.0.jar:/home/jenkins/workspace/Test_openjdk21_hs_extended.openjdk_s390x_linux_testList_0/jvmtest/openjdk/jtreg/lib/jcommander-1.82.jar -server -XX:+UseG1GC -XX:+UnlockDiagnosticVMOptions -XX:+UnlockExperimentalVMOptions -XX:MaxJumpTableSize=2147483648 optionsvalidation.JVMStartup ]
[2025-06-27T03:26:41.963Z] [2025-06-27T03:26:32.395778420Z] Gathering output for process 850376
[2025-06-27T03:26:41.963Z] [2025-06-27T03:26:32.398792412Z] Waiting for completion for process 850376
[2025-06-27T03:26:41.963Z] [2025-06-27T03:26:32.478487475Z] Waiting for completion finished for process 850376
[2025-06-27T03:26:41.963Z]
[2025-06-27T03:26:41.963Z] Command line: [/home/jenkins/workspace/Test_openjdk21_hs_extended.openjdk_s390x_linux_testList_0/jdkbinary/j2sdk-image/bin/java -cp /home/jenkins/workspace/Test_openjdk21_hs_extended.openjdk_s390x_linux_testList_0/aqa-tests/TKG/output_17509909975678/hotspot_runtime_0/work/classes/runtime/CommandLine/OptionsValidation/TestOptionsWithRanges_id4.d:/home/jenkins/workspace/Test_openjdk21_hs_extended.openjdk_s390x_linux_testList_0/aqa-tests/openjdk/openjdk-jdk/test/hotspot/jtreg/runtime/CommandLine/OptionsValidation:/home/jenkins/workspace/Test_openjdk21_hs_extended.openjdk_s390x_linux_testList_0/aqa-tests/TKG/output_17509909975678/hotspot_runtime_0/work/classes/test/lib:/home/jenkins/workspace/Test_openjdk21_hs_extended.openjdk_s390x_linux_testList_0/aqa-tests/TKG/output_17509909975678/hotspot_runtime_0/work/classes/runtime/CommandLine/OptionsValidation/common:/home/jenkins/workspace/Test_openjdk21_hs_extended.openjdk_s390x_linux_testList_0/jvmtest/openjdk/jtreg/lib/javatest.jar:/home/jenkins/workspace/Test_openjdk21_hs_extended.openjdk_s390x_linux_testList_0/jvmtest/openjdk/jtreg/lib/jtreg.jar:/home/jenkins/workspace/Test_openjdk21_hs_extended.openjdk_s390x_linux_testList_0/jvmtest/openjdk/jtreg/lib/junit-platform-console-standalone-1.9.2.jar:/home/jenkins/workspace/Test_openjdk21_hs_extended.openjdk_s390x_linux_testList_0/jvmtest/openjdk/jtreg/lib/testng-7.3.0.jar:/home/jenkins/workspace/Test_openjdk21_hs_extended.openjdk_s390x_linux_testList_0/jvmtest/openjdk/jtreg/lib/guice-5.1.0.jar:/home/jenkins/workspace/Test_openjdk21_hs_extended.openjdk_s390x_linux_testList_0/jvmtest/openjdk/jtreg/lib/jcommander-1.82.jar -server -XX:+UseG1GC -XX:+UnlockDiagnosticVMOptions -XX:+UnlockExperimentalVMOptions -XX:MaxJumpTableSize=4294967296 optionsvalidation.JVMStartup ]
[2025-06-27T03:26:41.963Z] [2025-06-27T03:26:32.484959271Z] Gathering output for process 850397
[2025-06-27T03:26:41.963Z] [2025-06-27T03:26:32.485254948Z] Waiting for completion for process 850397
[2025-06-27T03:26:41.963Z] [2025-06-27T03:26:32.542954316Z] Waiting for completion finished for process 850397
[2025-06-27T03:26:41.963Z]
[2025-06-27T03:26:41.963Z] Testing invalid MaxJumpTableSize values.
[2025-06-27T03:26:41.963Z] Command line: [/home/jenkins/workspace/Test_openjdk21_hs_extended.openjdk_s390x_linux_testList_0/jdkbinary/j2sdk-image/bin/java -cp /home/jenkins/workspace/Test_openjdk21_hs_extended.openjdk_s390x_linux_testList_0/aqa-tests/TKG/output_17509909975678/hotspot_runtime_0/work/classes/runtime/CommandLine/OptionsValidation/TestOptionsWithRanges_id4.d:/home/jenkins/workspace/Test_openjdk21_hs_extended.openjdk_s390x_linux_testList_0/aqa-tests/openjdk/openjdk-jdk/test/hotspot/jtreg/runtime/CommandLine/OptionsValidation:/home/jenkins/workspace/Test_openjdk21_hs_extended.openjdk_s390x_linux_testList_0/aqa-tests/TKG/output_17509909975678/hotspot_runtime_0/work/classes/test/lib:/home/jenkins/workspace/Test_openjdk21_hs_extended.openjdk_s390x_linux_testList_0/aqa-tests/TKG/output_17509909975678/hotspot_runtime_0/work/classes/runtime/CommandLine/OptionsValidation/common:/home/jenkins/workspace/Test_openjdk21_hs_extended.openjdk_s390x_linux_testList_0/jvmtest/openjdk/jtreg/lib/javatest.jar:/home/jenkins/workspace/Test_openjdk21_hs_extended.openjdk_s390x_linux_testList_0/jvmtest/openjdk/jtreg/lib/jtreg.jar:/home/jenkins/workspace/Test_openjdk21_hs_extended.openjdk_s390x_linux_testList_0/jvmtest/openjdk/jtreg/lib/junit-platform-console-standalone-1.9.2.jar:/home/jenkins/workspace/Test_openjdk21_hs_extended.openjdk_s390x_linux_testList_0/jvmtest/openjdk/jtreg/lib/testng-7.3.0.jar:/home/jenkins/workspace/Test_openjdk21_hs_extended.openjdk_s390x_linux_testList_0/jvmtest/openjdk/jtreg/lib/guice-5.1.0.jar:/home/jenkins/workspace/Test_openjdk21_hs_extended.openjdk_s390x_linux_testList_0/jvmtest/openjdk/jtreg/lib/jcommander-1.82.jar -server -XX:+UseG1GC -XX:+UnlockDiagnosticVMOptions -XX:+UnlockExperimentalVMOptions -XX:MaxJumpTableSize=-1 optionsvalidation.JVMStartup ]
[2025-06-27T03:26:41.963Z] [2025-06-27T03:26:32.549193685Z] Gathering output for process 850418
[2025-06-27T03:26:41.963Z] [2025-06-27T03:26:32.552472236Z] Waiting for completion for process 850418
[2025-06-27T03:26:41.963Z] [2025-06-27T03:26:32.552495297Z] Waiting for completion finished for process 850418
[2025-06-27T03:26:41.963Z]
[2025-06-27T03:26:41.963Z] Testing valid MaxJumpTableSparseness values.
[2025-06-27T03:26:41.963Z] Command line: [/home/jenkins/workspace/Test_openjdk21_hs_extended.openjdk_s390x_linux_testList_0/jdkbinary/j2sdk-image/bin/java -cp /home/jenkins/workspace/Test_openjdk21_hs_extended.openjdk_s390x_linux_testList_0/aqa-tests/TKG/output_17509909975678/hotspot_runtime_0/work/classes/runtime/CommandLine/OptionsValidation/TestOptionsWithRanges_id4.d:/home/jenkins/workspace/Test_openjdk21_hs_extended.openjdk_s390x_linux_testList_0/aqa-tests/openjdk/openjdk-jdk/test/hotspot/jtreg/runtime/CommandLine/OptionsValidation:/home/jenkins/workspace/Test_openjdk21_hs_extended.openjdk_s390x_linux_testList_0/aqa-tests/TKG/output_17509909975678/hotspot_runtime_0/work/classes/test/lib:/home/jenkins/workspace/Test_openjdk21_hs_extended.openjdk_s390x_linux_testList_0/aqa-tests/TKG/output_17509909975678/hotspot_runtime_0/work/classes/runtime/CommandLine/OptionsValidation/common:/home/jenkins/workspace/Test_openjdk21_hs_extended.openjdk_s390x_linux_testList_0/jvmtest/openjdk/jtreg/lib/javatest.jar:/home/jenkins/workspace/Test_openjdk21_hs_extended.openjdk_s390x_linux_testList_0/jvmtest/openjdk/jtreg/lib/jtreg.jar:/home/jenkins/workspace/Test_openjdk21_hs_extended.openjdk_s390x_linux_testList_0/jvmtest/openjdk/jtreg/lib/junit-platform-console-standalone-1.9.2.jar:/home/jenkins/workspace/Test_openjdk21_hs_extended.openjdk_s390x_linux_testList_0/jvmtest/openjdk/jtreg/lib/testng-7.3.0.jar:/home/jenkins/workspace/Test_openjdk21_hs_extended.openjdk_s390x_linux_testList_0/jvmtest/openjdk/jtreg/lib/guice-5.1.0.jar:/home/jenkins/workspace/Test_openjdk21_hs_extended.openjdk_s390x_linux_testList_0/jvmtest/openjdk/jtreg/lib/jcommander-1.82.jar -server -XX:+UseG1GC -XX:+UnlockDiagnosticVMOptions -XX:+UnlockExperimentalVMOptions -XX:MaxJumpTableSparseness=0 optionsvalidation.JVMStartup ]
[2025-06-27T03:26:41.965Z] [2025-06-27T03:26:32.562521741Z] Gathering output for process 850422
[2025-06-27T03:26:41.965Z] [2025-06-27T03:26:32.562784870Z] Waiting for completion for process 850422
[2025-06-27T03:26:41.965Z] [2025-06-27T03:26:32.612510579Z] Waiting for completion finished for process 850422
[2025-06-27T03:26:41.965Z]
[2025-06-27T03:26:41.965Z] Command line: [/home/jenkins/workspace/Test_openjdk21_hs_extended.openjdk_s390x_linux_testList_0/jdkbinary/j2sdk-image/bin/java -cp /home/jenkins/workspace/Test_openjdk21_hs_extended.openjdk_s390x_linux_testList_0/aqa-tests/TKG/output_17509909975678/hotspot_runtime_0/work/classes/runtime/CommandLine/OptionsValidation/TestOptionsWithRanges_id4.d:/home/jenkins/workspace/Test_openjdk21_hs_extended.openjdk_s390x_linux_testList_0/aqa-tests/openjdk/openjdk-jdk/test/hotspot/jtreg/runtime/CommandLine/OptionsValidation:/home/jenkins/workspace/Test_openjdk21_hs_extended.openjdk_s390x_linux_testList_0/aqa-tests/TKG/output_17509909975678/hotspot_runtime_0/work/classes/test/lib:/home/jenkins/workspace/Test_openjdk21_hs_extended.openjdk_s390x_linux_testList_0/aqa-tests/TKG/output_17509909975678/hotspot_runtime_0/work/classes/runtime/CommandLine/OptionsValidation/common:/home/jenkins/workspace/Test_openjdk21_hs_extended.openjdk_s390x_linux_testList_0/jvmtest/openjdk/jtreg/lib/javatest.jar:/home/jenkins/workspace/Test_openjdk21_hs_extended.openjdk_s390x_linux_testList_0/jvmtest/openjdk/jtreg/lib/jtreg.jar:/home/jenkins/workspace/Test_openjdk21_hs_extended.openjdk_s390x_linux_testList_0/jvmtest/openjdk/jtreg/lib/junit-platform-console-standalone-1.9.2.jar:/home/jenkins/workspace/Test_openjdk21_hs_extended.openjdk_s390x_linux_testList_0/jvmtest/openjdk/jtreg/lib/testng-7.3.0.jar:/home/jenkins/workspace/Test_openjdk21_hs_extended.openjdk_s390x_linux_testList_0/jvmtest/openjdk/jtreg/lib/guice-5.1.0.jar:/home/jenkins/workspace/Test_openjdk21_hs_extended.openjdk_s390x_linux_testList_0/jvmtest/openjdk/jtreg/lib/jcommander-1.82.jar -server -XX:+UseG1GC -XX:+UnlockDiagnosticVMOptions -XX:+UnlockExperimentalVMOptions -XX:MaxJumpTableSparseness=2305843009213693951 optionsvalidation.JVMStartup ]
[2025-06-27T03:26:41.965Z] [2025-06-27T03:26:32.620877279Z] Gathering output for process 850443
[2025-06-27T03:26:41.965Z] [2025-06-27T03:26:32.621222923Z] Waiting for completion for process 850443
[2025-06-27T03:26:41.965Z] [2025-06-27T03:26:32.706891124Z] Waiting for completion finished for process 850443
[2025-06-27T03:26:41.965Z]
[2025-06-27T03:26:41.965Z] Command line: [/home/jenkins/workspace/Test_openjdk21_hs_extended.openjdk_s390x_linux_testList_0/jdkbinary/j2sdk-image/bin/java -cp /home/jenkins/workspace/Test_openjdk21_hs_extended.openjdk_s390x_linux_testList_0/aqa-tests/TKG/output_17509909975678/hotspot_runtime_0/work/classes/runtime/CommandLine/OptionsValidation/TestOptionsWithRanges_id4.d:/home/jenkins/workspace/Test_openjdk21_hs_extended.openjdk_s390x_linux_testList_0/aqa-tests/openjdk/openjdk-jdk/test/hotspot/jtreg/runtime/CommandLine/OptionsValidation:/home/jenkins/workspace/Test_openjdk21_hs_extended.openjdk_s390x_linux_testList_0/aqa-tests/TKG/output_17509909975678/hotspot_runtime_0/work/classes/test/lib:/home/jenkins/workspace/Test_openjdk21_hs_extended.openjdk_s390x_linux_testList_0/aqa-tests/TKG/output_17509909975678/hotspot_runtime_0/work/classes/runtime/CommandLine/OptionsValidation/common:/home/jenkins/workspace/Test_openjdk21_hs_extended.openjdk_s390x_linux_testList_0/jvmtest/openjdk/jtreg/lib/javatest.jar:/home/jenkins/workspace/Test_openjdk21_hs_extended.openjdk_s390x_linux_testList_0/jvmtest/openjdk/jtreg/lib/jtreg.jar:/home/jenkins/workspace/Test_openjdk21_hs_extended.openjdk_s390x_linux_testList_0/jvmtest/openjdk/jtreg/lib/junit-platform-console-standalone-1.9.2.jar:/home/jenkins/workspace/Test_openjdk21_hs_extended.openjdk_s390x_linux_testList_0/jvmtest/openjdk/jtreg/lib/testng-7.3.0.jar:/home/jenkins/workspace/Test_openjdk21_hs_extended.openjdk_s390x_linux_testList_0/jvmtest/openjdk/jtreg/lib/guice-5.1.0.jar:/home/jenkins/workspace/Test_openjdk21_hs_extended.openjdk_s390x_linux_testList_0/jvmtest/openjdk/jtreg/lib/jcommander-1.82.jar -server -XX:+UseG1GC -XX:+UnlockDiagnosticVMOptions -XX:+UnlockExperimentalVMOptions -XX:MaxJumpTableSparseness=1 optionsvalidation.JVMStartup ]
[2025-06-27T03:26:41.965Z] [2025-06-27T03:26:32.708883706Z] Gathering output for process 850464
[2025-06-27T03:26:41.965Z] [2025-06-27T03:26:32.709301943Z] Waiting for completion for process 850464
[2025-06-27T03:26:41.965Z] [2025-06-27T03:26:32.808262566Z] Waiting for completion finished for process 850464
[2025-06-27T03:26:41.965Z]
[2025-06-27T03:26:41.965Z] Command line: [/home/jenkins/workspace/Test_openjdk21_hs_extended.openjdk_s390x_linux_testList_0/jdkbinary/j2sdk-image/bin/java -cp /home/jenkins/workspace/Test_openjdk21_hs_extended.openjdk_s390x_linux_testList_0/aqa-tests/TKG/output_17509909975678/hotspot_runtime_0/work/classes/runtime/CommandLine/OptionsValidation/TestOptionsWithRanges_id4.d:/home/jenkins/workspace/Test_openjdk21_hs_extended.openjdk_s390x_linux_testList_0/aqa-tests/openjdk/openjdk-jdk/test/hotspot/jtreg/runtime/CommandLine/OptionsValidation:/home/jenkins/workspace/Test_openjdk21_hs_extended.openjdk_s390x_linux_testList_0/aqa-tests/TKG/output_17509909975678/hotspot_runtime_0/work/classes/test/lib:/home/jenkins/workspace/Test_openjdk21_hs_extended.openjdk_s390x_linux_testList_0/aqa-tests/TKG/output_17509909975678/hotspot_runtime_0/work/classes/runtime/CommandLine/OptionsValidation/common:/home/jenkins/workspace/Test_openjdk21_hs_extended.openjdk_s390x_linux_testList_0/jvmtest/openjdk/jtreg/lib/javatest.jar:/home/jenkins/workspace/Test_openjdk21_hs_extended.openjdk_s390x_linux_testList_0/jvmtest/openjdk/jtreg/lib/jtreg.jar:/home/jenkins/workspace/Test_openjdk21_hs_extended.openjdk_s390x_linux_testList_0/jvmtest/openjdk/jtreg/lib/junit-platform-console-standalone-1.9.2.jar:/home/jenkins/workspace/Test_openjdk21_hs_extended.openjdk_s390x_linux_testList_0/jvmtest/openjdk/jtreg/lib/testng-7.3.0.jar:/home/jenkins/workspace/Test_openjdk21_hs_extended.openjdk_s390x_linux_testList_0/jvmtest/openjdk/jtreg/lib/guice-5.1.0.jar:/home/jenkins/workspace/Test_openjdk21_hs_extended.openjdk_s390x_linux_testList_0/jvmtest/openjdk/jtreg/lib/jcommander-1.82.jar -server -XX:+UseG1GC -XX:+UnlockDiagnosticVMOptions -XX:+UnlockExperimentalVMOptions -XX:MaxJumpTableSparseness=2147483648 optionsvalidation.JVMStartup ]
[2025-06-27T03:26:41.965Z] [2025-06-27T03:26:32.814980030Z] Gathering output for process 850485
[2025-06-27T03:26:41.965Z] [2025-06-27T03:26:32.817231638Z] Waiting for completion for process 850485
[2025-06-27T03:26:41.965Z] [2025-06-27T03:26:32.868568251Z] Waiting for completion finished for process 850485
[2025-06-27T03:26:41.965Z]
[2025-06-27T03:26:41.965Z] Command line: [/home/jenkins/workspace/Test_openjdk21_hs_extended.openjdk_s390x_linux_testList_0/jdkbinary/j2sdk-image/bin/java -cp /home/jenkins/workspace/Test_openjdk21_hs_extended.openjdk_s390x_linux_testList_0/aqa-tests/TKG/output_17509909975678/hotspot_runtime_0/work/classes/runtime/CommandLine/OptionsValidation/TestOptionsWithRanges_id4.d:/home/jenkins/workspace/Test_openjdk21_hs_extended.openjdk_s390x_linux_testList_0/aqa-tests/openjdk/openjdk-jdk/test/hotspot/jtreg/runtime/CommandLine/OptionsValidation:/home/jenkins/workspace/Test_openjdk21_hs_extended.openjdk_s390x_linux_testList_0/aqa-tests/TKG/output_17509909975678/hotspot_runtime_0/work/classes/test/lib:/home/jenkins/workspace/Test_openjdk21_hs_extended.openjdk_s390x_linux_testList_0/aqa-tests/TKG/output_17509909975678/hotspot_runtime_0/work/classes/runtime/CommandLine/OptionsValidation/common:/home/jenkins/workspace/Test_openjdk21_hs_extended.openjdk_s390x_linux_testList_0/jvmtest/openjdk/jtreg/lib/javatest.jar:/home/jenkins/workspace/Test_openjdk21_hs_extended.openjdk_s390x_linux_testList_0/jvmtest/openjdk/jtreg/lib/jtreg.jar:/home/jenkins/workspace/Test_openjdk21_hs_extended.openjdk_s390x_linux_testList_0/jvmtest/openjdk/jtreg/lib/junit-platform-console-standalone-1.9.2.jar:/home/jenkins/workspace/Test_openjdk21_hs_extended.openjdk_s390x_linux_testList_0/jvmtest/openjdk/jtreg/lib/testng-7.3.0.jar:/home/jenkins/workspace/Test_openjdk21_hs_extended.openjdk_s390x_linux_testList_0/jvmtest/openjdk/jtreg/lib/guice-5.1.0.jar:/home/jenkins/workspace/Test_openjdk21_hs_extended.openjdk_s390x_linux_testList_0/jvmtest/openjdk/jtreg/lib/jcommander-1.82.jar -server -XX:+UseG1GC -XX:+UnlockDiagnosticVMOptions -XX:+UnlockExperimentalVMOptions -XX:MaxJumpTableSparseness=4294967296 optionsvalidation.JVMStartup ]
[2025-06-27T03:26:41.965Z] [2025-06-27T03:26:32.875525641Z] Gathering output for process 850506
[2025-06-27T03:26:41.965Z] [2025-06-27T03:26:32.875763205Z] Waiting for completion for process 850506
[2025-06-27T03:26:41.965Z] [2025-06-27T03:26:32.932254597Z] Waiting for completion finished for process 850506
[2025-06-27T03:26:41.965Z]
[2025-06-27T03:26:41.965Z] Testing invalid MaxJumpTableSparseness values.
[2025-06-27T03:26:41.965Z] Command line: [/home/jenkins/workspace/Test_openjdk21_hs_extended.openjdk_s390x_linux_testList_0/jdkbinary/j2sdk-image/bin/java -cp /home/jenkins/workspace/Test_openjdk21_hs_extended.openjdk_s390x_linux_testList_0/aqa-tests/TKG/output_17509909975678/hotspot_runtime_0/work/classes/runtime/CommandLine/OptionsValidation/TestOptionsWithRanges_id4.d:/home/jenkins/workspace/Test_openjdk21_hs_extended.openjdk_s390x_linux_testList_0/aqa-tests/openjdk/openjdk-jdk/test/hotspot/jtreg/runtime/CommandLine/OptionsValidation:/home/jenkins/workspace/Test_openjdk21_hs_extended.openjdk_s390x_linux_testList_0/aqa-tests/TKG/output_17509909975678/hotspot_runtime_0/work/classes/test/lib:/home/jenkins/workspace/Test_openjdk21_hs_extended.openjdk_s390x_linux_testList_0/aqa-tests/TKG/output_17509909975678/hotspot_runtime_0/work/classes/runtime/CommandLine/OptionsValidation/common:/home/jenkins/workspace/Test_openjdk21_hs_extended.openjdk_s390x_linux_testList_0/jvmtest/openjdk/jtreg/lib/javatest.jar:/home/jenkins/workspace/Test_openjdk21_hs_extended.openjdk_s390x_linux_testList_0/jvmtest/openjdk/jtreg/lib/jtreg.jar:/home/jenkins/workspace/Test_openjdk21_hs_extended.openjdk_s390x_linux_testList_0/jvmtest/openjdk/jtreg/lib/junit-platform-console-standalone-1.9.2.jar:/home/jenkins/workspace/Test_openjdk21_hs_extended.openjdk_s390x_linux_testList_0/jvmtest/openjdk/jtreg/lib/testng-7.3.0.jar:/home/jenkins/workspace/Test_openjdk21_hs_extended.openjdk_s390x_linux_testList_0/jvmtest/openjdk/jtreg/lib/guice-5.1.0.jar:/home/jenkins/workspace/Test_openjdk21_hs_extended.openjdk_s390x_linux_testList_0/jvmtest/openjdk/jtreg/lib/jcommander-1.82.jar -server -XX:+UseG1GC -XX:+UnlockDiagnosticVMOptions -XX:+UnlockExperimentalVMOptions -XX:MaxJumpTableSparseness=-1 optionsvalidation.JVMStartup ]
[2025-06-27T03:26:41.965Z] [2025-06-27T03:26:32.938904909Z] Gathering output for process 850527
[2025-06-27T03:26:41.965Z] [2025-06-27T03:26:32.939947324Z] Waiting for completion for process 850527
[2025-06-27T03:26:41.965Z] [2025-06-27T03:26:32.939959995Z] Waiting for completion finished for process 850527
[2025-06-27T03:26:41.965Z]
[2025-06-27T03:26:41.965Z] Command line: [/home/jenkins/workspace/Test_openjdk21_hs_extended.openjdk_s390x_linux_testList_0/jdkbinary/j2sdk-image/bin/java -cp /home/jenkins/workspace/Test_openjdk21_hs_extended.openjdk_s390x_linux_testList_0/aqa-tests/TKG/output_17509909975678/hotspot_runtime_0/work/classes/runtime/CommandLine/OptionsValidation/TestOptionsWithRanges_id4.d:/home/jenkins/workspace/Test_openjdk21_hs_extended.openjdk_s390x_linux_testList_0/aqa-tests/openjdk/openjdk-jdk/test/hotspot/jtreg/runtime/CommandLine/OptionsValidation:/home/jenkins/workspace/Test_openjdk21_hs_extended.openjdk_s390x_linux_testList_0/aqa-tests/TKG/output_17509909975678/hotspot_runtime_0/work/classes/test/lib:/home/jenkins/workspace/Test_openjdk21_hs_extended.openjdk_s390x_linux_testList_0/aqa-tests/TKG/output_17509909975678/hotspot_runtime_0/work/classes/runtime/CommandLine/OptionsValidation/common:/home/jenkins/workspace/Test_openjdk21_hs_extended.openjdk_s390x_linux_testList_0/jvmtest/openjdk/jtreg/lib/javatest.jar:/home/jenkins/workspace/Test_openjdk21_hs_extended.openjdk_s390x_linux_testList_0/jvmtest/openjdk/jtreg/lib/jtreg.jar:/home/jenkins/workspace/Test_openjdk21_hs_extended.openjdk_s390x_linux_testList_0/jvmtest/openjdk/jtreg/lib/junit-platform-console-standalone-1.9.2.jar:/home/jenkins/workspace/Test_openjdk21_hs_extended.openjdk_s390x_linux_testList_0/jvmtest/openjdk/jtreg/lib/testng-7.3.0.jar:/home/jenkins/workspace/Test_openjdk21_hs_extended.openjdk_s390x_linux_testList_0/jvmtest/openjdk/jtreg/lib/guice-5.1.0.jar:/home/jenkins/workspace/Test_openjdk21_hs_extended.openjdk_s390x_linux_testList_0/jvmtest/openjdk/jtreg/lib/jcommander-1.82.jar -server -XX:+UseG1GC -XX:+UnlockDiagnosticVMOptions -XX:+UnlockExperimentalVMOptions -XX:MaxJumpTableSparseness=2305843009213693952 optionsvalidation.JVMStartup ]
[2025-06-27T03:26:41.965Z] [2025-06-27T03:26:32.944595203Z] Gathering output for process 850531
[2025-06-27T03:26:41.965Z] [2025-06-27T03:26:32.945288719Z] Waiting for completion for process 850531
[2025-06-27T03:26:41.965Z] [2025-06-27T03:26:32.945302207Z] Waiting for completion finished for process 850531
[2025-06-27T03:26:41.965Z]
[2025-06-27T03:26:41.965Z] Testing valid MaxLabelRootDepth values.
[2025-06-27T03:26:41.965Z] Command line: [/home/jenkins/workspace/Test_openjdk21_hs_extended.openjdk_s390x_linux_testList_0/jdkbinary/j2sdk-image/bin/java -cp /home/jenkins/workspace/Test_openjdk21_hs_extended.openjdk_s390x_linux_testList_0/aqa-tests/TKG/output_17509909975678/hotspot_runtime_0/work/classes/runtime/CommandLine/OptionsValidation/TestOptionsWithRanges_id4.d:/home/jenkins/workspace/Test_openjdk21_hs_extended.openjdk_s390x_linux_testList_0/aqa-tests/openjdk/openjdk-jdk/test/hotspot/jtreg/runtime/CommandLine/OptionsValidation:/home/jenkins/workspace/Test_openjdk21_hs_extended.openjdk_s390x_linux_testList_0/aqa-tests/TKG/output_17509909975678/hotspot_runtime_0/work/classes/test/lib:/home/jenkins/workspace/Test_openjdk21_hs_extended.openjdk_s390x_linux_testList_0/aqa-tests/TKG/output_17509909975678/hotspot_runtime_0/work/classes/runtime/CommandLine/OptionsValidation/common:/home/jenkins/workspace/Test_openjdk21_hs_extended.openjdk_s390x_linux_testList_0/jvmtest/openjdk/jtreg/lib/javatest.jar:/home/jenkins/workspace/Test_openjdk21_hs_extended.openjdk_s390x_linux_testList_0/jvmtest/openjdk/jtreg/lib/jtreg.jar:/home/jenkins/workspace/Test_openjdk21_hs_extended.openjdk_s390x_linux_testList_0/jvmtest/openjdk/jtreg/lib/junit-platform-console-standalone-1.9.2.jar:/home/jenkins/workspace/Test_openjdk21_hs_extended.openjdk_s390x_linux_testList_0/jvmtest/openjdk/jtreg/lib/testng-7.3.0.jar:/home/jenkins/workspace/Test_openjdk21_hs_extended.openjdk_s390x_linux_testList_0/jvmtest/openjdk/jtreg/lib/guice-5.1.0.jar:/home/jenkins/workspace/Test_openjdk21_hs_extended.openjdk_s390x_linux_testList_0/jvmtest/openjdk/jtreg/lib/jcommander-1.82.jar -server -XX:+UseG1GC -XX:+UnlockDiagnosticVMOptions -XX:+UnlockExperimentalVMOptions -XX:MaxLabelRootDepth=100 optionsvalidation.JVMStartup ]
[2025-06-27T03:26:41.965Z] [2025-06-27T03:26:32.950004622Z] Gathering output for process 850535
[2025-06-27T03:26:41.965Z] [2025-06-27T03:26:32.952724052Z] Waiting for completion for process 850535
[2025-06-27T03:26:41.965Z] [2025-06-27T03:26:33.036273881Z] Waiting for completion finished for process 850535
[2025-06-27T03:26:41.965Z]
[2025-06-27T03:26:41.965Z] Command line: [/home/jenkins/workspace/Test_openjdk21_hs_extended.openjdk_s390x_linux_testList_0/jdkbinary/j2sdk-image/bin/java -cp /home/jenkins/workspace/Test_openjdk21_hs_extended.openjdk_s390x_linux_testList_0/aqa-tests/TKG/output_17509909975678/hotspot_runtime_0/work/classes/runtime/CommandLine/OptionsValidation/TestOptionsWithRanges_id4.d:/home/jenkins/workspace/Test_openjdk21_hs_extended.openjdk_s390x_linux_testList_0/aqa-tests/openjdk/openjdk-jdk/test/hotspot/jtreg/runtime/CommandLine/OptionsValidation:/home/jenkins/workspace/Test_openjdk21_hs_extended.openjdk_s390x_linux_testList_0/aqa-tests/TKG/output_17509909975678/hotspot_runtime_0/work/classes/test/lib:/home/jenkins/workspace/Test_openjdk21_hs_extended.openjdk_s390x_linux_testList_0/aqa-tests/TKG/output_17509909975678/hotspot_runtime_0/work/classes/runtime/CommandLine/OptionsValidation/common:/home/jenkins/workspace/Test_openjdk21_hs_extended.openjdk_s390x_linux_testList_0/jvmtest/openjdk/jtreg/lib/javatest.jar:/home/jenkins/workspace/Test_openjdk21_hs_extended.openjdk_s390x_linux_testList_0/jvmtest/openjdk/jtreg/lib/jtreg.jar:/home/jenkins/workspace/Test_openjdk21_hs_extended.openjdk_s390x_linux_testList_0/jvmtest/openjdk/jtreg/lib/junit-platform-console-standalone-1.9.2.jar:/home/jenkins/workspace/Test_openjdk21_hs_extended.openjdk_s390x_linux_testList_0/jvmtest/openjdk/jtreg/lib/testng-7.3.0.jar:/home/jenkins/workspace/Test_openjdk21_hs_extended.openjdk_s390x_linux_testList_0/jvmtest/openjdk/jtreg/lib/guice-5.1.0.jar:/home/jenkins/workspace/Test_openjdk21_hs_extended.openjdk_s390x_linux_testList_0/jvmtest/openjdk/jtreg/lib/jcommander-1.82.jar -server -XX:+UseG1GC -XX:+UnlockDiagnosticVMOptions -XX:+UnlockExperimentalVMOptions -XX:MaxLabelRootDepth=2147483647 optionsvalidation.JVMStartup ]
[2025-06-27T03:26:41.965Z] [2025-06-27T03:26:33.044307891Z] Gathering output for process 850556
[2025-06-27T03:26:41.965Z] [2025-06-27T03:26:33.044584245Z] Waiting for completion for process 850556
[2025-06-27T03:26:41.965Z] [2025-06-27T03:26:33.113077066Z] Waiting for completion finished for process 850556
[2025-06-27T03:26:41.965Z]
[2025-06-27T03:26:41.965Z] Testing invalid MaxLabelRootDepth values.
[2025-06-27T03:26:41.965Z] Command line: [/home/jenkins/workspace/Test_openjdk21_hs_extended.openjdk_s390x_linux_testList_0/jdkbinary/j2sdk-image/bin/java -cp /home/jenkins/workspace/Test_openjdk21_hs_extended.openjdk_s390x_linux_testList_0/aqa-tests/TKG/output_17509909975678/hotspot_runtime_0/work/classes/runtime/CommandLine/OptionsValidation/TestOptionsWithRanges_id4.d:/home/jenkins/workspace/Test_openjdk21_hs_extended.openjdk_s390x_linux_testList_0/aqa-tests/openjdk/openjdk-jdk/test/hotspot/jtreg/runtime/CommandLine/OptionsValidation:/home/jenkins/workspace/Test_openjdk21_hs_extended.openjdk_s390x_linux_testList_0/aqa-tests/TKG/output_17509909975678/hotspot_runtime_0/work/classes/test/lib:/home/jenkins/workspace/Test_openjdk21_hs_extended.openjdk_s390x_linux_testList_0/aqa-tests/TKG/output_17509909975678/hotspot_runtime_0/work/classes/runtime/CommandLine/OptionsValidation/common:/home/jenkins/workspace/Test_openjdk21_hs_extended.openjdk_s390x_linux_testList_0/jvmtest/openjdk/jtreg/lib/javatest.jar:/home/jenkins/workspace/Test_openjdk21_hs_extended.openjdk_s390x_linux_testList_0/jvmtest/openjdk/jtreg/lib/jtreg.jar:/home/jenkins/workspace/Test_openjdk21_hs_extended.openjdk_s390x_linux_testList_0/jvmtest/openjdk/jtreg/lib/junit-platform-console-standalone-1.9.2.jar:/home/jenkins/workspace/Test_openjdk21_hs_extended.openjdk_s390x_linux_testList_0/jvmtest/openjdk/jtreg/lib/testng-7.3.0.jar:/home/jenkins/workspace/Test_openjdk21_hs_extended.openjdk_s390x_linux_testList_0/jvmtest/openjdk/jtreg/lib/guice-5.1.0.jar:/home/jenkins/workspace/Test_openjdk21_hs_extended.openjdk_s390x_linux_testList_0/jvmtest/openjdk/jtreg/lib/jcommander-1.82.jar -server -XX:+UseG1GC -XX:+UnlockDiagnosticVMOptions -XX:+UnlockExperimentalVMOptions -XX:MaxLabelRootDepth=99 optionsvalidation.JVMStartup ]
[2025-06-27T03:26:41.965Z] [2025-06-27T03:26:33.120467555Z] Gathering output for process 850577
[2025-06-27T03:26:41.965Z] [2025-06-27T03:26:33.120721740Z] Waiting for completion for process 850577
[2025-06-27T03:26:41.965Z] [2025-06-27T03:26:33.121563362Z] Waiting for completion finished for process 850577
[2025-06-27T03:26:41.965Z]
[2025-06-27T03:26:41.965Z] Command line: [/home/jenkins/workspace/Test_openjdk21_hs_extended.openjdk_s390x_linux_testList_0/jdkbinary/j2sdk-image/bin/java -cp /home/jenkins/workspace/Test_openjdk21_hs_extended.openjdk_s390x_linux_testList_0/aqa-tests/TKG/output_17509909975678/hotspot_runtime_0/work/classes/runtime/CommandLine/OptionsValidation/TestOptionsWithRanges_id4.d:/home/jenkins/workspace/Test_openjdk21_hs_extended.openjdk_s390x_linux_testList_0/aqa-tests/openjdk/openjdk-jdk/test/hotspot/jtreg/runtime/CommandLine/OptionsValidation:/home/jenkins/workspace/Test_openjdk21_hs_extended.openjdk_s390x_linux_testList_0/aqa-tests/TKG/output_17509909975678/hotspot_runtime_0/work/classes/test/lib:/home/jenkins/workspace/Test_openjdk21_hs_extended.openjdk_s390x_linux_testList_0/aqa-tests/TKG/output_17509909975678/hotspot_runtime_0/work/classes/runtime/CommandLine/OptionsValidation/common:/home/jenkins/workspace/Test_openjdk21_hs_extended.openjdk_s390x_linux_testList_0/jvmtest/openjdk/jtreg/lib/javatest.jar:/home/jenkins/workspace/Test_openjdk21_hs_extended.openjdk_s390x_linux_testList_0/jvmtest/openjdk/jtreg/lib/jtreg.jar:/home/jenkins/workspace/Test_openjdk21_hs_extended.openjdk_s390x_linux_testList_0/jvmtest/openjdk/jtreg/lib/junit-platform-console-standalone-1.9.2.jar:/home/jenkins/workspace/Test_openjdk21_hs_extended.openjdk_s390x_linux_testList_0/jvmtest/openjdk/jtreg/lib/testng-7.3.0.jar:/home/jenkins/workspace/Test_openjdk21_hs_extended.openjdk_s390x_linux_testList_0/jvmtest/openjdk/jtreg/lib/guice-5.1.0.jar:/home/jenkins/workspace/Test_openjdk21_hs_extended.openjdk_s390x_linux_testList_0/jvmtest/openjdk/jtreg/lib/jcommander-1.82.jar -server -XX:+UseG1GC -XX:+UnlockDiagnosticVMOptions -XX:+UnlockExperimentalVMOptions -XX:MaxLabelRootDepth=2147483648 optionsvalidation.JVMStartup ]
[2025-06-27T03:26:41.965Z] [2025-06-27T03:26:33.127073170Z] Gathering output for process 850581
[2025-06-27T03:26:41.965Z] [2025-06-27T03:26:33.127573709Z] Waiting for completion for process 850581
[2025-06-27T03:26:41.965Z] [2025-06-27T03:26:33.127898133Z] Waiting for completion finished for process 850581
[2025-06-27T03:26:41.965Z]
[2025-06-27T03:26:41.965Z] Testing valid MaxLoopPad values.
[2025-06-27T03:26:41.966Z] Command line: [/home/jenkins/workspace/Test_openjdk21_hs_extended.openjdk_s390x_linux_testList_0/jdkbinary/j2sdk-image/bin/java -cp /home/jenkins/workspace/Test_openjdk21_hs_extended.openjdk_s390x_linux_testList_0/aqa-tests/TKG/output_17509909975678/hotspot_runtime_0/work/classes/runtime/CommandLine/OptionsValidation/TestOptionsWithRanges_id4.d:/home/jenkins/workspace/Test_openjdk21_hs_extended.openjdk_s390x_linux_testList_0/aqa-tests/openjdk/openjdk-jdk/test/hotspot/jtreg/runtime/CommandLine/OptionsValidation:/home/jenkins/workspace/Test_openjdk21_hs_extended.openjdk_s390x_linux_testList_0/aqa-tests/TKG/output_17509909975678/hotspot_runtime_0/work/classes/test/lib:/home/jenkins/workspace/Test_openjdk21_hs_extended.openjdk_s390x_linux_testList_0/aqa-tests/TKG/output_17509909975678/hotspot_runtime_0/work/classes/runtime/CommandLine/OptionsValidation/common:/home/jenkins/workspace/Test_openjdk21_hs_extended.openjdk_s390x_linux_testList_0/jvmtest/openjdk/jtreg/lib/javatest.jar:/home/jenkins/workspace/Test_openjdk21_hs_extended.openjdk_s390x_linux_testList_0/jvmtest/openjdk/jtreg/lib/jtreg.jar:/home/jenkins/workspace/Test_openjdk21_hs_extended.openjdk_s390x_linux_testList_0/jvmtest/openjdk/jtreg/lib/junit-platform-console-standalone-1.9.2.jar:/home/jenkins/workspace/Test_openjdk21_hs_extended.openjdk_s390x_linux_testList_0/jvmtest/openjdk/jtreg/lib/testng-7.3.0.jar:/home/jenkins/workspace/Test_openjdk21_hs_extended.openjdk_s390x_linux_testList_0/jvmtest/openjdk/jtreg/lib/guice-5.1.0.jar:/home/jenkins/workspace/Test_openjdk21_hs_extended.openjdk_s390x_linux_testList_0/jvmtest/openjdk/jtreg/lib/jcommander-1.82.jar -server -XX:+UseG1GC -XX:+UnlockDiagnosticVMOptions -XX:+UnlockExperimentalVMOptions -XX:MaxLoopPad=0 optionsvalidation.JVMStartup ]
[2025-06-27T03:26:41.966Z] [2025-06-27T03:26:33.146283397Z] Gathering output for process 850585
[2025-06-27T03:26:41.966Z] [2025-06-27T03:26:33.146568256Z] Waiting for completion for process 850585
[2025-06-27T03:26:41.966Z] [2025-06-27T03:26:33.227406950Z] Waiting for completion finished for process 850585
[2025-06-27T03:26:41.966Z]
[2025-06-27T03:26:41.966Z] Command line: [/home/jenkins/workspace/Test_openjdk21_hs_extended.openjdk_s390x_linux_testList_0/jdkbinary/j2sdk-image/bin/java -cp /home/jenkins/workspace/Test_openjdk21_hs_extended.openjdk_s390x_linux_testList_0/aqa-tests/TKG/output_17509909975678/hotspot_runtime_0/work/classes/runtime/CommandLine/OptionsValidation/TestOptionsWithRanges_id4.d:/home/jenkins/workspace/Test_openjdk21_hs_extended.openjdk_s390x_linux_testList_0/aqa-tests/openjdk/openjdk-jdk/test/hotspot/jtreg/runtime/CommandLine/OptionsValidation:/home/jenkins/workspace/Test_openjdk21_hs_extended.openjdk_s390x_linux_testList_0/aqa-tests/TKG/output_17509909975678/hotspot_runtime_0/work/classes/test/lib:/home/jenkins/workspace/Test_openjdk21_hs_extended.openjdk_s390x_linux_testList_0/aqa-tests/TKG/output_17509909975678/hotspot_runtime_0/work/classes/runtime/CommandLine/OptionsValidation/common:/home/jenkins/workspace/Test_openjdk21_hs_extended.openjdk_s390x_linux_testList_0/jvmtest/openjdk/jtreg/lib/javatest.jar:/home/jenkins/workspace/Test_openjdk21_hs_extended.openjdk_s390x_linux_testList_0/jvmtest/openjdk/jtreg/lib/jtreg.jar:/home/jenkins/workspace/Test_openjdk21_hs_extended.openjdk_s390x_linux_testList_0/jvmtest/openjdk/jtreg/lib/junit-platform-console-standalone-1.9.2.jar:/home/jenkins/workspace/Test_openjdk21_hs_extended.openjdk_s390x_linux_testList_0/jvmtest/openjdk/jtreg/lib/testng-7.3.0.jar:/home/jenkins/workspace/Test_openjdk21_hs_extended.openjdk_s390x_linux_testList_0/jvmtest/openjdk/jtreg/lib/guice-5.1.0.jar:/home/jenkins/workspace/Test_openjdk21_hs_extended.openjdk_s390x_linux_testList_0/jvmtest/openjdk/jtreg/lib/jcommander-1.82.jar -server -XX:+UseG1GC -XX:+UnlockDiagnosticVMOptions -XX:+UnlockExperimentalVMOptions -XX:MaxLoopPad=2147483647 optionsvalidation.JVMStartup ]
[2025-06-27T03:26:41.966Z] [2025-06-27T03:26:33.236253246Z] Gathering output for process 850606
[2025-06-27T03:26:41.966Z] [2025-06-27T03:26:33.236535365Z] Waiting for completion for process 850606
[2025-06-27T03:26:41.966Z] [2025-06-27T03:26:33.294716783Z] Waiting for completion finished for process 850606
[2025-06-27T03:26:41.966Z]
[2025-06-27T03:26:41.966Z] Command line: [/home/jenkins/workspace/Test_openjdk21_hs_extended.openjdk_s390x_linux_testList_0/jdkbinary/j2sdk-image/bin/java -cp /home/jenkins/workspace/Test_openjdk21_hs_extended.openjdk_s390x_linux_testList_0/aqa-tests/TKG/output_17509909975678/hotspot_runtime_0/work/classes/runtime/CommandLine/OptionsValidation/TestOptionsWithRanges_id4.d:/home/jenkins/workspace/Test_openjdk21_hs_extended.openjdk_s390x_linux_testList_0/aqa-tests/openjdk/openjdk-jdk/test/hotspot/jtreg/runtime/CommandLine/OptionsValidation:/home/jenkins/workspace/Test_openjdk21_hs_extended.openjdk_s390x_linux_testList_0/aqa-tests/TKG/output_17509909975678/hotspot_runtime_0/work/classes/test/lib:/home/jenkins/workspace/Test_openjdk21_hs_extended.openjdk_s390x_linux_testList_0/aqa-tests/TKG/output_17509909975678/hotspot_runtime_0/work/classes/runtime/CommandLine/OptionsValidation/common:/home/jenkins/workspace/Test_openjdk21_hs_extended.openjdk_s390x_linux_testList_0/jvmtest/openjdk/jtreg/lib/javatest.jar:/home/jenkins/workspace/Test_openjdk21_hs_extended.openjdk_s390x_linux_testList_0/jvmtest/openjdk/jtreg/lib/jtreg.jar:/home/jenkins/workspace/Test_openjdk21_hs_extended.openjdk_s390x_linux_testList_0/jvmtest/openjdk/jtreg/lib/junit-platform-console-standalone-1.9.2.jar:/home/jenkins/workspace/Test_openjdk21_hs_extended.openjdk_s390x_linux_testList_0/jvmtest/openjdk/jtreg/lib/testng-7.3.0.jar:/home/jenkins/workspace/Test_openjdk21_hs_extended.openjdk_s390x_linux_testList_0/jvmtest/openjdk/jtreg/lib/guice-5.1.0.jar:/home/jenkins/workspace/Test_openjdk21_hs_extended.openjdk_s390x_linux_testList_0/jvmtest/openjdk/jtreg/lib/jcommander-1.82.jar -server -XX:+UseG1GC -XX:+UnlockDiagnosticVMOptions -XX:+UnlockExperimentalVMOptions -XX:MaxLoopPad=1 optionsvalidation.JVMStartup ]
[2025-06-27T03:26:41.966Z] [2025-06-27T03:26:33.301540624Z] Gathering output for process 850627
[2025-06-27T03:26:41.966Z] [2025-06-27T03:26:33.304393785Z] Waiting for completion for process 850627
[2025-06-27T03:26:41.966Z] [2025-06-27T03:26:33.364453132Z] Waiting for completion finished for process 850627
[2025-06-27T03:26:41.966Z]
[2025-06-27T03:26:41.966Z] Testing invalid MaxLoopPad values.
[2025-06-27T03:26:41.966Z] Command line: [/home/jenkins/workspace/Test_openjdk21_hs_extended.openjdk_s390x_linux_testList_0/jdkbinary/j2sdk-image/bin/java -cp /home/jenkins/workspace/Test_openjdk21_hs_extended.openjdk_s390x_linux_testList_0/aqa-tests/TKG/output_17509909975678/hotspot_runtime_0/work/classes/runtime/CommandLine/OptionsValidation/TestOptionsWithRanges_id4.d:/home/jenkins/workspace/Test_openjdk21_hs_extended.openjdk_s390x_linux_testList_0/aqa-tests/openjdk/openjdk-jdk/test/hotspot/jtreg/runtime/CommandLine/OptionsValidation:/home/jenkins/workspace/Test_openjdk21_hs_extended.openjdk_s390x_linux_testList_0/aqa-tests/TKG/output_17509909975678/hotspot_runtime_0/work/classes/test/lib:/home/jenkins/workspace/Test_openjdk21_hs_extended.openjdk_s390x_linux_testList_0/aqa-tests/TKG/output_17509909975678/hotspot_runtime_0/work/classes/runtime/CommandLine/OptionsValidation/common:/home/jenkins/workspace/Test_openjdk21_hs_extended.openjdk_s390x_linux_testList_0/jvmtest/openjdk/jtreg/lib/javatest.jar:/home/jenkins/workspace/Test_openjdk21_hs_extended.openjdk_s390x_linux_testList_0/jvmtest/openjdk/jtreg/lib/jtreg.jar:/home/jenkins/workspace/Test_openjdk21_hs_extended.openjdk_s390x_linux_testList_0/jvmtest/openjdk/jtreg/lib/junit-platform-console-standalone-1.9.2.jar:/home/jenkins/workspace/Test_openjdk21_hs_extended.openjdk_s390x_linux_testList_0/jvmtest/openjdk/jtreg/lib/testng-7.3.0.jar:/home/jenkins/workspace/Test_openjdk21_hs_extended.openjdk_s390x_linux_testList_0/jvmtest/openjdk/jtreg/lib/guice-5.1.0.jar:/home/jenkins/workspace/Test_openjdk21_hs_extended.openjdk_s390x_linux_testList_0/jvmtest/openjdk/jtreg/lib/jcommander-1.82.jar -server -XX:+UseG1GC -XX:+UnlockDiagnosticVMOptions -XX:+UnlockExperimentalVMOptions -XX:MaxLoopPad=-1 optionsvalidation.JVMStartup ]
[2025-06-27T03:26:41.966Z] [2025-06-27T03:26:33.367590231Z] Gathering output for process 850648
[2025-06-27T03:26:41.966Z] [2025-06-27T03:26:33.367873521Z] Waiting for completion for process 850648
[2025-06-27T03:26:41.966Z] [2025-06-27T03:26:33.372829920Z] Waiting for completion finished for process 850648
[2025-06-27T03:26:41.966Z]
[2025-06-27T03:26:41.966Z] Command line: [/home/jenkins/workspace/Test_openjdk21_hs_extended.openjdk_s390x_linux_testList_0/jdkbinary/j2sdk-image/bin/java -cp /home/jenkins/workspace/Test_openjdk21_hs_extended.openjdk_s390x_linux_testList_0/aqa-tests/TKG/output_17509909975678/hotspot_runtime_0/work/classes/runtime/CommandLine/OptionsValidation/TestOptionsWithRanges_id4.d:/home/jenkins/workspace/Test_openjdk21_hs_extended.openjdk_s390x_linux_testList_0/aqa-tests/openjdk/openjdk-jdk/test/hotspot/jtreg/runtime/CommandLine/OptionsValidation:/home/jenkins/workspace/Test_openjdk21_hs_extended.openjdk_s390x_linux_testList_0/aqa-tests/TKG/output_17509909975678/hotspot_runtime_0/work/classes/test/lib:/home/jenkins/workspace/Test_openjdk21_hs_extended.openjdk_s390x_linux_testList_0/aqa-tests/TKG/output_17509909975678/hotspot_runtime_0/work/classes/runtime/CommandLine/OptionsValidation/common:/home/jenkins/workspace/Test_openjdk21_hs_extended.openjdk_s390x_linux_testList_0/jvmtest/openjdk/jtreg/lib/javatest.jar:/home/jenkins/workspace/Test_openjdk21_hs_extended.openjdk_s390x_linux_testList_0/jvmtest/openjdk/jtreg/lib/jtreg.jar:/home/jenkins/workspace/Test_openjdk21_hs_extended.openjdk_s390x_linux_testList_0/jvmtest/openjdk/jtreg/lib/junit-platform-console-standalone-1.9.2.jar:/home/jenkins/workspace/Test_openjdk21_hs_extended.openjdk_s390x_linux_testList_0/jvmtest/openjdk/jtreg/lib/testng-7.3.0.jar:/home/jenkins/workspace/Test_openjdk21_hs_extended.openjdk_s390x_linux_testList_0/jvmtest/openjdk/jtreg/lib/guice-5.1.0.jar:/home/jenkins/workspace/Test_openjdk21_hs_extended.openjdk_s390x_linux_testList_0/jvmtest/openjdk/jtreg/lib/jcommander-1.82.jar -server -XX:+UseG1GC -XX:+UnlockDiagnosticVMOptions -XX:+UnlockExperimentalVMOptions -XX:MaxLoopPad=2147483648 optionsvalidation.JVMStartup ]
[2025-06-27T03:26:41.966Z] [2025-06-27T03:26:33.377098799Z] Gathering output for process 850652
[2025-06-27T03:26:41.966Z] [2025-06-27T03:26:33.377863501Z] Waiting for completion for process 850652
[2025-06-27T03:26:41.966Z] [2025-06-27T03:26:33.377873855Z] Waiting for completion finished for process 850652
[2025-06-27T03:26:41.966Z]
[2025-06-27T03:26:41.966Z] Testing valid MaxMetaspaceExpansion values.
[2025-06-27T03:26:41.966Z] Command line: [/home/jenkins/workspace/Test_openjdk21_hs_extended.openjdk_s390x_linux_testList_0/jdkbinary/j2sdk-image/bin/java -cp /home/jenkins/workspace/Test_openjdk21_hs_extended.openjdk_s390x_linux_testList_0/aqa-tests/TKG/output_17509909975678/hotspot_runtime_0/work/classes/runtime/CommandLine/OptionsValidation/TestOptionsWithRanges_id4.d:/home/jenkins/workspace/Test_openjdk21_hs_extended.openjdk_s390x_linux_testList_0/aqa-tests/openjdk/openjdk-jdk/test/hotspot/jtreg/runtime/CommandLine/OptionsValidation:/home/jenkins/workspace/Test_openjdk21_hs_extended.openjdk_s390x_linux_testList_0/aqa-tests/TKG/output_17509909975678/hotspot_runtime_0/work/classes/test/lib:/home/jenkins/workspace/Test_openjdk21_hs_extended.openjdk_s390x_linux_testList_0/aqa-tests/TKG/output_17509909975678/hotspot_runtime_0/work/classes/runtime/CommandLine/OptionsValidation/common:/home/jenkins/workspace/Test_openjdk21_hs_extended.openjdk_s390x_linux_testList_0/jvmtest/openjdk/jtreg/lib/javatest.jar:/home/jenkins/workspace/Test_openjdk21_hs_extended.openjdk_s390x_linux_testList_0/jvmtest/openjdk/jtreg/lib/jtreg.jar:/home/jenkins/workspace/Test_openjdk21_hs_extended.openjdk_s390x_linux_testList_0/jvmtest/openjdk/jtreg/lib/junit-platform-console-standalone-1.9.2.jar:/home/jenkins/workspace/Test_openjdk21_hs_extended.openjdk_s390x_linux_testList_0/jvmtest/openjdk/jtreg/lib/testng-7.3.0.jar:/home/jenkins/workspace/Test_openjdk21_hs_extended.openjdk_s390x_linux_testList_0/jvmtest/openjdk/jtreg/lib/guice-5.1.0.jar:/home/jenkins/workspace/Test_openjdk21_hs_extended.openjdk_s390x_linux_testList_0/jvmtest/openjdk/jtreg/lib/jcommander-1.82.jar -server -XX:+UseG1GC -XX:+UnlockDiagnosticVMOptions -XX:+UnlockExperimentalVMOptions -XX:MaxMetaspaceExpansion=0 optionsvalidation.JVMStartup ]
[2025-06-27T03:26:41.966Z] [2025-06-27T03:26:33.396009174Z] Gathering output for process 850656
[2025-06-27T03:26:41.966Z] [2025-06-27T03:26:33.398469131Z] Waiting for completion for process 850656
[2025-06-27T03:26:41.966Z] [2025-06-27T03:26:33.531831105Z] Waiting for completion finished for process 850656
[2025-06-27T03:26:41.966Z]
[2025-06-27T03:26:41.966Z] Command line: [/home/jenkins/workspace/Test_openjdk21_hs_extended.openjdk_s390x_linux_testList_0/jdkbinary/j2sdk-image/bin/java -cp /home/jenkins/workspace/Test_openjdk21_hs_extended.openjdk_s390x_linux_testList_0/aqa-tests/TKG/output_17509909975678/hotspot_runtime_0/work/classes/runtime/CommandLine/OptionsValidation/TestOptionsWithRanges_id4.d:/home/jenkins/workspace/Test_openjdk21_hs_extended.openjdk_s390x_linux_testList_0/aqa-tests/openjdk/openjdk-jdk/test/hotspot/jtreg/runtime/CommandLine/OptionsValidation:/home/jenkins/workspace/Test_openjdk21_hs_extended.openjdk_s390x_linux_testList_0/aqa-tests/TKG/output_17509909975678/hotspot_runtime_0/work/classes/test/lib:/home/jenkins/workspace/Test_openjdk21_hs_extended.openjdk_s390x_linux_testList_0/aqa-tests/TKG/output_17509909975678/hotspot_runtime_0/work/classes/runtime/CommandLine/OptionsValidation/common:/home/jenkins/workspace/Test_openjdk21_hs_extended.openjdk_s390x_linux_testList_0/jvmtest/openjdk/jtreg/lib/javatest.jar:/home/jenkins/workspace/Test_openjdk21_hs_extended.openjdk_s390x_linux_testList_0/jvmtest/openjdk/jtreg/lib/jtreg.jar:/home/jenkins/workspace/Test_openjdk21_hs_extended.openjdk_s390x_linux_testList_0/jvmtest/openjdk/jtreg/lib/junit-platform-console-standalone-1.9.2.jar:/home/jenkins/workspace/Test_openjdk21_hs_extended.openjdk_s390x_linux_testList_0/jvmtest/openjdk/jtreg/lib/testng-7.3.0.jar:/home/jenkins/workspace/Test_openjdk21_hs_extended.openjdk_s390x_linux_testList_0/jvmtest/openjdk/jtreg/lib/guice-5.1.0.jar:/home/jenkins/workspace/Test_openjdk21_hs_extended.openjdk_s390x_linux_testList_0/jvmtest/openjdk/jtreg/lib/jcommander-1.82.jar -server -XX:+UseG1GC -XX:+UnlockDiagnosticVMOptions -XX:+UnlockExperimentalVMOptions -XX:MaxMetaspaceExpansion=18446744073709551615 optionsvalidation.JVMStartup ]
[2025-06-27T03:26:41.966Z] [2025-06-27T03:26:33.542327471Z] Gathering output for process 850679
[2025-06-27T03:26:41.966Z] [2025-06-27T03:26:33.543280801Z] Waiting for completion for process 850679
[2025-06-27T03:26:41.966Z] [2025-06-27T03:26:33.610932201Z] Waiting for completion finished for process 850679
[2025-06-27T03:26:41.966Z]
[2025-06-27T03:26:41.966Z] Command line: [/home/jenkins/workspace/Test_openjdk21_hs_extended.openjdk_s390x_linux_testList_0/jdkbinary/j2sdk-image/bin/java -cp /home/jenkins/workspace/Test_openjdk21_hs_extended.openjdk_s390x_linux_testList_0/aqa-tests/TKG/output_17509909975678/hotspot_runtime_0/work/classes/runtime/CommandLine/OptionsValidation/TestOptionsWithRanges_id4.d:/home/jenkins/workspace/Test_openjdk21_hs_extended.openjdk_s390x_linux_testList_0/aqa-tests/openjdk/openjdk-jdk/test/hotspot/jtreg/runtime/CommandLine/OptionsValidation:/home/jenkins/workspace/Test_openjdk21_hs_extended.openjdk_s390x_linux_testList_0/aqa-tests/TKG/output_17509909975678/hotspot_runtime_0/work/classes/test/lib:/home/jenkins/workspace/Test_openjdk21_hs_extended.openjdk_s390x_linux_testList_0/aqa-tests/TKG/output_17509909975678/hotspot_runtime_0/work/classes/runtime/CommandLine/OptionsValidation/common:/home/jenkins/workspace/Test_openjdk21_hs_extended.openjdk_s390x_linux_testList_0/jvmtest/openjdk/jtreg/lib/javatest.jar:/home/jenkins/workspace/Test_openjdk21_hs_extended.openjdk_s390x_linux_testList_0/jvmtest/openjdk/jtreg/lib/jtreg.jar:/home/jenkins/workspace/Test_openjdk21_hs_extended.openjdk_s390x_linux_testList_0/jvmtest/openjdk/jtreg/lib/junit-platform-console-standalone-1.9.2.jar:/home/jenkins/workspace/Test_openjdk21_hs_extended.openjdk_s390x_linux_testList_0/jvmtest/openjdk/jtreg/lib/testng-7.3.0.jar:/home/jenkins/workspace/Test_openjdk21_hs_extended.openjdk_s390x_linux_testList_0/jvmtest/openjdk/jtreg/lib/guice-5.1.0.jar:/home/jenkins/workspace/Test_openjdk21_hs_extended.openjdk_s390x_linux_testList_0/jvmtest/openjdk/jtreg/lib/jcommander-1.82.jar -server -XX:+UseG1GC -XX:+UnlockDiagnosticVMOptions -XX:+UnlockExperimentalVMOptions -XX:MaxMetaspaceExpansion=1 optionsvalidation.JVMStartup ]
[2025-06-27T03:26:41.966Z] [2025-06-27T03:26:33.617259659Z] Gathering output for process 850700
[2025-06-27T03:26:41.966Z] [2025-06-27T03:26:33.619666737Z] Waiting for completion for process 850700
[2025-06-27T03:26:41.966Z] [2025-06-27T03:26:33.758029800Z] Waiting for completion finished for process 850700
[2025-06-27T03:26:41.966Z]
[2025-06-27T03:26:41.966Z] Command line: [/home/jenkins/workspace/Test_openjdk21_hs_extended.openjdk_s390x_linux_testList_0/jdkbinary/j2sdk-image/bin/java -cp /home/jenkins/workspace/Test_openjdk21_hs_extended.openjdk_s390x_linux_testList_0/aqa-tests/TKG/output_17509909975678/hotspot_runtime_0/work/classes/runtime/CommandLine/OptionsValidation/TestOptionsWithRanges_id4.d:/home/jenkins/workspace/Test_openjdk21_hs_extended.openjdk_s390x_linux_testList_0/aqa-tests/openjdk/openjdk-jdk/test/hotspot/jtreg/runtime/CommandLine/OptionsValidation:/home/jenkins/workspace/Test_openjdk21_hs_extended.openjdk_s390x_linux_testList_0/aqa-tests/TKG/output_17509909975678/hotspot_runtime_0/work/classes/test/lib:/home/jenkins/workspace/Test_openjdk21_hs_extended.openjdk_s390x_linux_testList_0/aqa-tests/TKG/output_17509909975678/hotspot_runtime_0/work/classes/runtime/CommandLine/OptionsValidation/common:/home/jenkins/workspace/Test_openjdk21_hs_extended.openjdk_s390x_linux_testList_0/jvmtest/openjdk/jtreg/lib/javatest.jar:/home/jenkins/workspace/Test_openjdk21_hs_extended.openjdk_s390x_linux_testList_0/jvmtest/openjdk/jtreg/lib/jtreg.jar:/home/jenkins/workspace/Test_openjdk21_hs_extended.openjdk_s390x_linux_testList_0/jvmtest/openjdk/jtreg/lib/junit-platform-console-standalone-1.9.2.jar:/home/jenkins/workspace/Test_openjdk21_hs_extended.openjdk_s390x_linux_testList_0/jvmtest/openjdk/jtreg/lib/testng-7.3.0.jar:/home/jenkins/workspace/Test_openjdk21_hs_extended.openjdk_s390x_linux_testList_0/jvmtest/openjdk/jtreg/lib/guice-5.1.0.jar:/home/jenkins/workspace/Test_openjdk21_hs_extended.openjdk_s390x_linux_testList_0/jvmtest/openjdk/jtreg/lib/jcommander-1.82.jar -server -XX:+UseG1GC -XX:+UnlockDiagnosticVMOptions -XX:+UnlockExperimentalVMOptions -XX:MaxMetaspaceExpansion=2147483648 optionsvalidation.JVMStartup ]
[2025-06-27T03:26:41.966Z] [2025-06-27T03:26:33.770205373Z] Gathering output for process 850721
[2025-06-27T03:26:41.966Z] [2025-06-27T03:26:33.770753979Z] Waiting for completion for process 850721
[2025-06-27T03:26:41.966Z] [2025-06-27T03:26:33.942737943Z] Waiting for completion finished for process 850721
[2025-06-27T03:26:41.966Z]
[2025-06-27T03:26:41.966Z] Command line: [/home/jenkins/workspace/Test_openjdk21_hs_extended.openjdk_s390x_linux_testList_0/jdkbinary/j2sdk-image/bin/java -cp /home/jenkins/workspace/Test_openjdk21_hs_extended.openjdk_s390x_linux_testList_0/aqa-tests/TKG/output_17509909975678/hotspot_runtime_0/work/classes/runtime/CommandLine/OptionsValidation/TestOptionsWithRanges_id4.d:/home/jenkins/workspace/Test_openjdk21_hs_extended.openjdk_s390x_linux_testList_0/aqa-tests/openjdk/openjdk-jdk/test/hotspot/jtreg/runtime/CommandLine/OptionsValidation:/home/jenkins/workspace/Test_openjdk21_hs_extended.openjdk_s390x_linux_testList_0/aqa-tests/TKG/output_17509909975678/hotspot_runtime_0/work/classes/test/lib:/home/jenkins/workspace/Test_openjdk21_hs_extended.openjdk_s390x_linux_testList_0/aqa-tests/TKG/output_17509909975678/hotspot_runtime_0/work/classes/runtime/CommandLine/OptionsValidation/common:/home/jenkins/workspace/Test_openjdk21_hs_extended.openjdk_s390x_linux_testList_0/jvmtest/openjdk/jtreg/lib/javatest.jar:/home/jenkins/workspace/Test_openjdk21_hs_extended.openjdk_s390x_linux_testList_0/jvmtest/openjdk/jtreg/lib/jtreg.jar:/home/jenkins/workspace/Test_openjdk21_hs_extended.openjdk_s390x_linux_testList_0/jvmtest/openjdk/jtreg/lib/junit-platform-console-standalone-1.9.2.jar:/home/jenkins/workspace/Test_openjdk21_hs_extended.openjdk_s390x_linux_testList_0/jvmtest/openjdk/jtreg/lib/testng-7.3.0.jar:/home/jenkins/workspace/Test_openjdk21_hs_extended.openjdk_s390x_linux_testList_0/jvmtest/openjdk/jtreg/lib/guice-5.1.0.jar:/home/jenkins/workspace/Test_openjdk21_hs_extended.openjdk_s390x_linux_testList_0/jvmtest/openjdk/jtreg/lib/jcommander-1.82.jar -server -XX:+UseG1GC -XX:+UnlockDiagnosticVMOptions -XX:+UnlockExperimentalVMOptions -XX:MaxMetaspaceExpansion=4294967296 optionsvalidation.JVMStartup ]
[2025-06-27T03:26:41.966Z] [2025-06-27T03:26:33.952302167Z] Gathering output for process 850742
[2025-06-27T03:26:41.966Z] [2025-06-27T03:26:33.952608655Z] Waiting for completion for process 850742
[2025-06-27T03:26:41.966Z] [2025-06-27T03:26:34.145987788Z] Waiting for completion finished for process 850742
[2025-06-27T03:26:41.966Z]
[2025-06-27T03:26:41.966Z] STDERR:
[2025-06-27T03:26:41.966Z] TEST FAILED: Error processing option LogEventsBufferEntries with valid value '-server -XX:+UseG1GC -XX:LogEventsBufferEntries=1048576'! JVM exited with unexpected error code = 137 [0x89]
[2025-06-27T03:26:41.966Z] stdout content[]
[2025-06-27T03:26:41.966Z] stderr content[]
[2025-06-27T03:26:41.966Z]
[2025-06-27T03:26:41.966Z] java.lang.RuntimeException: 1 tests failed! (Error processing option LogEventsBufferEntries with valid value '-server -XX:+UseG1GC -XX:LogEventsBufferEntries=1048576'! JVM exited with unexpected error code = 137 [0x89])
[2025-06-27T03:26:41.966Z] expected: 1 but was: 0
[2025-06-27T03:26:41.966Z] at jdk.test.lib.Asserts.fail(Asserts.java:691)
[2025-06-27T03:26:41.966Z] at jdk.test.lib.Asserts.assertEquals(Asserts.java:204)
[2025-06-27T03:26:41.966Z] at jdk.test.lib.Asserts.assertEQ(Asserts.java:180)
[2025-06-27T03:26:41.966Z] at TestOptionsWithRanges.main(TestOptionsWithRanges.java:281)
[2025-06-27T03:26:41.966Z] at java.base/jdk.internal.reflect.DirectMethodHandleAccessor.invoke(DirectMethodHandleAccessor.java:103)
[2025-06-27T03:26:41.966Z] at java.base/java.lang.reflect.Method.invoke(Method.java:580)
[2025-06-27T03:26:41.966Z] at com.sun.javatest.regtest.agent.MainActionHelper$AgentVMRunnable.run(MainActionHelper.java:333)
[2025-06-27T03:26:41.966Z] at java.base/java.lang.Thread.run(Thread.java:1583)
[2025-06-27T03:26:41.966Z]
[2025-06-27T03:26:41.966Z] JavaTest Message: Test threw exception: java.lang.RuntimeException
[2025-06-27T03:26:41.966Z] JavaTest Message: shutting down test
[2025-06-27T03:26:41.966Z]
[2025-06-27T03:26:41.966Z]
[2025-06-27T03:26:41.966Z] TEST RESULT: Failed. Execution failed: `main' threw exception: java.lang.RuntimeException: 1 tests failed! (Error processing option LogEventsBufferEntries with valid value '-server -XX:+UseG1GC -XX:LogEventsBufferEntries=1048576'! JVM exited with unexpected error code = 137 [0x89]) expected: 1 but was: 0
[2025-06-27T03:26:41.966Z] --------------------------------------------------
[2025-06-27T05:24:16.390Z] Test results: passed: 990; failed: 1
[2025-06-27T05:24:17.027Z] Report written to /home/jenkins/workspace/Test_openjdk21_hs_extended.openjdk_s390x_linux_testList_0/aqa-tests/TKG/output_17509909975678/hotspot_runtime_0/report/html/report.html
[2025-06-27T05:24:17.027Z] Results written to /home/jenkins/workspace/Test_openjdk21_hs_extended.openjdk_s390x_linux_testList_0/aqa-tests/TKG/output_17509909975678/hotspot_runtime_0/work
[2025-06-27T05:24:17.027Z] Error: Some tests failed or other problems occurred.
[2025-06-27T05:24:17.027Z] -----------------------------------
[2025-06-27T05:24:17.027Z] hotspot_runtime_0_FAILED
[2025-06-27T05:24:17.027Z] -----------------------------------
[2025-06-27T05:24:17.027Z]
[2025-06-27T05:24:17.027Z] TEST TEARDOWN:
[2025-06-27T05:24:17.027Z] Nothing to be done for teardown.
[2025-06-27T05:24:17.027Z] hotspot_runtime_0 Finish Time: Fri Jun 27 01:24:16 2025 Epoch Time (ms): 1751001856604