PatModImg_Unex_1
[2025-06-19T19:27:19.176Z] Running test PatModImg_Unex_1 ...
[2025-06-19T19:27:19.176Z] ===============================================
[2025-06-19T19:27:19.483Z] PatModImg_Unex_1 Start Time: Thu Jun 19 19:27:19 2025 Epoch Time (ms): 1750361239235
[2025-06-19T19:27:19.483Z] variation: Mode650
[2025-06-19T19:27:19.852Z] JVM_OPTIONS: -XX:-UseCompressedOops
[2025-06-19T19:27:19.852Z] { \
[2025-06-19T19:27:19.852Z] echo ""; echo "TEST SETUP:"; \
[2025-06-19T19:27:19.852Z] echo "Nothing to be done for setup."; \
[2025-06-19T19:27:19.852Z] mkdir -p "C:/jenkins/workspace/Test_openjdk11_hs_sanity.system_x86-64_windows_testList_1/aqa-tests/\\TKG\\output_17503587497563\\PatModImg_Unex_1"; \
[2025-06-19T19:27:19.852Z] cd "C:/jenkins/workspace/Test_openjdk11_hs_sanity.system_x86-64_windows_testList_1/aqa-tests/\\TKG\\output_17503587497563\\PatModImg_Unex_1"; \
[2025-06-19T19:27:19.852Z] echo ""; echo "TESTING:"; \
[2025-06-19T19:27:19.852Z] perl C:/jenkins/workspace/Test_openjdk11_hs_sanity.system_x86-64_windows_testList_1/aqa-tests///..//jvmtest\\system\\modularity/../\\STF\\stf.core\\scripts\\stf.pl -test-root="C:/jenkins/workspace/Test_openjdk11_hs_sanity.system_x86-64_windows_testList_1/aqa-tests///..//jvmtest\\system\\modularity/../\\STF;C:/jenkins/workspace/Test_openjdk11_hs_sanity.system_x86-64_windows_testList_1/aqa-tests///..//jvmtest\\system\\modularity/../\\aqa-systemtest""" -systemtest-prereqs="c:/jenkins/workspace/Test_openjdk11_hs_sanity.system_x86-64_windows_testList_1/../../testDependency/system_lib\\" -java-args=' -XX:-UseCompressedOops ' -results-root="C:/jenkins/workspace/Test_openjdk11_hs_sanity.system_x86-64_windows_testList_1/aqa-tests/\\TKG\\output_17503587497563\\PatModImg_Unex_1" -test=PatModImgTest -test-args="variant=Unex"; \
[2025-06-19T19:27:19.853Z] if [ $? -eq 0 ]; then echo "-----------------------------------"; echo "PatModImg_Unex_1""_PASSED"; echo "-----------------------------------"; cd C:/jenkins/workspace/Test_openjdk11_hs_sanity.system_x86-64_windows_testList_1/aqa-tests/; rm -f -r "C:/jenkins/workspace/Test_openjdk11_hs_sanity.system_x86-64_windows_testList_1/aqa-tests/\\TKG\\output_17503587497563\\PatModImg_Unex_1"; else echo "-----------------------------------"; echo "PatModImg_Unex_1""_FAILED"; echo "-----------------------------------"; fi; \
[2025-06-19T19:27:19.853Z] echo ""; echo "TEST TEARDOWN:"; \
[2025-06-19T19:27:19.853Z] echo "Nothing to be done for teardown."; \
[2025-06-19T19:27:19.853Z] } 2>&1 | tee -a "C:/jenkins/workspace/Test_openjdk11_hs_sanity.system_x86-64_windows_testList_1/aqa-tests/\\TKG\\output_17503587497563\\TestTargetResult";
[2025-06-19T19:27:19.853Z]
[2025-06-19T19:27:19.853Z] TEST SETUP:
[2025-06-19T19:27:19.853Z] Nothing to be done for setup.
[2025-06-19T19:27:19.853Z]
[2025-06-19T19:27:19.853Z] TESTING:
[2025-06-19T19:27:20.178Z] STF 19:27:19.886 - ========================= S T F =========================
[2025-06-19T19:27:20.178Z] systemtest-prereqs has been processed, and set to: c:/jenkins/testDependency/system_libRetrieving amount of free space on drive containing C:/jenkins/workspace/Test_openjdk11_hs_sanity.system_x86-64_windows_testList_1/aqa-tests/\TKG\output_17503587497563\PatModImg_Unex_1
[2025-06-19T19:27:20.178Z] There is 105840 Mb free
[2025-06-19T19:27:20.178Z] STF 19:27:19.937 - ================== G E N E R A T I O N ==================
[2025-06-19T19:27:20.178Z] STF 19:27:19.939 - Checking JVM: c:/jenkins/workspace/Test_openjdk11_hs_sanity.system_x86-64_windows_testList_1/jdkbinary/j2sdk-image
[2025-06-19T19:27:20.178Z] STF 19:27:19.939 - Starting process to generate scripts: c:/jenkins/workspace/Test_openjdk11_hs_sanity.system_x86-64_windows_testList_1/jdkbinary/j2sdk-image/bin/java -Dlog4j.skipJansi=true -Djava.system.class.loader=net.adoptopenjdk.stf.runner.StfClassLoader -Dload.agent.path=C:/jenkins/workspace/Test_openjdk11_hs_sanity.system_x86-64_windows_testList_1/jvmtest/system/STF/stf.core/scripts/../../stf.load/bin/stf.load.jar -classpath c:/jenkins/workspace/Test_openjdk11_hs_sanity.system_x86-64_windows_testList_1/../../testDependency/system_lib\/asm/asm.jar;c:/jenkins/workspace/Test_openjdk11_hs_sanity.system_x86-64_windows_testList_1/../../testDependency/system_lib\/asm/asm-commons.jar;c:/jenkins/workspace/Test_openjdk11_hs_sanity.system_x86-64_windows_testList_1/../../testDependency/system_lib\/log4j/log4j-api.jar;c:/jenkins/workspace/Test_openjdk11_hs_sanity.system_x86-64_windows_testList_1/../../testDependency/system_lib\/log4j/log4j-core.jar;C:/jenkins/workspace/Test_openjdk11_hs_sanity.system_x86-64_windows_testList_1/jvmtest/system/STF/stf.core/scripts/../bin net.adoptopenjdk.stf.runner.StfRunner -properties "C:/jenkins/workspace/Test_openjdk11_hs_sanity.system_x86-64_windows_testList_1/aqa-tests/\TKG\output_17503587497563\PatModImg_Unex_1/20250619-192719-PatModImgTest/stf_parameters.properties, , C:/jenkins/workspace/Test_openjdk11_hs_sanity.system_x86-64_windows_testList_1/jvmtest/system/STF/stf.core/config/stf.properties" -testDir "C:/jenkins/workspace/Test_openjdk11_hs_sanity.system_x86-64_windows_testList_1/aqa-tests/\TKG\output_17503587497563\PatModImg_Unex_1/20250619-192719-PatModImgTest"
[2025-06-19T19:27:21.281Z] GEN 19:27:21.091 - Found test. Project: 'openjdk.test.modularity' class: 'PatModImgTest.class' Dir: 'C:\jenkins\workspace\Test_openjdk11_hs_sanity.system_x86-64_windows_testList_1\jvmtest\system\aqa-systemtest\openjdk.test.modularity\bin'
[2025-06-19T19:27:21.281Z] GEN 19:27:21.107 - Found test. Project: 'openjdk.test.modularity' class: 'net.adoptopenjdk.test.modularity.PatModImgTest'
[2025-06-19T19:27:21.601Z] GEN Classpath directories used by project 'openjdk.test.modularity':
[2025-06-19T19:27:21.601Z] GEN C:\jenkins\workspace\Test_openjdk11_hs_sanity.system_x86-64_windows_testList_1\jvmtest\system\aqa-systemtest\openjdk.test.modularity\bin\common-mods\displayService
[2025-06-19T19:27:21.601Z] GEN C:\jenkins\workspace\Test_openjdk11_hs_sanity.system_x86-64_windows_testList_1\jvmtest\system\aqa-systemtest\openjdk.test.modularity\bin\common-mods\com.helper
[2025-06-19T19:27:21.601Z] GEN C:\jenkins\workspace\Test_openjdk11_hs_sanity.system_x86-64_windows_testList_1\jvmtest\system\aqa-systemtest\openjdk.test.modularity\bin\common-mods\displayServiceImpl1
[2025-06-19T19:27:21.601Z] GEN C:\jenkins\workspace\Test_openjdk11_hs_sanity.system_x86-64_windows_testList_1\jvmtest\system\aqa-systemtest\openjdk.test.modularity\bin\common-mods\com.discreet
[2025-06-19T19:27:21.601Z] GEN C:\jenkins\workspace\Test_openjdk11_hs_sanity.system_x86-64_windows_testList_1\jvmtest\system\aqa-systemtest\openjdk.test.modularity\bin\common-mods\com.hello
[2025-06-19T19:27:21.601Z] GEN C:\jenkins\workspace\Test_openjdk11_hs_sanity.system_x86-64_windows_testList_1\jvmtest\system\aqa-systemtest\openjdk.test.modularity\bin\common-mods\com.hola
[2025-06-19T19:27:21.601Z] GEN C:\jenkins\workspace\Test_openjdk11_hs_sanity.system_x86-64_windows_testList_1\jvmtest\system\aqa-systemtest\openjdk.test.modularity\bin\common-mods\displayServiceImpl2
[2025-06-19T19:27:21.601Z] GEN C:\jenkins\workspace\Test_openjdk11_hs_sanity.system_x86-64_windows_testList_1\jvmtest\system\aqa-systemtest\openjdk.test.modularity\bin\common-mods\com.hi
[2025-06-19T19:27:21.601Z] GEN C:\jenkins\workspace\Test_openjdk11_hs_sanity.system_x86-64_windows_testList_1\jvmtest\system\aqa-systemtest\openjdk.test.modularity\bin\common-override
[2025-06-19T19:27:21.601Z] GEN C:\jenkins\workspace\Test_openjdk11_hs_sanity.system_x86-64_windows_testList_1\jvmtest\system\aqa-systemtest\openjdk.test.modularity\bin\common-override-new
[2025-06-19T19:27:21.601Z] GEN C:\jenkins\workspace\Test_openjdk11_hs_sanity.system_x86-64_windows_testList_1\jvmtest\system\aqa-systemtest\openjdk.test.modularity\bin\common\displayServiceImpl3
[2025-06-19T19:27:21.601Z] GEN C:\jenkins\workspace\Test_openjdk11_hs_sanity.system_x86-64_windows_testList_1\jvmtest\system\aqa-systemtest\openjdk.test.modularity\bin\common\displayServiceImpl4
[2025-06-19T19:27:21.601Z] GEN C:\jenkins\workspace\Test_openjdk11_hs_sanity.system_x86-64_windows_testList_1\jvmtest\system\aqa-systemtest\openjdk.test.modularity\bin\common
[2025-06-19T19:27:21.601Z] GEN C:\jenkins\workspace\Test_openjdk11_hs_sanity.system_x86-64_windows_testList_1\jvmtest\system\aqa-systemtest\openjdk.test.modularity\bin\tests
[2025-06-19T19:27:21.601Z] GEN C:\\jenkins\\workspace\\Test_openjdk11_hs_sanity.system_x86-64_windows_testList_1\\jvmtest\\system\\aqa-systemtest\\openjdk.test.modularity\\bin
[2025-06-19T19:27:21.601Z] GEN C:\\jenkins\\workspace\\Test_openjdk11_hs_sanity.system_x86-64_windows_testList_1\\jvmtest\\system\\STF\\stf.core\\bin
[2025-06-19T19:27:21.601Z] GEN c:/jenkins/testDependency/system_lib/log4j/log4j-api.jar
[2025-06-19T19:27:21.601Z] GEN c:/jenkins/testDependency/system_lib/log4j/log4j-core.jar
[2025-06-19T19:27:21.601Z] GEN c:/jenkins/testDependency/system_lib/junit/junit.jar
[2025-06-19T19:27:21.601Z] GEN 19:27:21.388 - Using Mode NoOptions. Values = ''
[2025-06-19T19:27:21.601Z] GEN 19:27:21.534 -
[2025-06-19T19:27:21.601Z] GEN 19:27:21.534 - Test command summary:
[2025-06-19T19:27:21.601Z] GEN 19:27:21.535 - Step Stage Command Description
[2025-06-19T19:27:21.601Z] GEN 19:27:21.535 - -----+--------+-----------------+------------
[2025-06-19T19:27:21.601Z] GEN 19:27:21.535 - 1 execute jar Create com.hello jar
[2025-06-19T19:27:21.601Z] GEN 19:27:21.535 - 2 execute jar Create com.hola jar
[2025-06-19T19:27:21.601Z] GEN 19:27:21.535 - 3 execute jar Create com.helper jar
[2025-06-19T19:27:21.601Z] GEN 19:27:21.535 - 4 execute jar Create com.discreet jar
[2025-06-19T19:27:21.601Z] GEN 19:27:21.535 - 5 execute jar Create tests jar
[2025-06-19T19:27:21.601Z] GEN 19:27:21.535 - 6 execute jlink Create runtime image for PatchModule test
[2025-06-19T19:27:21.601Z] GEN 19:27:21.535 - 7 execute jar Create com.hello jar
[2025-06-19T19:27:21.601Z] GEN 19:27:21.535 - 8 execute jar create java.xml.jar
[2025-06-19T19:27:21.601Z] GEN 19:27:21.535 - 9 execute Run java (Negative test) Include a new package that is not exported and check if the public type cannot be accessed
[2025-06-19T19:27:21.601Z] GEN 19:27:21.536 - 10 execute count Check output
[2025-06-19T19:27:21.601Z] GEN 19:27:21.536 - 11 execute Run java Include a new package that is not exported and check if the public type can be accessed by adding --add-exports
[2025-06-19T19:27:21.921Z] STF 19:27:21.591 -
[2025-06-19T19:27:21.921Z] STF 19:27:21.591 - Script generation completed
[2025-06-19T19:27:21.921Z] STF 19:27:21.591 -
[2025-06-19T19:27:21.921Z] STF 19:27:21.592 -
[2025-06-19T19:27:21.921Z] STF 19:27:21.592 - ======================= S E T U P =======================
[2025-06-19T19:27:21.921Z] STF 19:27:21.592 - Running setup: perl C:/jenkins/workspace/Test_openjdk11_hs_sanity.system_x86-64_windows_testList_1/aqa-tests/\TKG\output_17503587497563\PatModImg_Unex_1/20250619-192719-PatModImgTest/setUp.pl
[2025-06-19T19:27:21.921Z] STF 19:27:21.727 - SETUP stage completed
[2025-06-19T19:27:21.921Z] STF 19:27:21.741 -
[2025-06-19T19:27:21.921Z] STF 19:27:21.741 - ==================== E X E C U T E - ====================
[2025-06-19T19:27:21.921Z] STF 19:27:21.741 - Running execute: perl C:/jenkins/workspace/Test_openjdk11_hs_sanity.system_x86-64_windows_testList_1/aqa-tests/\TKG\output_17503587497563\PatModImg_Unex_1/20250619-192719-PatModImgTest/execute.pl
[2025-06-19T19:27:21.921Z] STF 19:27:21.879 -
[2025-06-19T19:27:21.921Z] STF 19:27:21.880 - Java version
[2025-06-19T19:27:21.921Z] STF 19:27:21.880 - Running: c:/jenkins/workspace/Test_openjdk11_hs_sanity.system_x86-64_windows_testList_1/jdkbinary/j2sdk-image/bin/java -version
[2025-06-19T19:27:22.246Z] openjdk version "11.0.28-beta" 2025-07-15
[2025-06-19T19:27:22.246Z] OpenJDK Runtime Environment Temurin-11.0.28+5-202506190024 (build 11.0.28-beta+5-ea)
[2025-06-19T19:27:22.246Z] OpenJDK 64-Bit Server VM Temurin-11.0.28+5-202506190024 (build 11.0.28-beta+5-ea, mixed mode)
[2025-06-19T19:27:22.246Z] STF 19:27:22.004 -
[2025-06-19T19:27:22.246Z] STF 19:27:22.004 - +------ Step 1 - Create com.hello jar
[2025-06-19T19:27:22.246Z] STF 19:27:22.004 - | Create modular jar
[2025-06-19T19:27:22.246Z] STF 19:27:22.004 - | ModuleSpec: openjdk.test.modularity/bin/common-mods/com.hello
[2025-06-19T19:27:22.246Z] STF 19:27:22.004 - | ModuleVersion: null
[2025-06-19T19:27:22.246Z] STF 19:27:22.004 - | MainClass: null
[2025-06-19T19:27:22.246Z] STF 19:27:22.004 - | HashModules: null
[2025-06-19T19:27:22.246Z] STF 19:27:22.004 - |
[2025-06-19T19:27:22.246Z] STF 19:27:22.005 - Running command: c:/jenkins/workspace/Test_openjdk11_hs_sanity.system_x86-64_windows_testList_1/jdkbinary/j2sdk-image/bin/jar --create --file C:/jenkins/workspace/Test_openjdk11_hs_sanity.system_x86-64_windows_testList_1/aqa-tests/TKG/output_17503587497563/PatModImg_Unex_1/20250619-192719-PatModImgTest/modules/1.com.hello.jar -C C:\jenkins\workspace\Test_openjdk11_hs_sanity.system_x86-64_windows_testList_1\jvmtest\system\aqa-systemtest\openjdk.test.modularity\bin\common-mods\com.hello .
[2025-06-19T19:27:22.246Z] STF 19:27:22.005 - Redirecting stderr to C:/jenkins/workspace/Test_openjdk11_hs_sanity.system_x86-64_windows_testList_1/aqa-tests/TKG/output_17503587497563/PatModImg_Unex_1/20250619-192719-PatModImgTest/results/1.CMJ.stderr
[2025-06-19T19:27:22.246Z] STF 19:27:22.005 - Redirecting stdout to C:/jenkins/workspace/Test_openjdk11_hs_sanity.system_x86-64_windows_testList_1/aqa-tests/TKG/output_17503587497563/PatModImg_Unex_1/20250619-192719-PatModImgTest/results/1.CMJ.stdout
[2025-06-19T19:27:22.246Z] STF 19:27:22.035 - Monitoring processes: CMJ
[2025-06-19T19:27:22.567Z] STF 19:27:22.329 - Monitoring Report Summary:
[2025-06-19T19:27:22.567Z] STF 19:27:22.329 - o Process CMJ ended with the expected exit code (0)
[2025-06-19T19:27:22.567Z] STF 19:27:22.329 - Created modular jar: 1.com.hello.jar
[2025-06-19T19:27:22.567Z] STF 19:27:22.329 -
[2025-06-19T19:27:22.567Z] STF 19:27:22.329 - +------ Step 2 - Create com.hola jar
[2025-06-19T19:27:22.567Z] STF 19:27:22.329 - | Create modular jar
[2025-06-19T19:27:22.567Z] STF 19:27:22.329 - | ModuleSpec: openjdk.test.modularity/bin/common-mods/com.hola
[2025-06-19T19:27:22.567Z] STF 19:27:22.329 - | ModuleVersion: null
[2025-06-19T19:27:22.568Z] STF 19:27:22.329 - | MainClass: null
[2025-06-19T19:27:22.568Z] STF 19:27:22.329 - | HashModules: null
[2025-06-19T19:27:22.568Z] STF 19:27:22.329 - |
[2025-06-19T19:27:22.568Z] STF 19:27:22.330 - Running command: c:/jenkins/workspace/Test_openjdk11_hs_sanity.system_x86-64_windows_testList_1/jdkbinary/j2sdk-image/bin/jar --create --file C:/jenkins/workspace/Test_openjdk11_hs_sanity.system_x86-64_windows_testList_1/aqa-tests/TKG/output_17503587497563/PatModImg_Unex_1/20250619-192719-PatModImgTest/modules/2.com.hola.jar -C C:\jenkins\workspace\Test_openjdk11_hs_sanity.system_x86-64_windows_testList_1\jvmtest\system\aqa-systemtest\openjdk.test.modularity\bin\common-mods\com.hola .
[2025-06-19T19:27:22.568Z] STF 19:27:22.330 - Redirecting stderr to C:/jenkins/workspace/Test_openjdk11_hs_sanity.system_x86-64_windows_testList_1/aqa-tests/TKG/output_17503587497563/PatModImg_Unex_1/20250619-192719-PatModImgTest/results/2.CMJ.stderr
[2025-06-19T19:27:22.568Z] STF 19:27:22.330 - Redirecting stdout to C:/jenkins/workspace/Test_openjdk11_hs_sanity.system_x86-64_windows_testList_1/aqa-tests/TKG/output_17503587497563/PatModImg_Unex_1/20250619-192719-PatModImgTest/results/2.CMJ.stdout
[2025-06-19T19:27:22.568Z] STF 19:27:22.335 - Monitoring processes: CMJ
[2025-06-19T19:27:22.889Z] STF 19:27:22.654 - Monitoring Report Summary:
[2025-06-19T19:27:22.889Z] STF 19:27:22.654 - o Process CMJ ended with the expected exit code (0)
[2025-06-19T19:27:22.889Z] STF 19:27:22.655 - Created modular jar: 2.com.hola.jar
[2025-06-19T19:27:22.889Z] STF 19:27:22.655 -
[2025-06-19T19:27:22.889Z] STF 19:27:22.655 - +------ Step 3 - Create com.helper jar
[2025-06-19T19:27:22.889Z] STF 19:27:22.655 - | Create modular jar
[2025-06-19T19:27:22.889Z] STF 19:27:22.655 - | ModuleSpec: openjdk.test.modularity/bin/common-mods/com.helper
[2025-06-19T19:27:22.889Z] STF 19:27:22.655 - | ModuleVersion: null
[2025-06-19T19:27:22.889Z] STF 19:27:22.655 - | MainClass: null
[2025-06-19T19:27:22.889Z] STF 19:27:22.655 - | HashModules: null
[2025-06-19T19:27:22.889Z] STF 19:27:22.655 - |
[2025-06-19T19:27:22.889Z] STF 19:27:22.655 - Running command: c:/jenkins/workspace/Test_openjdk11_hs_sanity.system_x86-64_windows_testList_1/jdkbinary/j2sdk-image/bin/jar --create --file C:/jenkins/workspace/Test_openjdk11_hs_sanity.system_x86-64_windows_testList_1/aqa-tests/TKG/output_17503587497563/PatModImg_Unex_1/20250619-192719-PatModImgTest/modules/3.com.helper.jar -C C:\jenkins\workspace\Test_openjdk11_hs_sanity.system_x86-64_windows_testList_1\jvmtest\system\aqa-systemtest\openjdk.test.modularity\bin\common-mods\com.helper .
[2025-06-19T19:27:22.889Z] STF 19:27:22.655 - Redirecting stderr to C:/jenkins/workspace/Test_openjdk11_hs_sanity.system_x86-64_windows_testList_1/aqa-tests/TKG/output_17503587497563/PatModImg_Unex_1/20250619-192719-PatModImgTest/results/3.CMJ.stderr
[2025-06-19T19:27:22.889Z] STF 19:27:22.655 - Redirecting stdout to C:/jenkins/workspace/Test_openjdk11_hs_sanity.system_x86-64_windows_testList_1/aqa-tests/TKG/output_17503587497563/PatModImg_Unex_1/20250619-192719-PatModImgTest/results/3.CMJ.stdout
[2025-06-19T19:27:22.889Z] STF 19:27:22.660 - Monitoring processes: CMJ
[2025-06-19T19:27:23.212Z] STF 19:27:22.961 - Monitoring Report Summary:
[2025-06-19T19:27:23.212Z] STF 19:27:22.962 - o Process CMJ ended with the expected exit code (0)
[2025-06-19T19:27:23.212Z] STF 19:27:22.962 - Created modular jar: 3.com.helper.jar
[2025-06-19T19:27:23.212Z] STF 19:27:22.962 -
[2025-06-19T19:27:23.212Z] STF 19:27:22.962 - +------ Step 4 - Create com.discreet jar
[2025-06-19T19:27:23.212Z] STF 19:27:22.962 - | Create modular jar
[2025-06-19T19:27:23.212Z] STF 19:27:22.962 - | ModuleSpec: openjdk.test.modularity/bin/common-mods/com.discreet
[2025-06-19T19:27:23.212Z] STF 19:27:22.962 - | ModuleVersion: null
[2025-06-19T19:27:23.212Z] STF 19:27:22.962 - | MainClass: null
[2025-06-19T19:27:23.212Z] STF 19:27:22.962 - | HashModules: null
[2025-06-19T19:27:23.212Z] STF 19:27:22.962 - |
[2025-06-19T19:27:23.212Z] STF 19:27:22.962 - Running command: c:/jenkins/workspace/Test_openjdk11_hs_sanity.system_x86-64_windows_testList_1/jdkbinary/j2sdk-image/bin/jar --create --file C:/jenkins/workspace/Test_openjdk11_hs_sanity.system_x86-64_windows_testList_1/aqa-tests/TKG/output_17503587497563/PatModImg_Unex_1/20250619-192719-PatModImgTest/modules/4.com.discreet.jar -C C:\jenkins\workspace\Test_openjdk11_hs_sanity.system_x86-64_windows_testList_1\jvmtest\system\aqa-systemtest\openjdk.test.modularity\bin\common-mods\com.discreet .
[2025-06-19T19:27:23.212Z] STF 19:27:22.962 - Redirecting stderr to C:/jenkins/workspace/Test_openjdk11_hs_sanity.system_x86-64_windows_testList_1/aqa-tests/TKG/output_17503587497563/PatModImg_Unex_1/20250619-192719-PatModImgTest/results/4.CMJ.stderr
[2025-06-19T19:27:23.212Z] STF 19:27:22.962 - Redirecting stdout to C:/jenkins/workspace/Test_openjdk11_hs_sanity.system_x86-64_windows_testList_1/aqa-tests/TKG/output_17503587497563/PatModImg_Unex_1/20250619-192719-PatModImgTest/results/4.CMJ.stdout
[2025-06-19T19:27:23.212Z] STF 19:27:22.967 - Monitoring processes: CMJ
[2025-06-19T19:27:23.538Z] STF 19:27:23.254 - Monitoring Report Summary:
[2025-06-19T19:27:23.538Z] STF 19:27:23.255 - o Process CMJ ended with the expected exit code (0)
[2025-06-19T19:27:23.538Z] STF 19:27:23.255 - Created modular jar: 4.com.discreet.jar
[2025-06-19T19:27:23.538Z] STF 19:27:23.255 -
[2025-06-19T19:27:23.538Z] STF 19:27:23.255 - +------ Step 5 - Create tests jar
[2025-06-19T19:27:23.538Z] STF 19:27:23.255 - | Create modular jar
[2025-06-19T19:27:23.538Z] STF 19:27:23.255 - | ModuleSpec: openjdk.test.modularity/bin/tests/com.test
[2025-06-19T19:27:23.538Z] STF 19:27:23.255 - | ModuleVersion: null
[2025-06-19T19:27:23.538Z] STF 19:27:23.255 - | MainClass: null
[2025-06-19T19:27:23.538Z] STF 19:27:23.255 - | HashModules: null
[2025-06-19T19:27:23.538Z] STF 19:27:23.255 - |
[2025-06-19T19:27:23.538Z] STF 19:27:23.255 - Running command: c:/jenkins/workspace/Test_openjdk11_hs_sanity.system_x86-64_windows_testList_1/jdkbinary/j2sdk-image/bin/jar --create --file C:/jenkins/workspace/Test_openjdk11_hs_sanity.system_x86-64_windows_testList_1/aqa-tests/TKG/output_17503587497563/PatModImg_Unex_1/20250619-192719-PatModImgTest/modules/5.com.test.jar -C C:\jenkins\workspace\Test_openjdk11_hs_sanity.system_x86-64_windows_testList_1\jvmtest\system\aqa-systemtest\openjdk.test.modularity\bin\tests\com.test .
[2025-06-19T19:27:23.538Z] STF 19:27:23.255 - Redirecting stderr to C:/jenkins/workspace/Test_openjdk11_hs_sanity.system_x86-64_windows_testList_1/aqa-tests/TKG/output_17503587497563/PatModImg_Unex_1/20250619-192719-PatModImgTest/results/5.CMJ.stderr
[2025-06-19T19:27:23.538Z] STF 19:27:23.255 - Redirecting stdout to C:/jenkins/workspace/Test_openjdk11_hs_sanity.system_x86-64_windows_testList_1/aqa-tests/TKG/output_17503587497563/PatModImg_Unex_1/20250619-192719-PatModImgTest/results/5.CMJ.stdout
[2025-06-19T19:27:23.538Z] STF 19:27:23.260 - Monitoring processes: CMJ
[2025-06-19T19:27:23.861Z] STF 19:27:23.564 - Monitoring Report Summary:
[2025-06-19T19:27:23.861Z] STF 19:27:23.564 - o Process CMJ ended with the expected exit code (0)
[2025-06-19T19:27:23.861Z] STF 19:27:23.564 - Created modular jar: 5.com.test.jar
[2025-06-19T19:27:23.861Z] STF 19:27:23.564 -
[2025-06-19T19:27:23.861Z] STF 19:27:23.564 - +------ Step 6 - Create runtime image for PatchModule test
[2025-06-19T19:27:23.861Z] STF 19:27:23.564 - | Run jlink to create runtime image
[2025-06-19T19:27:23.861Z] STF 19:27:23.564 - | ImageName: XpJVM
[2025-06-19T19:27:23.861Z] STF 19:27:23.564 - |
[2025-06-19T19:27:23.861Z] STF 19:27:23.564 - Running command: c:/jenkins/workspace/Test_openjdk11_hs_sanity.system_x86-64_windows_testList_1/jdkbinary/j2sdk-image/bin/jlink --module-path c:\jenkins\workspace\Test_openjdk11_hs_sanity.system_x86-64_windows_testList_1\jdkbinary\j2sdk-image\jmods;C:\jenkins\workspace\Test_openjdk11_hs_sanity.system_x86-64_windows_testList_1\aqa-tests\TKG\output_17503587497563\PatModImg_Unex_1\20250619-192719-PatModImgTest\modules --add-modules com.hello,com.hola,com.test,com.helper,com.discreet --output C:\jenkins\workspace\Test_openjdk11_hs_sanity.system_x86-64_windows_testList_1\aqa-tests\TKG\output_17503587497563\PatModImg_Unex_1\20250619-192719-PatModImgTest\tmp\6.XpJVM
[2025-06-19T19:27:23.861Z] STF 19:27:23.564 - Redirecting stderr to C:/jenkins/workspace/Test_openjdk11_hs_sanity.system_x86-64_windows_testList_1/aqa-tests/TKG/output_17503587497563/PatModImg_Unex_1/20250619-192719-PatModImgTest/results/6.JLNK.stderr
[2025-06-19T19:27:23.861Z] STF 19:27:23.564 - Redirecting stdout to C:/jenkins/workspace/Test_openjdk11_hs_sanity.system_x86-64_windows_testList_1/aqa-tests/TKG/output_17503587497563/PatModImg_Unex_1/20250619-192719-PatModImgTest/results/6.JLNK.stdout
[2025-06-19T19:27:23.861Z] STF 19:27:23.570 - Monitoring processes: JLNK
[2025-06-19T19:27:26.715Z] STF 19:27:26.018 - Monitoring Report Summary:
[2025-06-19T19:27:26.715Z] STF 19:27:26.019 - o Process JLNK ended with the expected exit code (0)
[2025-06-19T19:27:26.715Z] STF 19:27:26.019 -
[2025-06-19T19:27:26.715Z] STF 19:27:26.019 - +------ Step 7 - Create com.hello jar
[2025-06-19T19:27:26.715Z] STF 19:27:26.019 - | Create modular jar
[2025-06-19T19:27:26.715Z] STF 19:27:26.019 - | ModuleSpec: openjdk.test.modularity/bin/common-override/com.hello
[2025-06-19T19:27:26.715Z] STF 19:27:26.019 - | ModuleVersion: null
[2025-06-19T19:27:26.716Z] STF 19:27:26.019 - | MainClass: null
[2025-06-19T19:27:26.716Z] STF 19:27:26.019 - | HashModules: null
[2025-06-19T19:27:26.716Z] STF 19:27:26.019 - |
[2025-06-19T19:27:26.716Z] STF 19:27:26.019 - Running command: c:/jenkins/workspace/Test_openjdk11_hs_sanity.system_x86-64_windows_testList_1/jdkbinary/j2sdk-image/bin/jar --create --file C:/jenkins/workspace/Test_openjdk11_hs_sanity.system_x86-64_windows_testList_1/aqa-tests/TKG/output_17503587497563/PatModImg_Unex_1/20250619-192719-PatModImgTest/modules/7.com.hello.jar -C C:\jenkins\workspace\Test_openjdk11_hs_sanity.system_x86-64_windows_testList_1\jvmtest\system\aqa-systemtest\openjdk.test.modularity\bin\common-override\com.hello .
[2025-06-19T19:27:26.716Z] STF 19:27:26.019 - Redirecting stderr to C:/jenkins/workspace/Test_openjdk11_hs_sanity.system_x86-64_windows_testList_1/aqa-tests/TKG/output_17503587497563/PatModImg_Unex_1/20250619-192719-PatModImgTest/results/7.CMJ.stderr
[2025-06-19T19:27:26.716Z] STF 19:27:26.019 - Redirecting stdout to C:/jenkins/workspace/Test_openjdk11_hs_sanity.system_x86-64_windows_testList_1/aqa-tests/TKG/output_17503587497563/PatModImg_Unex_1/20250619-192719-PatModImgTest/results/7.CMJ.stdout
[2025-06-19T19:27:26.716Z] STF 19:27:26.026 - Monitoring processes: CMJ
[2025-06-19T19:27:26.716Z] STF 19:27:26.333 - Monitoring Report Summary:
[2025-06-19T19:27:26.716Z] STF 19:27:26.333 - o Process CMJ ended with the expected exit code (0)
[2025-06-19T19:27:26.716Z] STF 19:27:26.333 - Created modular jar: 7.com.hello.jar
[2025-06-19T19:27:26.716Z] STF 19:27:26.333 -
[2025-06-19T19:27:26.716Z] STF 19:27:26.333 - +------ Step 8 - create java.xml.jar
[2025-06-19T19:27:26.716Z] STF 19:27:26.333 - | Create modular jar
[2025-06-19T19:27:26.716Z] STF 19:27:26.333 - | ModuleSpec: openjdk.test.modularity/bin/common-override/java.xml
[2025-06-19T19:27:26.716Z] STF 19:27:26.333 - | ModuleVersion: null
[2025-06-19T19:27:26.716Z] STF 19:27:26.333 - | MainClass: null
[2025-06-19T19:27:26.716Z] STF 19:27:26.333 - | HashModules: null
[2025-06-19T19:27:26.716Z] STF 19:27:26.333 - |
[2025-06-19T19:27:26.716Z] STF 19:27:26.334 - Running command: c:/jenkins/workspace/Test_openjdk11_hs_sanity.system_x86-64_windows_testList_1/jdkbinary/j2sdk-image/bin/jar --create --file C:/jenkins/workspace/Test_openjdk11_hs_sanity.system_x86-64_windows_testList_1/aqa-tests/TKG/output_17503587497563/PatModImg_Unex_1/20250619-192719-PatModImgTest/modules/8.java.xml.jar -C C:\jenkins\workspace\Test_openjdk11_hs_sanity.system_x86-64_windows_testList_1\jvmtest\system\aqa-systemtest\openjdk.test.modularity\bin\common-override\java.xml .
[2025-06-19T19:27:26.716Z] STF 19:27:26.334 - Redirecting stderr to C:/jenkins/workspace/Test_openjdk11_hs_sanity.system_x86-64_windows_testList_1/aqa-tests/TKG/output_17503587497563/PatModImg_Unex_1/20250619-192719-PatModImgTest/results/8.CMJ.stderr
[2025-06-19T19:27:26.716Z] STF 19:27:26.334 - Redirecting stdout to C:/jenkins/workspace/Test_openjdk11_hs_sanity.system_x86-64_windows_testList_1/aqa-tests/TKG/output_17503587497563/PatModImg_Unex_1/20250619-192719-PatModImgTest/results/8.CMJ.stdout
[2025-06-19T19:27:26.716Z] STF 19:27:26.340 - Monitoring processes: CMJ
[2025-06-19T19:27:26.716Z] STF 19:27:26.651 - Monitoring Report Summary:
[2025-06-19T19:27:26.716Z] STF 19:27:26.651 - o Process CMJ ended with the expected exit code (0)
[2025-06-19T19:27:26.716Z] STF 19:27:26.651 - Created modular jar: 8.java.xml.jar
[2025-06-19T19:27:26.716Z] STF 19:27:26.651 -
[2025-06-19T19:27:26.716Z] STF 19:27:26.651 - +------ Step 9 - (Negative test) Include a new package that is not exported and check if the public type cannot be accessed
[2025-06-19T19:27:26.716Z] STF 19:27:26.651 - | Run foreground process
[2025-06-19T19:27:26.716Z] STF 19:27:26.651 - | Program: C:/jenkins/workspace/Test_openjdk11_hs_sanity.system_x86-64_windows_testList_1/aqa-tests/TKG/output_17503587497563/PatModImg_Unex_1/20250619-192719-PatModImgTest/tmp/6.XpJVM/bin/java
[2025-06-19T19:27:26.716Z] STF 19:27:26.651 - | Mnemonic: OT3
[2025-06-19T19:27:26.716Z] STF 19:27:26.651 - | Echo: ECHO_ON
[2025-06-19T19:27:26.716Z] STF 19:27:26.651 - | Expectation: NON_ZERO_EXIT [1] within 5m
[2025-06-19T19:27:26.716Z] STF 19:27:26.651 - |
[2025-06-19T19:27:26.716Z] STF 19:27:26.651 - Running command: C:/jenkins/workspace/Test_openjdk11_hs_sanity.system_x86-64_windows_testList_1/aqa-tests/TKG/output_17503587497563/PatModImg_Unex_1/20250619-192719-PatModImgTest/tmp/6.XpJVM/bin/java --add-reads com.test=ALL-UNNAMED --patch-module com.hello=C:/jenkins/workspace/Test_openjdk11_hs_sanity.system_x86-64_windows_testList_1/aqa-tests/TKG/output_17503587497563/PatModImg_Unex_1/20250619-192719-PatModImgTest/modules/7.com.hello.jar -XX:-UseCompressedOops -classpath c:/jenkins/testDependency/system_lib/junit/junit.jar;c:/jenkins/testDependency/system_lib/junit/hamcrest-core.jar org.junit.runner.JUnitCore net.adoptopenjdk.test.modularity.junit.TestOverrideUsingAppModuleAndNewPackage
[2025-06-19T19:27:26.716Z] STF 19:27:26.651 - Redirecting stderr to C:/jenkins/workspace/Test_openjdk11_hs_sanity.system_x86-64_windows_testList_1/aqa-tests/TKG/output_17503587497563/PatModImg_Unex_1/20250619-192719-PatModImgTest/results/9.OT3.stderr
[2025-06-19T19:27:26.716Z] STF 19:27:26.651 - Redirecting stdout to C:/jenkins/workspace/Test_openjdk11_hs_sanity.system_x86-64_windows_testList_1/aqa-tests/TKG/output_17503587497563/PatModImg_Unex_1/20250619-192719-PatModImgTest/results/9.OT3.stdout
[2025-06-19T19:27:27.039Z] STF 19:27:26.675 - Monitoring processes: OT3
[2025-06-19T19:27:27.039Z] OT3 stderr WARNING: module-info.class ignored in patch: C:\jenkins\workspace\Test_openjdk11_hs_sanity.system_x86-64_windows_testList_1\aqa-tests\TKG\output_17503587497563\PatModImg_Unex_1\20250619-192719-PatModImgTest\modules\7.com.hello.jar
[2025-06-19T19:27:27.039Z] OT3 JUnit version 4.12
[2025-06-19T19:27:27.039Z] OT3 .E
[2025-06-19T19:27:27.361Z] OT3 Time: 0.008
[2025-06-19T19:27:27.361Z] OT3 There was 1 failure:
[2025-06-19T19:27:27.361Z] OT3 1) testOverrideUsingAppModuleAndNewPackage(net.adoptopenjdk.test.modularity.junit.TestOverrideUsingAppModuleAndNewPackage)
[2025-06-19T19:27:27.361Z] OT3 java.lang.IllegalAccessException: class net.adoptopenjdk.test.modularity.junit.TestOverrideUsingAppModuleAndNewPackage (in module com.test) cannot access class adoptopenjdk.test.modularity.hellonew.HelloNew (in module com.hello) because module com.hello does not export adoptopenjdk.test.modularity.hellonew to module com.test
[2025-06-19T19:27:27.361Z] OT3 at java.base/jdk.internal.reflect.Reflection.newIllegalAccessException(Reflection.java:361)
[2025-06-19T19:27:27.361Z] OT3 at java.base/java.lang.reflect.AccessibleObject.checkAccess(AccessibleObject.java:591)
[2025-06-19T19:27:27.361Z] OT3 at java.base/java.lang.reflect.Constructor.newInstance(Constructor.java:481)
[2025-06-19T19:27:27.361Z] OT3 at com.test/net.adoptopenjdk.test.modularity.junit.TestOverrideUsingAppModuleAndNewPackage.testOverrideUsingAppModuleAndNewPackage(TestOverrideUsingAppModuleAndNewPackage.java:31)
[2025-06-19T19:27:27.361Z] OT3 at java.base/jdk.internal.reflect.NativeMethodAccessorImpl.invoke0(Native Method)
[2025-06-19T19:27:27.361Z] OT3 at java.base/jdk.internal.reflect.NativeMethodAccessorImpl.invoke(NativeMethodAccessorImpl.java:62)
[2025-06-19T19:27:27.361Z] OT3 at java.base/jdk.internal.reflect.DelegatingMethodAccessorImpl.invoke(DelegatingMethodAccessorImpl.java:43)
[2025-06-19T19:27:27.361Z] OT3 at java.base/java.lang.reflect.Method.invoke(Method.java:566)
[2025-06-19T19:27:27.361Z] OT3 at org.junit.runners.model.FrameworkMethod$1.runReflectiveCall(FrameworkMethod.java:50)
[2025-06-19T19:27:27.361Z] OT3 at org.junit.internal.runners.model.ReflectiveCallable.run(ReflectiveCallable.java:12)
[2025-06-19T19:27:27.361Z] OT3 at org.junit.runners.model.FrameworkMethod.invokeExplosively(FrameworkMethod.java:47)
[2025-06-19T19:27:27.361Z] OT3 at org.junit.internal.runners.statements.InvokeMethod.evaluate(InvokeMethod.java:17)
[2025-06-19T19:27:27.361Z] OT3 at org.junit.runners.ParentRunner.runLeaf(ParentRunner.java:325)
[2025-06-19T19:27:27.361Z] OT3 at org.junit.runners.BlockJUnit4ClassRunner.runChild(BlockJUnit4ClassRunner.java:78)
[2025-06-19T19:27:27.361Z] OT3 at org.junit.runners.BlockJUnit4ClassRunner.runChild(BlockJUnit4ClassRunner.java:57)
[2025-06-19T19:27:27.361Z] OT3 at org.junit.runners.ParentRunner$3.run(ParentRunner.java:290)
[2025-06-19T19:27:27.361Z] OT3 at org.junit.runners.ParentRunner$1.schedule(ParentRunner.java:71)
[2025-06-19T19:27:27.361Z] OT3 at org.junit.runners.ParentRunner.runChildren(ParentRunner.java:288)
[2025-06-19T19:27:27.361Z] OT3 at org.junit.runners.ParentRunner.access$000(ParentRunner.java:58)
[2025-06-19T19:27:27.361Z] OT3 at org.junit.runners.ParentRunner$2.evaluate(ParentRunner.java:268)
[2025-06-19T19:27:27.361Z] OT3 at org.junit.runners.ParentRunner.run(ParentRunner.java:363)
[2025-06-19T19:27:27.361Z] OT3 at org.junit.runners.Suite.runChild(Suite.java:128)
[2025-06-19T19:27:27.361Z] OT3 at org.junit.runners.Suite.runChild(Suite.java:27)
[2025-06-19T19:27:27.361Z] OT3 at org.junit.runners.ParentRunner$3.run(ParentRunner.java:290)
[2025-06-19T19:27:27.361Z] OT3 at org.junit.runners.ParentRunner$1.schedule(ParentRunner.java:71)
[2025-06-19T19:27:27.361Z] OT3 at org.junit.runners.ParentRunner.runChildren(ParentRunner.java:288)
[2025-06-19T19:27:27.361Z] OT3 at org.junit.runners.ParentRunner.access$000(ParentRunner.java:58)
[2025-06-19T19:27:27.361Z] OT3 at org.junit.runners.ParentRunner$2.evaluate(ParentRunner.java:268)
[2025-06-19T19:27:27.361Z] OT3 at org.junit.runners.ParentRunner.run(ParentRunner.java:363)
[2025-06-19T19:27:27.361Z] OT3 at org.junit.runner.JUnitCore.run(JUnitCore.java:137)
[2025-06-19T19:27:27.361Z] OT3 at org.junit.runner.JUnitCore.run(JUnitCore.java:115)
[2025-06-19T19:27:27.361Z] OT3 at org.junit.runner.JUnitCore.runMain(JUnitCore.java:77)
[2025-06-19T19:27:27.361Z] OT3 at org.junit.runner.JUnitCore.main(JUnitCore.java:36)
[2025-06-19T19:27:27.361Z] OT3
[2025-06-19T19:27:27.361Z] OT3 FAILURES!!!
[2025-06-19T19:27:27.361Z] OT3 Tests run: 1, Failures: 1
[2025-06-19T19:27:27.361Z] OT3
[2025-06-19T19:27:27.361Z] STF 19:27:26.983 - Monitoring Report Summary:
[2025-06-19T19:27:27.361Z] STF 19:27:26.983 - o Process OT3 ended with the expected exit code (1)
[2025-06-19T19:27:27.361Z] STF 19:27:26.983 -
[2025-06-19T19:27:27.361Z] STF 19:27:26.983 - +------ Step 10 - Check output
[2025-06-19T19:27:27.361Z] STF 19:27:26.983 - | Count file matches
[2025-06-19T19:27:27.361Z] STF 19:27:26.983 - | TargetFile: C:/jenkins/workspace/Test_openjdk11_hs_sanity.system_x86-64_windows_testList_1/aqa-tests/TKG/output_17503587497563/PatModImg_Unex_1/20250619-192719-PatModImgTest/results/9.OT3.stdout
[2025-06-19T19:27:27.361Z] STF 19:27:26.983 - | ExpectedNumMatches: 1
[2025-06-19T19:27:27.361Z] STF 19:27:26.983 - | SearchStrings: ["java.lang.IllegalAccessException"]
[2025-06-19T19:27:27.361Z] STF 19:27:26.983 - |
[2025-06-19T19:27:27.361Z] STF 19:27:26.983 - Found 1 instances of ["java.lang.IllegalAccessException"]
[2025-06-19T19:27:27.361Z] STF 19:27:26.983 -
[2025-06-19T19:27:27.361Z] STF 19:27:26.983 - +------ Step 11 - Include a new package that is not exported and check if the public type can be accessed by adding --add-exports
[2025-06-19T19:27:27.361Z] STF 19:27:26.983 - | Run foreground process
[2025-06-19T19:27:27.361Z] STF 19:27:26.983 - | Program: C:/jenkins/workspace/Test_openjdk11_hs_sanity.system_x86-64_windows_testList_1/aqa-tests/TKG/output_17503587497563/PatModImg_Unex_1/20250619-192719-PatModImgTest/tmp/6.XpJVM/bin/java
[2025-06-19T19:27:27.361Z] STF 19:27:26.983 - | Mnemonic: OT4
[2025-06-19T19:27:27.361Z] STF 19:27:26.983 - | Echo: ECHO_ON
[2025-06-19T19:27:27.361Z] STF 19:27:26.983 - | Expectation: CLEAN_RUN within 5m
[2025-06-19T19:27:27.361Z] STF 19:27:26.983 - |
[2025-06-19T19:27:27.361Z] STF 19:27:26.984 - Running command: C:/jenkins/workspace/Test_openjdk11_hs_sanity.system_x86-64_windows_testList_1/aqa-tests/TKG/output_17503587497563/PatModImg_Unex_1/20250619-192719-PatModImgTest/tmp/6.XpJVM/bin/java --add-reads com.test=ALL-UNNAMED --add-exports com.hello/adoptopenjdk.test.modularity.hellonew=com.test --patch-module com.hello=C:/jenkins/workspace/Test_openjdk11_hs_sanity.system_x86-64_windows_testList_1/aqa-tests/TKG/output_17503587497563/PatModImg_Unex_1/20250619-192719-PatModImgTest/modules/7.com.hello.jar -XX:-UseCompressedOops -classpath c:/jenkins/testDependency/system_lib/junit/junit.jar;c:/jenkins/testDependency/system_lib/junit/hamcrest-core.jar org.junit.runner.JUnitCore net.adoptopenjdk.test.modularity.junit.TestOverrideUsingAppModuleAndNewPackage
[2025-06-19T19:27:27.361Z] STF 19:27:26.984 - Redirecting stderr to C:/jenkins/workspace/Test_openjdk11_hs_sanity.system_x86-64_windows_testList_1/aqa-tests/TKG/output_17503587497563/PatModImg_Unex_1/20250619-192719-PatModImgTest/results/11.OT4.stderr
[2025-06-19T19:27:27.361Z] STF 19:27:26.984 - Redirecting stdout to C:/jenkins/workspace/Test_openjdk11_hs_sanity.system_x86-64_windows_testList_1/aqa-tests/TKG/output_17503587497563/PatModImg_Unex_1/20250619-192719-PatModImgTest/results/11.OT4.stdout
[2025-06-19T19:27:27.361Z] STF 19:27:26.990 - Monitoring processes: OT4
[2025-06-19T19:27:27.361Z] OT4 stderr WARNING: module-info.class ignored in patch: C:\jenkins\workspace\Test_openjdk11_hs_sanity.system_x86-64_windows_testList_1\aqa-tests\TKG\output_17503587497563\PatModImg_Unex_1\20250619-192719-PatModImgTest\modules\7.com.hello.jar
[2025-06-19T19:27:27.361Z] OT4 JUnit version 4.12
[2025-06-19T19:27:27.361Z] OT4 .
[2025-06-19T19:27:27.730Z] OT4 Time: 0.007
[2025-06-19T19:27:27.730Z] OT4
[2025-06-19T19:27:27.730Z] OT4 OK (1 test)
[2025-06-19T19:27:27.730Z] OT4
[2025-06-19T19:27:27.730Z] STF 19:27:27.301 - Monitoring Report Summary:
[2025-06-19T19:27:27.730Z] STF 19:27:27.301 - o Process OT4 ended with the expected exit code (0)
[2025-06-19T19:27:27.730Z] STF 19:27:27.302 - EXECUTE stage completed
[2025-06-19T19:27:27.730Z] STF 19:27:27.359 -
[2025-06-19T19:27:27.730Z] STF 19:27:27.359 - ==================== T E A R D O W N ====================
[2025-06-19T19:27:27.730Z] STF 19:27:27.359 - Running teardown: perl C:/jenkins/workspace/Test_openjdk11_hs_sanity.system_x86-64_windows_testList_1/aqa-tests/\TKG\output_17503587497563\PatModImg_Unex_1/20250619-192719-PatModImgTest/tearDown.pl
[2025-06-19T19:27:27.731Z] STF 19:27:27.502 - TEARDOWN stage completed
[2025-06-19T19:27:27.731Z] STF 19:27:27.517 -
[2025-06-19T19:27:27.731Z] STF 19:27:27.517 - ===================== R E S U L T S =====================
[2025-06-19T19:27:27.731Z] STF 19:27:27.517 - Stage results:
[2025-06-19T19:27:27.731Z] STF 19:27:27.517 - setUp: pass
[2025-06-19T19:27:27.731Z] STF 19:27:27.517 - execute: pass
[2025-06-19T19:27:27.731Z] STF 19:27:27.517 - teardown: pass
[2025-06-19T19:27:27.731Z] STF 19:27:27.517 -
[2025-06-19T19:27:27.731Z] STF 19:27:27.517 - Overall result: PASSED
[2025-06-19T19:27:27.731Z] -----------------------------------
[2025-06-19T19:27:27.731Z] PatModImg_Unex_1_PASSED
[2025-06-19T19:27:27.731Z] -----------------------------------
[2025-06-19T19:27:28.059Z]
[2025-06-19T19:27:28.059Z] TEST TEARDOWN:
[2025-06-19T19:27:28.059Z] Nothing to be done for teardown.
[2025-06-19T19:27:28.059Z] PatModImg_Unex_1 Finish Time: Thu Jun 19 19:27:27 2025 Epoch Time (ms): 1750361247866