Post Test
[2025-06-19T10:41:06.654Z] make[3]: Leaving directory '/home/jenkins/workspace/Test_openjdk11_hs_sanity.openjdk_x86-64_linux_rerun/aqa-tests/openjdk'
[2025-06-19T10:41:06.654Z] make[2]: Leaving directory '/home/jenkins/workspace/Test_openjdk11_hs_sanity.openjdk_x86-64_linux_rerun/aqa-tests'
[2025-06-19T10:41:06.654Z]
[2025-06-19T10:41:06.654Z]
[2025-06-19T10:41:06.654Z] All tests finished, run result summary:
[2025-06-19T10:41:06.654Z] cd "/home/jenkins/workspace/Test_openjdk11_hs_sanity.openjdk_x86-64_linux_rerun/aqa-tests/TKG/../TKG/scripts"; \
[2025-06-19T10:41:06.654Z] perl "resultsSum.pl" --failuremk="/home/jenkins/workspace/Test_openjdk11_hs_sanity.openjdk_x86-64_linux_rerun/aqa-tests/TKG/../TKG/failedtargets.mk" --resultFile="/home/jenkins/workspace/Test_openjdk11_hs_sanity.openjdk_x86-64_linux_rerun/aqa-tests/TKG/../TKG/output_17503296633001/TestTargetResult" --platFile="/home/jenkins/workspace/Test_openjdk11_hs_sanity.openjdk_x86-64_linux_rerun/aqa-tests/TKG/../TKG/resources/buildPlatformMap.properties" --diagnostic=failure --jdkVersion=11 --jdkImpl=hotspot --jdkVendor="eclipse" --spec=linux_x86-64 --buildList=openjdk --customTarget="tools/pack200/Pack200Props.java " --testTarget=hotspot_custom --tapPath=/home/jenkins/workspace/Test_openjdk11_hs_sanity.openjdk_x86-64_linux_rerun/aqa-tests/TKG/../TKG/output_17503296633001/ --tapName=Test_openjdk11_hs_sanity.openjdk_x86-64_linux_rerun.tap --comment=""
[2025-06-19T10:41:06.654Z]
[2025-06-19T10:41:06.654Z]
[2025-06-19T10:41:06.654Z] TEST TARGETS SUMMARY
[2025-06-19T10:41:06.654Z] ++++++++++++++++++++++++++++++++++++++++++++++++++++++++++++++++++++++++++
[2025-06-19T10:41:06.654Z] FAILED test targets:
[2025-06-19T10:41:06.654Z] hotspot_custom_0
[2025-06-19T10:41:06.654Z]
[2025-06-19T10:41:06.654Z] TOTAL: 1 EXECUTED: 1 PASSED: 0 FAILED: 1 DISABLED: 0 SKIPPED: 0
[2025-06-19T10:41:06.654Z] ++++++++++++++++++++++++++++++++++++++++++++++++++++++++++++++++++++++++++
[2025-06-19T10:41:06.654Z]
[2025-06-19T10:41:06.654Z] make[1]: *** [settings.mk:454: resultsSummary] Error 2
[2025-06-19T10:41:06.654Z] make[1]: Leaving directory '/home/jenkins/workspace/Test_openjdk11_hs_sanity.openjdk_x86-64_linux_rerun/aqa-tests/TKG'
[2025-06-19T10:41:06.654Z] make: *** [makefile:62: _hotspot_custom] Error 2
[Pipeline] sh
[2025-06-19T10:41:08.638Z] ++ uname
[2025-06-19T10:41:08.638Z] + '[' Linux = AIX ']'
[2025-06-19T10:41:08.638Z] ++ uname
[2025-06-19T10:41:08.638Z] + '[' Linux = SunOS ']'
[2025-06-19T10:41:08.638Z] ++ uname
[2025-06-19T10:41:08.638Z] + '[' Linux = '*BSD' ']'
[2025-06-19T10:41:08.638Z] + MAKE=make
[2025-06-19T10:41:08.638Z] + make -f ./aqa-tests/TKG/testEnv.mk testEnvTeardown
[2025-06-19T10:41:08.638Z] make: Nothing to be done for 'testEnvTeardown'.
[Pipeline] }
[2025-06-19T10:41:09.031Z] Xvfb stopping
[Pipeline] // wrap
[Pipeline] echo
[2025-06-19T10:41:09.503Z] There were test failures, set build result to UNSTABLE.
[Pipeline] }
[Pipeline] // stage
[Pipeline] stage
[Pipeline] { (Post)
[Pipeline] step
[2025-06-19T10:41:09.723Z] TAP Reports Processing: START
[2025-06-19T10:41:09.724Z] Looking for TAP results report in workspace using pattern: aqa-tests/TKG/**/*.tap
[2025-06-19T10:41:09.869Z] Saving reports...
[2025-06-19T10:41:10.004Z] Processing '/home/jenkins/.jenkins/jobs/Test_openjdk11_hs_sanity.openjdk_x86-64_linux_rerun/builds/17/tap-master-files/aqa-tests/TKG/output_17503296633001/Test_openjdk11_hs_sanity.openjdk_x86-64_linux_rerun.tap'
[2025-06-19T10:41:10.004Z] Parsing TAP test result [/home/jenkins/.jenkins/jobs/Test_openjdk11_hs_sanity.openjdk_x86-64_linux_rerun/builds/17/tap-master-files/aqa-tests/TKG/output_17503296633001/Test_openjdk11_hs_sanity.openjdk_x86-64_linux_rerun.tap].
[2025-06-19T10:41:10.006Z] There are failed test cases. Marking build as UNSTABLE
[2025-06-19T10:41:10.006Z] TAP Reports Processing: FINISH
[Pipeline] echo
[2025-06-19T10:41:10.014Z] Saving aqa-tests/testenv/testenv.properties file on jenkins.
[Pipeline] archiveArtifacts
[2025-06-19T10:41:10.154Z] Archiving artifacts
[2025-06-19T10:41:10.426Z] Recording fingerprints
[Pipeline] echo
[2025-06-19T10:41:10.570Z] Saving aqa-tests/TKG/**/*.tap file on jenkins.
[Pipeline] archiveArtifacts
[2025-06-19T10:41:10.708Z] Archiving artifacts
[2025-06-19T10:41:10.979Z] Recording fingerprints
[Pipeline] sh
[2025-06-19T10:41:12.580Z] + pigz -9
[2025-06-19T10:41:12.580Z] + tar -cf - ./aqa-tests/TKG/output_17503296633001
[2025-06-19T10:41:12.580Z] + gzip -9
[Pipeline] echo
[2025-06-19T10:41:12.971Z] ARTIFACTORY_SERVER is not set. Saving artifacts on jenkins.
[Pipeline] archiveArtifacts
[2025-06-19T10:41:13.111Z] Archiving artifacts
[2025-06-19T10:41:13.372Z] Recording fingerprints
[Pipeline] findFiles
[Pipeline] echo
[2025-06-19T10:41:22.174Z] Tap file found: aqa-tests/TKG/output_17503296633001/Test_openjdk11_hs_sanity.openjdk_x86-64_linux_rerun.tap...
[Pipeline] readFile
[Pipeline] echo
[2025-06-19T10:41:22.348Z] Rerun in Grinder with failed test targets: https://ci.adoptium.net/job/Grinder/parambuild/?SDK_RESOURCE=upstream&TARGET=testList+TESTLIST=hotspot_custom_0&BASE_DOCKER_REGISTRY_CREDENTIAL_ID=&TEST_FLAG=&UPSTREAM_TEST_JOB_NAME=&DOCKER_REQUIRED=false&ACTIVE_NODE_TIMEOUT=5&VENDOR_TEST_DIRS=&EXTRA_DOCKER_ARGS=&TKG_OWNER_BRANCH=adoptium%3Amaster&OPENJ9_SYSTEMTEST_OWNER_BRANCH=eclipse%3Amaster&PLATFORM=x86-64_linux&GENERATE_JOBS=true&KEEP_REPORTDIR=true&PERSONAL_BUILD=false&DOCKER_REGISTRY_DIR=&RERUN_ITERATIONS=0&ADOPTOPENJDK_REPO=https%3A%2F%2Fgithub.com%2Fadoptium%2Faqa-tests.git&SETUP_JCK_RUN=false&DOCKER_REGISTRY_URL_CREDENTIAL_ID=&LABEL=&EXTRA_OPTIONS=&CUSTOMIZED_SDK_URL=&BUILD_IDENTIFIER=&JENKINS_KEY=&ADOPTOPENJDK_BRANCH=master&LIGHT_WEIGHT_CHECKOUT=false&USE_JRE=false&ARTIFACTORY_SERVER=&KEEP_WORKSPACE=false&USER_CREDENTIALS_ID=&JDK_VERSION=11&DOCKER_REGISTRY_URL=&ITERATIONS=1&VENDOR_TEST_REPOS=&JDK_REPO=https%3A%2F%2Fgithub.com%2Fadoptium%2Fjdk11u&JCK_GIT_BRANCH=master&OPENJ9_BRANCH=master&OPENJ9_SHA=&JCK_GIT_REPO=&VENDOR_TEST_BRANCHES=&UPSTREAM_JOB_NAME=build-scripts%2Fjobs%2Fjdk11u%2Fjdk11u-linux-x64-temurin&OPENJ9_REPO=https%3A%2F%2Fgithub.com%2Feclipse-openj9%2Fopenj9.git&CLOUD_PROVIDER=&CUSTOM_TARGET=tools%2Fpack200%2FPack200Props.java+&VENDOR_TEST_SHAS=&JDK_BRANCH=jdk-11.0.28%2B5_adopt&LABEL_ADDITION=&ARTIFACTORY_REPO=&ARTIFACTORY_ROOT_DIR=&UPSTREAM_TEST_JOB_NUMBER=&DOCKERIMAGE_TAG=&TEST_TIME=&JDK_IMPL=hotspot&SSH_AGENT_CREDENTIAL=&AUTO_DETECT=true&SLACK_CHANNEL=aqavit-bot&DYNAMIC_COMPILE=false&RELATED_NODES=&ADOPTOPENJDK_SYSTEMTEST_OWNER_BRANCH=adoptium%3Amaster&APPLICATION_OPTIONS=&CUSTOMIZED_SDK_URL_CREDENTIAL_ID=eclipse_temurin_bot_email_and_token&ARCHIVE_TEST_RESULTS=false&NUM_MACHINES=&OPENJDK_SHA=&TRSS_URL=&RERUN_FAILURE=false&USE_TESTENV_PROPERTIES=false&BUILD_LIST=openjdk&ADDITIONAL_ARTIFACTS_REQUIRED=&UPSTREAM_JOB_NUMBER=439&STF_OWNER_BRANCH=adoptium%3Amaster&TIME_LIMIT=25&JVM_OPTIONS=&PARALLEL=None
[Pipeline] junit
[2025-06-19T10:41:22.489Z] Recording test results
[2025-06-19T10:41:32.285Z] None of the test reports contained any result
[2025-06-19T10:41:32.285Z] [Checks API] No suitable checks publisher found.
[Pipeline] }
[Pipeline] // stage
[Pipeline] echo
[2025-06-19T10:41:32.325Z] PROCESSCATCH: Terminating any hung/left over test processes:
[Pipeline] sh
[2025-06-19T10:41:32.178Z] No test report files were found. Configuration error?
[2025-06-19T10:41:33.921Z] + aqa-tests/terminateTestProcesses.sh jenkins
[2025-06-19T10:41:33.921Z] Unix type machine..
[2025-06-19T10:41:33.921Z] egrep: warning: egrep is obsolescent; using grep -E
[2025-06-19T10:41:33.921Z] grep: warning: stray \ before /
[2025-06-19T10:41:33.921Z] grep: warning: stray \ before /
[2025-06-19T10:41:33.921Z] Running on a Linux host
[2025-06-19T10:41:33.921Z] egrep: warning: egrep is obsolescent; using grep -E
[2025-06-19T10:41:33.921Z] egrep: warning: egrep is obsolescent; using grep -E
[2025-06-19T10:41:33.921Z] egrep: warning: egrep is obsolescent; using grep -E
[2025-06-19T10:41:33.921Z] grep: warning: stray \ before /
[2025-06-19T10:41:33.921Z] Woohoo - no rogue processes detected!
[Pipeline] cleanWs
[2025-06-19T10:41:34.584Z] [WS-CLEANUP] Deleting project workspace...
[2025-06-19T10:41:34.585Z] [WS-CLEANUP] Deferred wipeout is disabled by the job configuration...
[2025-06-19T10:42:12.789Z] [WS-CLEANUP] done
[Pipeline] sh
[2025-06-19T10:42:14.364Z] + find /tmp -name '*core*' -print -exec rm -f '{}' ';'
[Pipeline] }
[Pipeline] // timeout
[Pipeline] timeout
[2025-06-19T10:42:14.791Z] Timeout set to expire in 5 min 0 sec
[Pipeline] {
[Pipeline] }
[Pipeline] // timeout
[Pipeline] }
[Pipeline] // node
[Pipeline] }
[Pipeline] // stage
[Pipeline] echo
[2025-06-19T10:42:14.922Z] SETUP_LABEL: ci.role.test
[Pipeline] }
[Pipeline] // timestamps
[Pipeline] End of Pipeline
Finished: UNSTABLE