Post Test
[2025-06-19T11:15:55.844Z] make[4]: Leaving directory '/home/jenkins/workspace/Test_openjdk11_hs_extended.openjdk_s390x_linux_testList_5/aqa-tests/openjdk'
[2025-06-19T11:15:55.844Z] make[3]: Leaving directory '/home/jenkins/workspace/Test_openjdk11_hs_extended.openjdk_s390x_linux_testList_5/aqa-tests'
[2025-06-19T11:15:55.844Z]
[2025-06-19T11:15:55.844Z]
[2025-06-19T11:15:55.844Z] All tests finished, run result summary:
[2025-06-19T11:15:55.844Z] cd "/home/jenkins/workspace/Test_openjdk11_hs_extended.openjdk_s390x_linux_testList_5/aqa-tests/TKG/../TKG/scripts"; \
[2025-06-19T11:15:55.844Z] perl "resultsSum.pl" --failuremk="/home/jenkins/workspace/Test_openjdk11_hs_extended.openjdk_s390x_linux_testList_5/aqa-tests/TKG/../TKG/failedtargets.mk" --resultFile="/home/jenkins/workspace/Test_openjdk11_hs_extended.openjdk_s390x_linux_testList_5/aqa-tests/TKG/../TKG/output_17503202413718/TestTargetResult" --platFile="/home/jenkins/workspace/Test_openjdk11_hs_extended.openjdk_s390x_linux_testList_5/aqa-tests/TKG/../TKG/resources/buildPlatformMap.properties" --diagnostic=failure --jdkVersion=11 --jdkImpl=hotspot --jdkVendor="eclipse" --spec=linux_390-64 --buildList=openjdk --customTarget="" --testTarget=testList --tapPath=/home/jenkins/workspace/Test_openjdk11_hs_extended.openjdk_s390x_linux_testList_5/aqa-tests/TKG/../TKG/output_17503202413718/ --tapName=Test_openjdk11_hs_extended.openjdk_s390x_linux_testList_5.tap --comment=""
[2025-06-19T11:15:55.844Z]
[2025-06-19T11:15:55.844Z]
[2025-06-19T11:15:55.844Z] TEST TARGETS SUMMARY
[2025-06-19T11:15:55.844Z] ++++++++++++++++++++++++++++++++++++++++++++++++++++++++++++++++++++++++++
[2025-06-19T11:15:55.844Z] PASSED test targets:
[2025-06-19T11:15:55.844Z] jdk_other_0 - Test results: passed: 264
[2025-06-19T11:15:55.844Z] jdk_nio_1 - Test results: passed: 392
[2025-06-19T11:15:55.844Z] jdk_jmx_0 - Test results: passed: 250
[2025-06-19T11:15:55.844Z] jdk_build_0 - Test results: passed: 2
[2025-06-19T11:15:55.844Z]
[2025-06-19T11:15:55.844Z] FAILED test targets:
[2025-06-19T11:15:55.844Z] jdk_net_0 - Test results: passed: 718; failed: 3
[2025-06-19T11:15:55.844Z] Failed test cases:
[2025-06-19T11:15:55.844Z] TEST: java/net/httpclient/http2/ConnectionReuseTest.java
[2025-06-19T11:15:55.844Z] TEST: java/net/MulticastSocket/SetLoopbackModeIPv4.java
[2025-06-19T11:15:55.844Z] TEST: java/net/MulticastSocket/SetOutgoingIf.java
[2025-06-19T11:15:55.844Z]
[2025-06-19T11:15:55.844Z] jdk_management_0 - Test results: passed: 125; failed: 3
[2025-06-19T11:15:55.844Z] Failed test cases:
[2025-06-19T11:15:55.844Z] TEST: sun/management/jdp/JdpDefaultsTest.java
[2025-06-19T11:15:55.844Z] TEST: sun/management/jdp/JdpJmxRemoteDynamicPortTest.java
[2025-06-19T11:15:55.844Z] TEST: sun/management/jdp/JdpSpecificAddressTest.java
[2025-06-19T11:15:55.844Z]
[2025-06-19T11:15:55.844Z]
[2025-06-19T11:15:55.844Z] TOTAL: 6 EXECUTED: 6 PASSED: 4 FAILED: 2 DISABLED: 0 SKIPPED: 0
[2025-06-19T11:15:55.844Z] ++++++++++++++++++++++++++++++++++++++++++++++++++++++++++++++++++++++++++
[2025-06-19T11:15:55.844Z]
[2025-06-19T11:15:55.844Z] TESTCASES RESULTS SUMMARY: passed: 1,751; failed: 6; error: 0; skipped: 0
[2025-06-19T11:15:55.844Z] ++++++++++++++++++++++++++++++++++++++++++++++++++++++++++++++++++++++++++
[2025-06-19T11:15:55.844Z] make[2]: *** [settings.mk:454: resultsSummary] Error 2
[2025-06-19T11:15:56.494Z] make[2]: Leaving directory '/home/jenkins/workspace/Test_openjdk11_hs_extended.openjdk_s390x_linux_testList_5/aqa-tests/TKG'
[2025-06-19T11:15:56.494Z] make[1]: *** [makefile:62: _testList] Error 2
[2025-06-19T11:15:56.494Z] make[1]: Leaving directory '/home/jenkins/workspace/Test_openjdk11_hs_extended.openjdk_s390x_linux_testList_5/aqa-tests/TKG'
[2025-06-19T11:15:56.494Z] make: *** [parallelList.mk:56: testList_5] Error 2
[Pipeline] sh
[2025-06-19T11:15:58.291Z] + uname
[2025-06-19T11:15:58.291Z] + [ Linux = AIX ]
[2025-06-19T11:15:58.291Z] + uname
[2025-06-19T11:15:58.291Z] + [ Linux = SunOS ]
[2025-06-19T11:15:58.291Z] + uname
[2025-06-19T11:15:58.291Z] + [ Linux = *BSD ]
[2025-06-19T11:15:58.291Z] + MAKE=make
[2025-06-19T11:15:58.291Z] + make -f ./aqa-tests/TKG/testEnv.mk testEnvTeardown
[2025-06-19T11:15:58.291Z] make: Nothing to be done for 'testEnvTeardown'.
[Pipeline] }
[2025-06-19T11:15:58.597Z] Xvfb stopping
[Pipeline] // wrap
[Pipeline] echo
[2025-06-19T11:15:59.676Z] There were test failures, set build result to UNSTABLE.
[Pipeline] }
[Pipeline] // stage
[Pipeline] stage
[Pipeline] { (Post)
[Pipeline] step
[2025-06-19T11:15:59.827Z] TAP Reports Processing: START
[2025-06-19T11:15:59.828Z] Looking for TAP results report in workspace using pattern: aqa-tests/TKG/**/*.tap
[2025-06-19T11:16:04.305Z] Saving reports...
[2025-06-19T11:16:04.410Z] Processing '/home/jenkins/.jenkins/jobs/Test_openjdk11_hs_extended.openjdk_s390x_linux_testList_5/builds/28/tap-master-files/aqa-tests/TKG/output_17503202413718/Test_openjdk11_hs_extended.openjdk_s390x_linux_testList_5.tap'
[2025-06-19T11:16:04.410Z] Parsing TAP test result [/home/jenkins/.jenkins/jobs/Test_openjdk11_hs_extended.openjdk_s390x_linux_testList_5/builds/28/tap-master-files/aqa-tests/TKG/output_17503202413718/Test_openjdk11_hs_extended.openjdk_s390x_linux_testList_5.tap].
[2025-06-19T11:16:04.412Z] There are failed test cases. Marking build as UNSTABLE
[2025-06-19T11:16:04.412Z] TAP Reports Processing: FINISH
[Pipeline] echo
[2025-06-19T11:16:04.422Z] Saving aqa-tests/testenv/testenv.properties file on jenkins.
[Pipeline] archiveArtifacts
[2025-06-19T11:16:04.534Z] Archiving artifacts
[2025-06-19T11:16:05.186Z] Recording fingerprints
[Pipeline] echo
[2025-06-19T11:16:05.300Z] Saving aqa-tests/TKG/**/*.tap file on jenkins.
[Pipeline] archiveArtifacts
[2025-06-19T11:16:05.403Z] Archiving artifacts
[2025-06-19T11:16:06.471Z] Recording fingerprints
[Pipeline] sh
[2025-06-19T11:16:08.430Z] + tar -cf - ./aqa-tests/TKG/output_17503202413718
[2025-06-19T11:16:08.430Z] + pigz -9
[Pipeline] echo
[2025-06-19T11:16:37.057Z] ARTIFACTORY_SERVER is not set. Saving artifacts on jenkins.
[Pipeline] archiveArtifacts
[2025-06-19T11:16:37.163Z] Archiving artifacts
[2025-06-19T11:16:40.371Z] Recording fingerprints
[Pipeline] findFiles
[Pipeline] echo
[2025-06-19T11:17:01.756Z] Tap file found: aqa-tests/TKG/output_17503202413718/Test_openjdk11_hs_extended.openjdk_s390x_linux_testList_5.tap...
[Pipeline] readFile
[Pipeline] echo
[2025-06-19T11:17:01.907Z] Rerun in Grinder with failed test targets: https://ci.adoptium.net/job/Grinder/parambuild/?SDK_RESOURCE=upstream&TARGET=testList+TESTLIST=jdk_net_0,jdk_management_0&BASE_DOCKER_REGISTRY_CREDENTIAL_ID=&TEST_FLAG=&UPSTREAM_TEST_JOB_NAME=Test_openjdk11_hs_extended.openjdk_s390x_linux&DOCKER_REQUIRED=false&ACTIVE_NODE_TIMEOUT=5&VENDOR_TEST_DIRS=&EXTRA_DOCKER_ARGS=&TKG_OWNER_BRANCH=adoptium%3Amaster&OPENJ9_SYSTEMTEST_OWNER_BRANCH=eclipse%3Amaster&PLATFORM=s390x_linux&GENERATE_JOBS=true&KEEP_REPORTDIR=true&PERSONAL_BUILD=false&DOCKER_REGISTRY_DIR=&RERUN_ITERATIONS=0&ADOPTOPENJDK_REPO=https%3A%2F%2Fgithub.com%2Fadoptium%2Faqa-tests.git&SETUP_JCK_RUN=false&DOCKER_REGISTRY_URL_CREDENTIAL_ID=&LABEL=&EXTRA_OPTIONS=&CUSTOMIZED_SDK_URL=&BUILD_IDENTIFIER=&JENKINS_KEY=&ADOPTOPENJDK_BRANCH=master&LIGHT_WEIGHT_CHECKOUT=false&USE_JRE=false&ARTIFACTORY_SERVER=&KEEP_WORKSPACE=false&USER_CREDENTIALS_ID=&JDK_VERSION=11&DOCKER_REGISTRY_URL=&ITERATIONS=1&VENDOR_TEST_REPOS=&JDK_REPO=https%3A%2F%2Fgithub.com%2Fadoptium%2Fjdk11u&JCK_GIT_BRANCH=master&OPENJ9_BRANCH=master&OPENJ9_SHA=&JCK_GIT_REPO=&VENDOR_TEST_BRANCHES=&UPSTREAM_JOB_NAME=build-scripts%2Fjobs%2Fjdk11u%2Fjdk11u-linux-s390x-temurin&OPENJ9_REPO=https%3A%2F%2Fgithub.com%2Feclipse-openj9%2Fopenj9.git&CLOUD_PROVIDER=&CUSTOM_TARGET=&VENDOR_TEST_SHAS=&JDK_BRANCH=jdk-11.0.28%2B5_adopt&LABEL_ADDITION=&ARTIFACTORY_REPO=&ARTIFACTORY_ROOT_DIR=&UPSTREAM_TEST_JOB_NUMBER=216&DOCKERIMAGE_TAG=&TEST_TIME=&JDK_IMPL=hotspot&SSH_AGENT_CREDENTIAL=&AUTO_DETECT=true&SLACK_CHANNEL=aqavit-bot&DYNAMIC_COMPILE=false&RELATED_NODES=&ADOPTOPENJDK_SYSTEMTEST_OWNER_BRANCH=adoptium%3Amaster&APPLICATION_OPTIONS=&CUSTOMIZED_SDK_URL_CREDENTIAL_ID=eclipse_temurin_bot_email_and_token&ARCHIVE_TEST_RESULTS=false&NUM_MACHINES=&OPENJDK_SHA=&TRSS_URL=&RERUN_FAILURE=false&USE_TESTENV_PROPERTIES=false&BUILD_LIST=openjdk&ADDITIONAL_ARTIFACTS_REQUIRED=&UPSTREAM_JOB_NUMBER=372&STF_OWNER_BRANCH=adoptium%3Amaster&TIME_LIMIT=25&JVM_OPTIONS=&PARALLEL=None
[Pipeline] echo
[2025-06-19T11:17:01.964Z] Rerun failed jdk test cases in Grinder with jdk_custom target: https://ci.adoptium.net/job/Grinder/parambuild/?SDK_RESOURCE=upstream&TARGET=jdk_custom&BASE_DOCKER_REGISTRY_CREDENTIAL_ID=&TEST_FLAG=&UPSTREAM_TEST_JOB_NAME=Test_openjdk11_hs_extended.openjdk_s390x_linux&DOCKER_REQUIRED=false&ACTIVE_NODE_TIMEOUT=5&VENDOR_TEST_DIRS=&EXTRA_DOCKER_ARGS=&TKG_OWNER_BRANCH=adoptium%3Amaster&OPENJ9_SYSTEMTEST_OWNER_BRANCH=eclipse%3Amaster&PLATFORM=s390x_linux&GENERATE_JOBS=true&KEEP_REPORTDIR=true&PERSONAL_BUILD=false&DOCKER_REGISTRY_DIR=&RERUN_ITERATIONS=0&ADOPTOPENJDK_REPO=https%3A%2F%2Fgithub.com%2Fadoptium%2Faqa-tests.git&SETUP_JCK_RUN=false&DOCKER_REGISTRY_URL_CREDENTIAL_ID=&LABEL=&EXTRA_OPTIONS=&CUSTOMIZED_SDK_URL=&BUILD_IDENTIFIER=&JENKINS_KEY=&ADOPTOPENJDK_BRANCH=master&LIGHT_WEIGHT_CHECKOUT=false&USE_JRE=false&ARTIFACTORY_SERVER=&KEEP_WORKSPACE=false&USER_CREDENTIALS_ID=&JDK_VERSION=11&DOCKER_REGISTRY_URL=&ITERATIONS=1&VENDOR_TEST_REPOS=&JDK_REPO=https%3A%2F%2Fgithub.com%2Fadoptium%2Fjdk11u&JCK_GIT_BRANCH=master&OPENJ9_BRANCH=master&OPENJ9_SHA=&JCK_GIT_REPO=&VENDOR_TEST_BRANCHES=&UPSTREAM_JOB_NAME=build-scripts%2Fjobs%2Fjdk11u%2Fjdk11u-linux-s390x-temurin&OPENJ9_REPO=https%3A%2F%2Fgithub.com%2Feclipse-openj9%2Fopenj9.git&CLOUD_PROVIDER=&CUSTOM_TARGET=java%2Fnet%2Fhttpclient%2Fhttp2%2FConnectionReuseTest.java+java%2Fnet%2FMulticastSocket%2FSetLoopbackModeIPv4.java+java%2Fnet%2FMulticastSocket%2FSetOutgoingIf.java+sun%2Fmanagement%2Fjdp%2FJdpDefaultsTest.java+sun%2Fmanagement%2Fjdp%2FJdpJmxRemoteDynamicPortTest.java+sun%2Fmanagement%2Fjdp%2FJdpSpecificAddressTest.java&VENDOR_TEST_SHAS=&JDK_BRANCH=jdk-11.0.28%2B5_adopt&LABEL_ADDITION=&ARTIFACTORY_REPO=&ARTIFACTORY_ROOT_DIR=&UPSTREAM_TEST_JOB_NUMBER=216&DOCKERIMAGE_TAG=&TEST_TIME=&JDK_IMPL=hotspot&SSH_AGENT_CREDENTIAL=&AUTO_DETECT=true&SLACK_CHANNEL=aqavit-bot&DYNAMIC_COMPILE=false&RELATED_NODES=&ADOPTOPENJDK_SYSTEMTEST_OWNER_BRANCH=adoptium%3Amaster&APPLICATION_OPTIONS=&CUSTOMIZED_SDK_URL_CREDENTIAL_ID=eclipse_temurin_bot_email_and_token&ARCHIVE_TEST_RESULTS=false&NUM_MACHINES=&OPENJDK_SHA=&TRSS_URL=&RERUN_FAILURE=false&USE_TESTENV_PROPERTIES=false&BUILD_LIST=openjdk&ADDITIONAL_ARTIFACTS_REQUIRED=&UPSTREAM_JOB_NUMBER=372&STF_OWNER_BRANCH=adoptium%3Amaster&TIME_LIMIT=25&JVM_OPTIONS=&PARALLEL=None
[Pipeline] junit
[2025-06-19T11:17:02.069Z] Recording test results
[2025-06-19T11:17:08.115Z] [Checks API] No suitable checks publisher found.
[Pipeline] }
[Pipeline] // stage
[Pipeline] echo
[2025-06-19T11:17:08.156Z] PROCESSCATCH: Terminating any hung/left over test processes:
[Pipeline] sh
[2025-06-19T11:17:09.440Z] + aqa-tests/terminateTestProcesses.sh jenkins
[2025-06-19T11:17:09.440Z] Unix type machine..
[2025-06-19T11:17:09.440Z] Running on a Linux host
[2025-06-19T11:17:09.440Z] Woohoo - no rogue processes detected!
[Pipeline] cleanWs
[2025-06-19T11:17:09.966Z] [WS-CLEANUP] Deleting project workspace...
[2025-06-19T11:17:09.966Z] [WS-CLEANUP] Deferred wipeout is disabled by the job configuration...
[2025-06-19T11:17:20.106Z] [WS-CLEANUP] done
[Pipeline] sh
[2025-06-19T11:17:21.367Z] + find /tmp -name *core* -print -exec rm -f {} ;
[2025-06-19T11:17:27.391Z] + true
[Pipeline] }
[Pipeline] // timeout
[Pipeline] timeout
[2025-06-19T11:17:27.726Z] Timeout set to expire in 5 min 0 sec
[Pipeline] {
[Pipeline] }
[Pipeline] // timeout
[Pipeline] }
[Pipeline] // node
[Pipeline] }
[Pipeline] // stage
[Pipeline] echo
[2025-06-19T11:17:27.889Z] SETUP_LABEL: ci.role.test
[Pipeline] }
[Pipeline] // timestamps
[Pipeline] End of Pipeline
Finished: UNSTABLE