Post Test
[2025-05-17T18:20:34.768Z] make[4]: Leaving directory '/cygdrive/c/Users/jenkins/workspace/Test_openjdk21_hs_extended.openjdk_aarch64_windows_testList_2/aqa-tests/openjdk'
[2025-05-17T18:20:34.768Z] make[3]: Leaving directory '/cygdrive/c/Users/jenkins/workspace/Test_openjdk21_hs_extended.openjdk_aarch64_windows_testList_2/aqa-tests'
[2025-05-17T18:20:34.768Z]
[2025-05-17T18:20:34.768Z]
[2025-05-17T18:20:34.768Z] All tests finished, run result summary:
[2025-05-17T18:20:34.768Z] cd "C:/Users/jenkins/workspace/Test_openjdk21_hs_extended.openjdk_aarch64_windows_testList_2/aqa-tests/\\TKG\\scripts"; \
[2025-05-17T18:20:34.768Z] perl "resultsSum.pl" --failuremk="C:/Users/jenkins/workspace/Test_openjdk21_hs_extended.openjdk_aarch64_windows_testList_2/aqa-tests/\\TKG\\failedtargets.mk" --resultFile="C:/Users/jenkins/workspace/Test_openjdk21_hs_extended.openjdk_aarch64_windows_testList_2/aqa-tests/\\TKG\\output_17474950336920\\TestTargetResult" --platFile="C:/Users/jenkins/workspace/Test_openjdk21_hs_extended.openjdk_aarch64_windows_testList_2/aqa-tests/\\TKG\\resources\\buildPlatformMap.properties" --diagnostic=failure --jdkVersion=21 --jdkImpl=hotspot --jdkVendor="eclipse" --spec=win_aarch64 --buildList=openjdk --customTarget="" --testTarget=testList --tapPath=C:/Users/jenkins/workspace/Test_openjdk21_hs_extended.openjdk_aarch64_windows_testList_2/aqa-tests/\\TKG\\output_17474950336920\\ --tapName=Test_openjdk21_hs_extended.openjdk_aarch64_windows_testList_2.tap --comment=""
[2025-05-17T18:20:35.818Z]
[2025-05-17T18:20:35.818Z]
[2025-05-17T18:20:35.818Z] TEST TARGETS SUMMARY
[2025-05-17T18:20:35.818Z] ++++++++++++++++++++++++++++++++++++++++++++++++++++++++++++++++++++++++++
[2025-05-17T18:20:35.818Z] DISABLED test targets:
[2025-05-17T18:20:35.818Z] jdk_awt_0
[2025-05-17T18:20:35.818Z] jdk_sound_2
[2025-05-17T18:20:35.818Z] jdk_swing_2
[2025-05-17T18:20:35.818Z]
[2025-05-17T18:20:35.818Z] PASSED test targets:
[2025-05-17T18:20:35.818Z] hotspot_compiler_0 - Test results: passed: 1,530
[2025-05-17T18:20:35.818Z] hotspot_native_sanity_0 - Test results: passed: 1
[2025-05-17T18:20:35.818Z] jdk_beans_0 - Test results: passed: 357
[2025-05-17T18:20:35.818Z] jdk_nio_1 - Test results: passed: 475
[2025-05-17T18:20:35.818Z] jdk_text_0 - Test results: passed: 189
[2025-05-17T18:20:35.818Z] jdk_time_1 - Test results: passed: 188
[2025-05-17T18:20:35.818Z] jdk_jmx_1 - Test results: passed: 251
[2025-05-17T18:20:35.818Z] jdk_rmi_0 - Test results: passed: 94
[2025-05-17T18:20:35.818Z] jdk_jfr_1 - Test results: passed: 581
[2025-05-17T18:20:35.818Z] jdk_build_1 - Test results: passed: 1
[2025-05-17T18:20:35.818Z] jdk_native_sanity_0 - Test results: passed: 3
[2025-05-17T18:20:35.818Z] jdk_native_sanity_1 - Test results: passed: 3
[2025-05-17T18:20:35.818Z] jdk_vector_1 - Test results: passed: 76
[2025-05-17T18:20:35.818Z]
[2025-05-17T18:20:35.818Z] FAILED test targets:
[2025-05-17T18:20:35.818Z] jdk_other_0 - Test results: passed: 283; failed: 2
[2025-05-17T18:20:35.818Z] Failed test cases:
[2025-05-17T18:20:35.818Z] TEST: javax/script/ProviderTest.sh
[2025-05-17T18:20:35.818Z] TEST: javax/script/ScriptEngineOrder.sh
[2025-05-17T18:20:35.818Z]
[2025-05-17T18:20:35.818Z] jdk_security3_0 - Test results: passed: 967; failed: 6
[2025-05-17T18:20:35.818Z] Failed test cases:
[2025-05-17T18:20:35.818Z] TEST: sun/security/pkcs11/Provider/MultipleLogins.sh
[2025-05-17T18:20:35.818Z] TEST: sun/security/provider/PolicyFile/getinstance/getinstance.sh
[2025-05-17T18:20:35.818Z] TEST: sun/security/ssl/SSLSocketImpl/NotifyHandshakeTest.sh
[2025-05-17T18:20:35.818Z] TEST: sun/security/util/Pem/encoding.sh
[2025-05-17T18:20:35.818Z] TEST: sun/security/validator/certreplace.sh
[2025-05-17T18:20:35.818Z] TEST: sun/security/validator/samedn.sh
[2025-05-17T18:20:35.818Z]
[2025-05-17T18:20:35.818Z] jdk_tools_0 - Test results: passed: 243; failed: 32
[2025-05-17T18:20:35.818Z] Failed test cases:
[2025-05-17T18:20:35.818Z] TEST: sun/tools/jrunscript/jrunscript-argsTest.sh
[2025-05-17T18:20:35.818Z] TEST: sun/tools/jrunscript/jrunscript-cpTest.sh
[2025-05-17T18:20:35.818Z] TEST: sun/tools/jrunscript/jrunscript-DTest.sh
[2025-05-17T18:20:35.818Z] TEST: sun/tools/jrunscript/jrunscript-eTest.sh
[2025-05-17T18:20:35.818Z] TEST: sun/tools/jrunscript/jrunscript-fTest.sh
[2025-05-17T18:20:35.819Z] TEST: sun/tools/jrunscript/jrunscript-helpTest.sh
[2025-05-17T18:20:35.819Z] TEST: sun/tools/jrunscript/jrunscriptTest.sh
[2025-05-17T18:20:35.819Z] TEST: sun/tools/jstat/jstatClassloadOutput1.sh
[2025-05-17T18:20:35.819Z] TEST: sun/tools/jstat/jstatClassOutput1.sh
[2025-05-17T18:20:35.819Z] TEST: sun/tools/jstat/jstatCompilerOutput1.sh
[2025-05-17T18:20:35.819Z] TEST: sun/tools/jstat/jstatFileURITest1.sh
[2025-05-17T18:20:35.819Z] TEST: sun/tools/jstat/jstatGcCapacityOutput1.sh
[2025-05-17T18:20:35.819Z] TEST: sun/tools/jstat/jstatGcCauseOutput1.sh
[2025-05-17T18:20:35.819Z] TEST: sun/tools/jstat/jstatGcMetaCapacityOutput1.sh
[2025-05-17T18:20:35.819Z] TEST: sun/tools/jstat/jstatGcNewCapacityOutput1.sh
[2025-05-17T18:20:35.819Z] TEST: sun/tools/jstat/jstatGcNewOutput1.sh
[2025-05-17T18:20:35.819Z] TEST: sun/tools/jstat/jstatGcOldCapacityOutput1.sh
[2025-05-17T18:20:35.819Z] TEST: sun/tools/jstat/jstatGcOldOutput1.sh
[2025-05-17T18:20:35.819Z] TEST: sun/tools/jstat/jstatGcOutput1.sh
[2025-05-17T18:20:35.819Z] TEST: sun/tools/jstat/jstatHelp.sh
[2025-05-17T18:20:35.819Z] TEST: sun/tools/jstat/jstatLineCounts1.sh
[2025-05-17T18:20:35.819Z] TEST: sun/tools/jstat/jstatLineCounts2.sh
[2025-05-17T18:20:35.819Z] TEST: sun/tools/jstat/jstatLineCounts3.sh
[2025-05-17T18:20:35.819Z] TEST: sun/tools/jstat/jstatLineCounts4.sh
[2025-05-17T18:20:35.819Z] TEST: sun/tools/jstat/jstatOptions1.sh
[2025-05-17T18:20:35.819Z] TEST: sun/tools/jstat/jstatPrintCompilationOutput1.sh
[2025-05-17T18:20:35.819Z] TEST: sun/tools/jstat/jstatSnap1.sh
[2025-05-17T18:20:35.819Z] TEST: sun/tools/jstat/jstatSnap2.sh
[2025-05-17T18:20:35.819Z] TEST: sun/tools/jstat/jstatTimeStamp1.sh
[2025-05-17T18:20:35.819Z] TEST: tools/jpackage/share/BasicTest.java
[2025-05-17T18:20:35.819Z] TEST: tools/launcher/ClassPathWildCard.sh
[2025-05-17T18:20:35.819Z] TEST: tools/launcher/MultipleJRE.sh
[2025-05-17T18:20:35.819Z]
[2025-05-17T18:20:35.819Z] jdk_imageio_0 - Test results: passed: 198; failed: 6
[2025-05-17T18:20:35.819Z] Failed test cases:
[2025-05-17T18:20:35.819Z] TEST: javax/imageio/metadata/IIOMetadataFormat/runMetadataFormatTest.sh
[2025-05-17T18:20:35.819Z] TEST: javax/imageio/metadata/IIOMetadataFormat/runMetadataFormatThreadTest.sh
[2025-05-17T18:20:35.819Z] TEST: javax/imageio/plugins/external_plugin_tests/TestClassPathPlugin.sh
[2025-05-17T18:20:35.819Z] TEST: javax/imageio/spi/AppletContextTest/BadPluginConfigurationTest.sh
[2025-05-17T18:20:35.819Z] TEST: javax/imageio/stream/DeleteOnExitTest.sh
[2025-05-17T18:20:35.819Z] TEST: javax/imageio/stream/StreamCloserLeak/run_test.sh
[2025-05-17T18:20:35.819Z]
[2025-05-17T18:20:35.819Z]
[2025-05-17T18:20:35.819Z] TOTAL: 27 EXECUTED: 17 PASSED: 13 FAILED: 4 DISABLED: 3 SKIPPED: 7
[2025-05-17T18:20:35.819Z] ++++++++++++++++++++++++++++++++++++++++++++++++++++++++++++++++++++++++++
[2025-05-17T18:20:35.819Z]
[2025-05-17T18:20:35.819Z] TESTCASES RESULTS SUMMARY: passed: 5,440; failed: 46; error: 0; skipped: 0
[2025-05-17T18:20:35.819Z] ++++++++++++++++++++++++++++++++++++++++++++++++++++++++++++++++++++++++++
[2025-05-17T18:20:35.819Z] make[2]: *** [settings.mk:454: resultsSummary] Error 2
[2025-05-17T18:20:35.819Z] make[2]: Leaving directory '/cygdrive/c/Users/jenkins/workspace/Test_openjdk21_hs_extended.openjdk_aarch64_windows_testList_2/aqa-tests/TKG'
[2025-05-17T18:20:35.819Z] make[1]: *** [makefile:62: _testList] Error 2
[2025-05-17T18:20:35.819Z] make[1]: Leaving directory '/cygdrive/c/Users/jenkins/workspace/Test_openjdk21_hs_extended.openjdk_aarch64_windows_testList_2/aqa-tests/TKG'
[2025-05-17T18:20:35.819Z] make: *** [parallelList.mk:38: testList_2] Error 2
[Pipeline] sh
[2025-05-17T18:20:37.016Z] ++ uname
[2025-05-17T18:20:37.016Z] + '[' CYGWIN_NT-10.0-22000-ARM64 = AIX ']'
[2025-05-17T18:20:37.016Z] ++ uname
[2025-05-17T18:20:37.016Z] + '[' CYGWIN_NT-10.0-22000-ARM64 = SunOS ']'
[2025-05-17T18:20:37.016Z] ++ uname
[2025-05-17T18:20:37.016Z] + '[' CYGWIN_NT-10.0-22000-ARM64 = '*BSD' ']'
[2025-05-17T18:20:37.016Z] + MAKE=make
[2025-05-17T18:20:37.016Z] + make -f ./aqa-tests/TKG/testEnv.mk testEnvTeardown
[2025-05-17T18:20:37.315Z] make: Nothing to be done for 'testEnvTeardown'.
[Pipeline] echo
[2025-05-17T18:20:37.416Z] There were test failures, set build result to UNSTABLE.
[Pipeline] }
[Pipeline] // stage
[Pipeline] stage
[Pipeline] { (Post)
[Pipeline] step
[2025-05-17T18:20:37.508Z] TAP Reports Processing: START
[2025-05-17T18:20:37.509Z] Looking for TAP results report in workspace using pattern: aqa-tests/TKG/**/*.tap
[2025-05-17T18:21:15.337Z] Saving reports...
[2025-05-17T18:21:15.383Z] Processing '/home/jenkins/.jenkins/jobs/Test_openjdk21_hs_extended.openjdk_aarch64_windows_testList_2/builds/4/tap-master-files/aqa-tests/TKG/output_17474950336920/Test_openjdk21_hs_extended.openjdk_aarch64_windows_testList_2.tap'
[2025-05-17T18:21:15.383Z] Parsing TAP test result [/home/jenkins/.jenkins/jobs/Test_openjdk21_hs_extended.openjdk_aarch64_windows_testList_2/builds/4/tap-master-files/aqa-tests/TKG/output_17474950336920/Test_openjdk21_hs_extended.openjdk_aarch64_windows_testList_2.tap].
[2025-05-17T18:21:15.386Z] There are failed test cases. Marking build as UNSTABLE
[2025-05-17T18:21:15.386Z] TAP Reports Processing: FINISH
[Pipeline] echo
[2025-05-17T18:21:15.392Z] Saving aqa-tests/testenv/testenv.properties file on jenkins.
[Pipeline] archiveArtifacts
[2025-05-17T18:21:15.416Z] Archiving artifacts
[2025-05-17T18:21:15.470Z] Recording fingerprints
[Pipeline] echo
[2025-05-17T18:21:15.532Z] Saving aqa-tests/TKG/**/*.tap file on jenkins.
[Pipeline] archiveArtifacts
[2025-05-17T18:21:15.554Z] Archiving artifacts
[2025-05-17T18:21:38.037Z] Recording fingerprints
[Pipeline] sh
[2025-05-17T18:22:01.258Z] + tar -cf - ./aqa-tests/TKG/output_17474950336920
[2025-05-17T18:22:01.553Z] + pigz -9
[2025-05-17T18:22:01.553Z] + gzip -9
[Pipeline] echo
[2025-05-17T18:31:40.428Z] ARTIFACTORY_SERVER is not set. Saving artifacts on jenkins.
[Pipeline] archiveArtifacts
[2025-05-17T18:31:40.457Z] Archiving artifacts
[2025-05-17T18:31:59.212Z] Recording fingerprints
[Pipeline] findFiles
[Pipeline] echo
[2025-05-17T18:32:44.764Z] Tap file found: aqa-tests\TKG\output_17474950336920\Test_openjdk21_hs_extended.openjdk_aarch64_windows_testList_2.tap...
[Pipeline] readFile
[Pipeline] echo
[2025-05-17T18:32:44.892Z] Rerun in Grinder with failed test targets: https://ci.adoptium.net/job/Grinder/parambuild/?SDK_RESOURCE=upstream&TARGET=testList+TESTLIST=jdk_other_0,jdk_security3_0,jdk_tools_0,jdk_imageio_0&BASE_DOCKER_REGISTRY_CREDENTIAL_ID=&TEST_FLAG=&UPSTREAM_TEST_JOB_NAME=Test_openjdk21_hs_extended.openjdk_aarch64_windows&DOCKER_REQUIRED=false&ACTIVE_NODE_TIMEOUT=5&VENDOR_TEST_DIRS=&EXTRA_DOCKER_ARGS=&TKG_OWNER_BRANCH=adoptium%3Amaster&OPENJ9_SYSTEMTEST_OWNER_BRANCH=eclipse%3Amaster&PLATFORM=aarch64_windows&GENERATE_JOBS=true&KEEP_REPORTDIR=true&PERSONAL_BUILD=false&DOCKER_REGISTRY_DIR=&RERUN_ITERATIONS=0&ADOPTOPENJDK_REPO=https%3A%2F%2Fgithub.com%2Fadoptium%2Faqa-tests.git&SETUP_JCK_RUN=false&DOCKER_REGISTRY_URL_CREDENTIAL_ID=&LABEL=&EXTRA_OPTIONS=&CUSTOMIZED_SDK_URL=&BUILD_IDENTIFIER=&JENKINS_KEY=&ADOPTOPENJDK_BRANCH=master&LIGHT_WEIGHT_CHECKOUT=false&USE_JRE=false&ARTIFACTORY_SERVER=&KEEP_WORKSPACE=false&USER_CREDENTIALS_ID=&JDK_VERSION=21&DOCKER_REGISTRY_URL=&ITERATIONS=1&VENDOR_TEST_REPOS=&JDK_REPO=https%3A%2F%2Fgithub.com%2Fadoptium%2Fjdk21u&JCK_GIT_BRANCH=master&OPENJ9_BRANCH=master&OPENJ9_SHA=&JCK_GIT_REPO=&VENDOR_TEST_BRANCHES=&UPSTREAM_JOB_NAME=build-scripts%2Fjobs%2Fjdk21u%2Fjdk21u-windows-aarch64-temurin&OPENJ9_REPO=https%3A%2F%2Fgithub.com%2Feclipse-openj9%2Fopenj9.git&CLOUD_PROVIDER=&CUSTOM_TARGET=&VENDOR_TEST_SHAS=&JDK_BRANCH=jdk-21.0.8%2B3_adopt&LABEL_ADDITION=&ARTIFACTORY_REPO=&ARTIFACTORY_ROOT_DIR=&UPSTREAM_TEST_JOB_NUMBER=59&DOCKERIMAGE_TAG=&TEST_TIME=&JDK_IMPL=hotspot&SSH_AGENT_CREDENTIAL=&AUTO_DETECT=true&SLACK_CHANNEL=aqavit-bot&DYNAMIC_COMPILE=false&RELATED_NODES=&ADOPTOPENJDK_SYSTEMTEST_OWNER_BRANCH=adoptium%3Amaster&APPLICATION_OPTIONS=&CUSTOMIZED_SDK_URL_CREDENTIAL_ID=eclipse_temurin_bot_email_and_token&ARCHIVE_TEST_RESULTS=false&NUM_MACHINES=&OPENJDK_SHA=&TRSS_URL=&RERUN_FAILURE=false&USE_TESTENV_PROPERTIES=false&BUILD_LIST=openjdk&ADDITIONAL_ARTIFACTS_REQUIRED=&UPSTREAM_JOB_NUMBER=51&STF_OWNER_BRANCH=adoptium%3Amaster&TIME_LIMIT=25&JVM_OPTIONS=&PARALLEL=None
[Pipeline] echo
[2025-05-17T18:32:44.955Z] Rerun failed jdk test cases in Grinder with jdk_custom target: https://ci.adoptium.net/job/Grinder/parambuild/?SDK_RESOURCE=upstream&TARGET=jdk_custom&BASE_DOCKER_REGISTRY_CREDENTIAL_ID=&TEST_FLAG=&UPSTREAM_TEST_JOB_NAME=Test_openjdk21_hs_extended.openjdk_aarch64_windows&DOCKER_REQUIRED=false&ACTIVE_NODE_TIMEOUT=5&VENDOR_TEST_DIRS=&EXTRA_DOCKER_ARGS=&TKG_OWNER_BRANCH=adoptium%3Amaster&OPENJ9_SYSTEMTEST_OWNER_BRANCH=eclipse%3Amaster&PLATFORM=aarch64_windows&GENERATE_JOBS=true&KEEP_REPORTDIR=true&PERSONAL_BUILD=false&DOCKER_REGISTRY_DIR=&RERUN_ITERATIONS=0&ADOPTOPENJDK_REPO=https%3A%2F%2Fgithub.com%2Fadoptium%2Faqa-tests.git&SETUP_JCK_RUN=false&DOCKER_REGISTRY_URL_CREDENTIAL_ID=&LABEL=&EXTRA_OPTIONS=&CUSTOMIZED_SDK_URL=&BUILD_IDENTIFIER=&JENKINS_KEY=&ADOPTOPENJDK_BRANCH=master&LIGHT_WEIGHT_CHECKOUT=false&USE_JRE=false&ARTIFACTORY_SERVER=&KEEP_WORKSPACE=false&USER_CREDENTIALS_ID=&JDK_VERSION=21&DOCKER_REGISTRY_URL=&ITERATIONS=1&VENDOR_TEST_REPOS=&JDK_REPO=https%3A%2F%2Fgithub.com%2Fadoptium%2Fjdk21u&JCK_GIT_BRANCH=master&OPENJ9_BRANCH=master&OPENJ9_SHA=&JCK_GIT_REPO=&VENDOR_TEST_BRANCHES=&UPSTREAM_JOB_NAME=build-scripts%2Fjobs%2Fjdk21u%2Fjdk21u-windows-aarch64-temurin&OPENJ9_REPO=https%3A%2F%2Fgithub.com%2Feclipse-openj9%2Fopenj9.git&CLOUD_PROVIDER=&CUSTOM_TARGET=javax%2Fscript%2FProviderTest.sh+javax%2Fscript%2FScriptEngineOrder.sh+sun%2Fsecurity%2Fpkcs11%2FProvider%2FMultipleLogins.sh+sun%2Fsecurity%2Fprovider%2FPolicyFile%2Fgetinstance%2Fgetinstance.sh+sun%2Fsecurity%2Fssl%2FSSLSocketImpl%2FNotifyHandshakeTest.sh+sun%2Fsecurity%2Futil%2FPem%2Fencoding.sh+sun%2Fsecurity%2Fvalidator%2Fcertreplace.sh+sun%2Fsecurity%2Fvalidator%2Fsamedn.sh+sun%2Ftools%2Fjrunscript%2Fjrunscript-argsTest.sh+sun%2Ftools%2Fjrunscript%2Fjrunscript-cpTest.sh+sun%2Ftools%2Fjrunscript%2Fjrunscript-DTest.sh+sun%2Ftools%2Fjrunscript%2Fjrunscript-eTest.sh+sun%2Ftools%2Fjrunscript%2Fjrunscript-fTest.sh+sun%2Ftools%2Fjrunscript%2Fjrunscript-helpTest.sh+sun%2Ftools%2Fjrunscript%2FjrunscriptTest.sh+sun%2Ftools%2Fjstat%2FjstatClassloadOutput1.sh+sun%2Ftools%2Fjstat%2FjstatClassOutput1.sh+sun%2Ftools%2Fjstat%2FjstatCompilerOutput1.sh+sun%2Ftools%2Fjstat%2FjstatFileURITest1.sh+sun%2Ftools%2Fjstat%2FjstatGcCapacityOutput1.sh+sun%2Ftools%2Fjstat%2FjstatGcCauseOutput1.sh+sun%2Ftools%2Fjstat%2FjstatGcMetaCapacityOutput1.sh+sun%2Ftools%2Fjstat%2FjstatGcNewCapacityOutput1.sh+sun%2Ftools%2Fjstat%2FjstatGcNewOutput1.sh+sun%2Ftools%2Fjstat%2FjstatGcOldCapacityOutput1.sh+sun%2Ftools%2Fjstat%2FjstatGcOldOutput1.sh+sun%2Ftools%2Fjstat%2FjstatGcOutput1.sh+sun%2Ftools%2Fjstat%2FjstatHelp.sh+sun%2Ftools%2Fjstat%2FjstatLineCounts1.sh+sun%2Ftools%2Fjstat%2FjstatLineCounts2.sh+sun%2Ftools%2Fjstat%2FjstatLineCounts3.sh+sun%2Ftools%2Fjstat%2FjstatLineCounts4.sh+sun%2Ftools%2Fjstat%2FjstatOptions1.sh+sun%2Ftools%2Fjstat%2FjstatPrintCompilationOutput1.sh+sun%2Ftools%2Fjstat%2FjstatSnap1.sh+sun%2Ftools%2Fjstat%2FjstatSnap2.sh+sun%2Ftools%2Fjstat%2FjstatTimeStamp1.sh+tools%2Fjpackage%2Fshare%2FBasicTest.java+tools%2Flauncher%2FClassPathWildCard.sh+tools%2Flauncher%2FMultipleJRE.sh+javax%2Fimageio%2Fmetadata%2FIIOMetadataFormat%2FrunMetadataFormatTest.sh+javax%2Fimageio%2Fmetadata%2FIIOMetadataFormat%2FrunMetadataFormatThreadTest.sh+javax%2Fimageio%2Fplugins%2Fexternal_plugin_tests%2FTestClassPathPlugin.sh+javax%2Fimageio%2Fspi%2FAppletContextTest%2FBadPluginConfigurationTest.sh+javax%2Fimageio%2Fstream%2FDeleteOnExitTest.sh+javax%2Fimageio%2Fstream%2FStreamCloserLeak%2Frun_test.sh&VENDOR_TEST_SHAS=&JDK_BRANCH=jdk-21.0.8%2B3_adopt&LABEL_ADDITION=&ARTIFACTORY_REPO=&ARTIFACTORY_ROOT_DIR=&UPSTREAM_TEST_JOB_NUMBER=59&DOCKERIMAGE_TAG=&TEST_TIME=&JDK_IMPL=hotspot&SSH_AGENT_CREDENTIAL=&AUTO_DETECT=true&SLACK_CHANNEL=aqavit-bot&DYNAMIC_COMPILE=false&RELATED_NODES=&ADOPTOPENJDK_SYSTEMTEST_OWNER_BRANCH=adoptium%3Amaster&APPLICATION_OPTIONS=&CUSTOMIZED_SDK_URL_CREDENTIAL_ID=eclipse_temurin_bot_email_and_token&ARCHIVE_TEST_RESULTS=false&NUM_MACHINES=&OPENJDK_SHA=&TRSS_URL=&RERUN_FAILURE=false&USE_TESTENV_PROPERTIES=false&BUILD_LIST=openjdk&ADDITIONAL_ARTIFACTS_REQUIRED=&UPSTREAM_JOB_NUMBER=51&STF_OWNER_BRANCH=adoptium%3Amaster&TIME_LIMIT=25&JVM_OPTIONS=&PARALLEL=None
[Pipeline] junit
[2025-05-17T18:32:44.988Z] Recording test results
[2025-05-17T18:33:39.807Z] [Checks API] No suitable checks publisher found.
[Pipeline] }
[Pipeline] // stage
[Pipeline] echo
[2025-05-17T18:33:39.834Z] PROCESSCATCH: Terminating any hung/left over test processes:
[Pipeline] sh
[2025-05-17T18:33:40.290Z] + aqa-tests/terminateTestProcesses.sh null
[2025-05-17T18:33:40.586Z] Windows machine, using powershell queries...
[2025-05-17T18:33:42.120Z] Woohoo - no rogue processes detected!
[Pipeline] cleanWs
[2025-05-17T18:33:42.231Z] [WS-CLEANUP] Deleting project workspace...
[2025-05-17T18:33:42.232Z] [WS-CLEANUP] Deferred wipeout is disabled by the job configuration...
[2025-05-17T18:36:13.969Z] [WS-CLEANUP] done
[Pipeline] sh
[2025-05-17T18:36:14.489Z] + find /cygdrive/c/temp -name '*core*' -print -exec rm -f '{}' ';'
[Pipeline] }
[Pipeline] // timeout
[Pipeline] timeout
[2025-05-17T18:36:14.859Z] Timeout set to expire in 5 min 0 sec
[Pipeline] {
[Pipeline] }
[Pipeline] // timeout
[Pipeline] }
[Pipeline] // node
[Pipeline] }
[Pipeline] // stage
[Pipeline] echo
[2025-05-17T18:36:14.964Z] SETUP_LABEL: ci.role.test
[Pipeline] }
[Pipeline] // timestamps
[Pipeline] End of Pipeline
Finished: UNSTABLE