jdk_security3_0
[2025-02-13T06:14:54.731Z] Running test jdk_security3_0 ...
[2025-02-13T06:14:54.731Z] ===============================================
[2025-02-13T06:14:54.731Z] jdk_security3_0 Start Time: Thu Feb 13 06:14:51 2025 Epoch Time (ms): 1739427291471
[2025-02-13T06:14:54.731Z] variation: Mode150
[2025-02-13T06:14:54.731Z] JVM_OPTIONS: -XX:+UseCompressedOops
[2025-02-13T06:14:54.731Z] { \
[2025-02-13T06:14:54.731Z] echo ""; echo "TEST SETUP:"; \
[2025-02-13T06:14:54.731Z] echo "Nothing to be done for setup."; \
[2025-02-13T06:14:54.731Z] mkdir -p "/home/jenkins/workspace/Test_openjdk21_hs_extended.openjdk_ppc64le_linux_rerun/aqa-tests/TKG/../TKG/output_17394226109969/jdk_security3_0"; \
[2025-02-13T06:14:54.731Z] cd "/home/jenkins/workspace/Test_openjdk21_hs_extended.openjdk_ppc64le_linux_rerun/aqa-tests/TKG/../TKG/output_17394226109969/jdk_security3_0"; \
[2025-02-13T06:14:54.731Z] echo ""; echo "TESTING:"; \
[2025-02-13T06:14:54.731Z] "/home/jenkins/workspace/Test_openjdk21_hs_extended.openjdk_ppc64le_linux_rerun/jdkbinary/j2sdk-image/bin/java" -Xmx512m -jar "/home/jenkins/workspace/Test_openjdk21_hs_extended.openjdk_ppc64le_linux_rerun/aqa-tests/TKG/../../jvmtest/openjdk/jtreg/lib/jtreg.jar" \
[2025-02-13T06:14:54.731Z] -agentvm -a -ea -esa -v:fail,error,time,nopass -retain:fail,error,*.dmp,javacore.*,heapdump.*,*.trc -ignore:quiet -timeoutFactor:8 -xml:verify -concurrency:3 -nativepath:"/home/jenkins/workspace/Test_openjdk21_hs_extended.openjdk_ppc64le_linux_rerun/jdkbinary/openjdk-test-image/jdk/jtreg/native" -vmoptions:"-Xmx512m -XX:+UseCompressedOops " \
[2025-02-13T06:14:54.731Z] \
[2025-02-13T06:14:54.731Z] -w ""/home/jenkins/workspace/Test_openjdk21_hs_extended.openjdk_ppc64le_linux_rerun/aqa-tests/TKG/../TKG/output_17394226109969/jdk_security3_0"/work" \
[2025-02-13T06:14:54.731Z] -r ""/home/jenkins/workspace/Test_openjdk21_hs_extended.openjdk_ppc64le_linux_rerun/aqa-tests/TKG/../TKG/output_17394226109969/jdk_security3_0"/report" \
[2025-02-13T06:14:54.731Z] -jdk:"/home/jenkins/workspace/Test_openjdk21_hs_extended.openjdk_ppc64le_linux_rerun/jdkbinary/j2sdk-image" \
[2025-02-13T06:14:54.731Z] -exclude:"/home/jenkins/workspace/Test_openjdk21_hs_extended.openjdk_ppc64le_linux_rerun/aqa-tests/TKG/../openjdk/openjdk-jdk/test/jdk/ProblemList.txt" \
[2025-02-13T06:14:54.731Z] -exclude:"/home/jenkins/workspace/Test_openjdk21_hs_extended.openjdk_ppc64le_linux_rerun/aqa-tests/TKG/../../jvmtest/openjdk/excludes/ProblemList_openjdk21.txt" \
[2025-02-13T06:14:54.731Z] \
[2025-02-13T06:14:54.731Z] -exclude:"/home/jenkins/workspace/Test_openjdk21_hs_extended.openjdk_ppc64le_linux_rerun/aqa-tests/TKG/../openjdk/excludes/vendors/eclipse/ProblemList_openjdk21.txt" \
[2025-02-13T06:14:54.731Z] "/home/jenkins/workspace/Test_openjdk21_hs_extended.openjdk_ppc64le_linux_rerun/aqa-tests/TKG/../openjdk/openjdk-jdk/test/jdk:jdk_security3"; \
[2025-02-13T06:14:54.731Z] if [ $? -eq 0 ]; then echo "-----------------------------------"; echo "jdk_security3_0""_PASSED"; echo "-----------------------------------"; cd /home/jenkins/workspace/Test_openjdk21_hs_extended.openjdk_ppc64le_linux_rerun/aqa-tests/TKG/..; else echo "-----------------------------------"; echo "jdk_security3_0""_FAILED"; echo "-----------------------------------"; fi; \
[2025-02-13T06:14:54.731Z] echo ""; echo "TEST TEARDOWN:"; \
[2025-02-13T06:14:54.731Z] echo "Nothing to be done for teardown."; \
[2025-02-13T06:14:54.731Z] } 2>&1 | tee -a "/home/jenkins/workspace/Test_openjdk21_hs_extended.openjdk_ppc64le_linux_rerun/aqa-tests/TKG/../TKG/output_17394226109969/TestTargetResult";
[2025-02-13T06:14:54.731Z]
[2025-02-13T06:14:54.731Z] TEST SETUP:
[2025-02-13T06:14:54.731Z] Nothing to be done for setup.
[2025-02-13T06:14:54.731Z]
[2025-02-13T06:14:54.731Z] TESTING:
[2025-02-13T06:14:54.731Z] Directory "/home/jenkins/workspace/Test_openjdk21_hs_extended.openjdk_ppc64le_linux_rerun/aqa-tests/TKG/../TKG/output_17394226109969/jdk_security3_0/work" not found: creating
[2025-02-13T06:14:54.731Z] Directory "/home/jenkins/workspace/Test_openjdk21_hs_extended.openjdk_ppc64le_linux_rerun/aqa-tests/TKG/../TKG/output_17394226109969/jdk_security3_0/report" not found: creating
[2025-02-13T06:14:57.618Z] XML output with verification to /home/jenkins/workspace/Test_openjdk21_hs_extended.openjdk_ppc64le_linux_rerun/aqa-tests/TKG/output_17394226109969/jdk_security3_0/work
[2025-02-13T06:42:02.855Z] --------------------------------------------------
[2025-02-13T06:42:02.855Z] TEST: sun/security/ssl/X509TrustManagerImpl/distrust/Entrust.java
[2025-02-13T06:42:02.855Z] TEST JDK: /home/jenkins/workspace/Test_openjdk21_hs_extended.openjdk_ppc64le_linux_rerun/jdkbinary/j2sdk-image
[2025-02-13T06:42:02.855Z]
[2025-02-13T06:42:02.855Z] ACTION: build -- Passed. Build successful
[2025-02-13T06:42:02.855Z] REASON: Named class compiled on demand
[2025-02-13T06:42:02.855Z] TIME: 0.096 seconds
[2025-02-13T06:42:02.855Z] messages:
[2025-02-13T06:42:02.855Z] command: build Entrust
[2025-02-13T06:42:02.855Z] reason: Named class compiled on demand
[2025-02-13T06:42:02.855Z] started: Thu Feb 13 06:41:51 UTC 2025
[2025-02-13T06:42:02.855Z] Test directory:
[2025-02-13T06:42:02.855Z] compile: Entrust
[2025-02-13T06:42:02.855Z] finished: Thu Feb 13 06:41:51 UTC 2025
[2025-02-13T06:42:02.855Z] elapsed time (seconds): 0.096
[2025-02-13T06:42:02.855Z]
[2025-02-13T06:42:02.855Z] ACTION: compile -- Passed. Compilation successful
[2025-02-13T06:42:02.855Z] REASON: .class file out of date or does not exist
[2025-02-13T06:42:02.855Z] TIME: 0.095 seconds
[2025-02-13T06:42:02.855Z] messages:
[2025-02-13T06:42:02.855Z] command: compile /home/jenkins/workspace/Test_openjdk21_hs_extended.openjdk_ppc64le_linux_rerun/aqa-tests/openjdk/openjdk-jdk/test/jdk/sun/security/ssl/X509TrustManagerImpl/distrust/Entrust.java
[2025-02-13T06:42:02.855Z] reason: .class file out of date or does not exist
[2025-02-13T06:42:02.855Z] started: Thu Feb 13 06:41:51 UTC 2025
[2025-02-13T06:42:02.855Z] Additional options from @modules: --add-modules java.base --add-exports java.base/sun.security.validator=ALL-UNNAMED
[2025-02-13T06:42:02.855Z] Mode: agentvm
[2025-02-13T06:42:02.855Z] Agent id: 1
[2025-02-13T06:42:02.855Z] finished: Thu Feb 13 06:41:51 UTC 2025
[2025-02-13T06:42:02.855Z] elapsed time (seconds): 0.095
[2025-02-13T06:42:02.855Z] configuration:
[2025-02-13T06:42:02.855Z] Boot Layer (javac runtime environment)
[2025-02-13T06:42:02.855Z] class path: /home/jenkins/workspace/Test_openjdk21_hs_extended.openjdk_ppc64le_linux_rerun/jvmtest/openjdk/jtreg/lib/javatest.jar
[2025-02-13T06:42:02.855Z] /home/jenkins/workspace/Test_openjdk21_hs_extended.openjdk_ppc64le_linux_rerun/jvmtest/openjdk/jtreg/lib/jtreg.jar
[2025-02-13T06:42:02.855Z] patch: java.base /home/jenkins/workspace/Test_openjdk21_hs_extended.openjdk_ppc64le_linux_rerun/aqa-tests/TKG/output_17394226109969/jdk_security3_0/work/patches/java.base
[2025-02-13T06:42:02.855Z]
[2025-02-13T06:42:02.855Z] javac compilation environment
[2025-02-13T06:42:02.855Z] add modules: java.base
[2025-02-13T06:42:02.855Z] add exports: java.base/sun.security.validator ALL-UNNAMED
[2025-02-13T06:42:02.855Z] source path: /home/jenkins/workspace/Test_openjdk21_hs_extended.openjdk_ppc64le_linux_rerun/aqa-tests/openjdk/openjdk-jdk/test/jdk/sun/security/ssl/X509TrustManagerImpl/distrust
[2025-02-13T06:42:02.855Z] /home/jenkins/workspace/Test_openjdk21_hs_extended.openjdk_ppc64le_linux_rerun/aqa-tests/openjdk/openjdk-jdk/test/lib
[2025-02-13T06:42:02.855Z] class path: /home/jenkins/workspace/Test_openjdk21_hs_extended.openjdk_ppc64le_linux_rerun/aqa-tests/openjdk/openjdk-jdk/test/jdk/sun/security/ssl/X509TrustManagerImpl/distrust
[2025-02-13T06:42:02.855Z] /home/jenkins/workspace/Test_openjdk21_hs_extended.openjdk_ppc64le_linux_rerun/aqa-tests/TKG/output_17394226109969/jdk_security3_0/work/classes/0/sun/security/ssl/X509TrustManagerImpl/distrust/Entrust.d
[2025-02-13T06:42:02.855Z] /home/jenkins/workspace/Test_openjdk21_hs_extended.openjdk_ppc64le_linux_rerun/aqa-tests/TKG/output_17394226109969/jdk_security3_0/work/classes/0/test/lib
[2025-02-13T06:42:02.855Z]
[2025-02-13T06:42:02.855Z] rerun:
[2025-02-13T06:42:02.855Z] cd /home/jenkins/workspace/Test_openjdk21_hs_extended.openjdk_ppc64le_linux_rerun/aqa-tests/TKG/output_17394226109969/jdk_security3_0/work/scratch/0 && \
[2025-02-13T06:42:02.855Z] DISPLAY=:0 \
[2025-02-13T06:42:02.855Z] HOME=/home/jenkins \
[2025-02-13T06:42:02.855Z] LANG=C.utf8 \
[2025-02-13T06:42:02.855Z] PATH=/bin:/usr/bin:/usr/sbin \
[2025-02-13T06:42:02.855Z] /home/jenkins/workspace/Test_openjdk21_hs_extended.openjdk_ppc64le_linux_rerun/jdkbinary/j2sdk-image/bin/javac \
[2025-02-13T06:42:02.855Z] -J-ea \
[2025-02-13T06:42:02.855Z] -J-esa \
[2025-02-13T06:42:02.855Z] -J-Xmx512m \
[2025-02-13T06:42:02.855Z] -J-XX:+UseCompressedOops \
[2025-02-13T06:42:02.855Z] -J-Dtest.vm.opts='-ea -esa -Xmx512m -XX:+UseCompressedOops' \
[2025-02-13T06:42:02.855Z] -J-Dtest.tool.vm.opts='-J-ea -J-esa -J-Xmx512m -J-XX:+UseCompressedOops' \
[2025-02-13T06:42:02.855Z] -J-Dtest.compiler.opts= \
[2025-02-13T06:42:02.855Z] -J-Dtest.java.opts= \
[2025-02-13T06:42:02.855Z] -J-Dtest.jdk=/home/jenkins/workspace/Test_openjdk21_hs_extended.openjdk_ppc64le_linux_rerun/jdkbinary/j2sdk-image \
[2025-02-13T06:42:02.855Z] -J-Dcompile.jdk=/home/jenkins/workspace/Test_openjdk21_hs_extended.openjdk_ppc64le_linux_rerun/jdkbinary/j2sdk-image \
[2025-02-13T06:42:02.855Z] -J-Dtest.timeout.factor=8.0 \
[2025-02-13T06:42:02.855Z] -J-Dtest.nativepath=/home/jenkins/workspace/Test_openjdk21_hs_extended.openjdk_ppc64le_linux_rerun/jdkbinary/openjdk-test-image/jdk/jtreg/native \
[2025-02-13T06:42:02.855Z] -J-Dtest.root=/home/jenkins/workspace/Test_openjdk21_hs_extended.openjdk_ppc64le_linux_rerun/aqa-tests/openjdk/openjdk-jdk/test/jdk \
[2025-02-13T06:42:02.855Z] -J-Dtest.name=sun/security/ssl/X509TrustManagerImpl/distrust/Entrust.java \
[2025-02-13T06:42:02.855Z] -J-Dtest.file=/home/jenkins/workspace/Test_openjdk21_hs_extended.openjdk_ppc64le_linux_rerun/aqa-tests/openjdk/openjdk-jdk/test/jdk/sun/security/ssl/X509TrustManagerImpl/distrust/Entrust.java \
[2025-02-13T06:42:02.855Z] -J-Dtest.src=/home/jenkins/workspace/Test_openjdk21_hs_extended.openjdk_ppc64le_linux_rerun/aqa-tests/openjdk/openjdk-jdk/test/jdk/sun/security/ssl/X509TrustManagerImpl/distrust \
[2025-02-13T06:42:02.855Z] -J-Dtest.src.path=/home/jenkins/workspace/Test_openjdk21_hs_extended.openjdk_ppc64le_linux_rerun/aqa-tests/openjdk/openjdk-jdk/test/jdk/sun/security/ssl/X509TrustManagerImpl/distrust:/home/jenkins/workspace/Test_openjdk21_hs_extended.openjdk_ppc64le_linux_rerun/aqa-tests/openjdk/openjdk-jdk/test/lib \
[2025-02-13T06:42:02.855Z] -J-Dtest.classes=/home/jenkins/workspace/Test_openjdk21_hs_extended.openjdk_ppc64le_linux_rerun/aqa-tests/TKG/output_17394226109969/jdk_security3_0/work/classes/0/sun/security/ssl/X509TrustManagerImpl/distrust/Entrust.d \
[2025-02-13T06:42:02.855Z] -J-Dtest.class.path=/home/jenkins/workspace/Test_openjdk21_hs_extended.openjdk_ppc64le_linux_rerun/aqa-tests/TKG/output_17394226109969/jdk_security3_0/work/classes/0/sun/security/ssl/X509TrustManagerImpl/distrust/Entrust.d:/home/jenkins/workspace/Test_openjdk21_hs_extended.openjdk_ppc64le_linux_rerun/aqa-tests/TKG/output_17394226109969/jdk_security3_0/work/classes/0/test/lib \
[2025-02-13T06:42:02.855Z] -J-Dtest.class.path.prefix=/home/jenkins/workspace/Test_openjdk21_hs_extended.openjdk_ppc64le_linux_rerun/aqa-tests/TKG/output_17394226109969/jdk_security3_0/work/classes/0/sun/security/ssl/X509TrustManagerImpl/distrust/Entrust.d:/home/jenkins/workspace/Test_openjdk21_hs_extended.openjdk_ppc64le_linux_rerun/aqa-tests/openjdk/openjdk-jdk/test/jdk/sun/security/ssl/X509TrustManagerImpl/distrust:/home/jenkins/workspace/Test_openjdk21_hs_extended.openjdk_ppc64le_linux_rerun/aqa-tests/TKG/output_17394226109969/jdk_security3_0/work/classes/0/test/lib \
[2025-02-13T06:42:02.855Z] -J-Dtest.modules=java.base/sun.security.validator \
[2025-02-13T06:42:02.855Z] --add-modules java.base \
[2025-02-13T06:42:02.855Z] --add-exports java.base/sun.security.validator=ALL-UNNAMED \
[2025-02-13T06:42:02.855Z] -d /home/jenkins/workspace/Test_openjdk21_hs_extended.openjdk_ppc64le_linux_rerun/aqa-tests/TKG/output_17394226109969/jdk_security3_0/work/classes/0/sun/security/ssl/X509TrustManagerImpl/distrust/Entrust.d \
[2025-02-13T06:42:02.855Z] -sourcepath /home/jenkins/workspace/Test_openjdk21_hs_extended.openjdk_ppc64le_linux_rerun/aqa-tests/openjdk/openjdk-jdk/test/jdk/sun/security/ssl/X509TrustManagerImpl/distrust:/home/jenkins/workspace/Test_openjdk21_hs_extended.openjdk_ppc64le_linux_rerun/aqa-tests/openjdk/openjdk-jdk/test/lib \
[2025-02-13T06:42:02.855Z] -classpath /home/jenkins/workspace/Test_openjdk21_hs_extended.openjdk_ppc64le_linux_rerun/aqa-tests/openjdk/openjdk-jdk/test/jdk/sun/security/ssl/X509TrustManagerImpl/distrust:/home/jenkins/workspace/Test_openjdk21_hs_extended.openjdk_ppc64le_linux_rerun/aqa-tests/TKG/output_17394226109969/jdk_security3_0/work/classes/0/sun/security/ssl/X509TrustManagerImpl/distrust/Entrust.d:/home/jenkins/workspace/Test_openjdk21_hs_extended.openjdk_ppc64le_linux_rerun/aqa-tests/TKG/output_17394226109969/jdk_security3_0/work/classes/0/test/lib /home/jenkins/workspace/Test_openjdk21_hs_extended.openjdk_ppc64le_linux_rerun/aqa-tests/openjdk/openjdk-jdk/test/jdk/sun/security/ssl/X509TrustManagerImpl/distrust/Entrust.java
[2025-02-13T06:42:02.855Z] direct:
[2025-02-13T06:42:02.855Z] Note: /home/jenkins/workspace/Test_openjdk21_hs_extended.openjdk_ppc64le_linux_rerun/aqa-tests/openjdk/openjdk-jdk/test/jdk/sun/security/ssl/X509TrustManagerImpl/distrust/Distrust.java uses or overrides a deprecated API.
[2025-02-13T06:42:02.855Z] Note: Recompile with -Xlint:deprecation for details.
[2025-02-13T06:42:02.855Z] Note: /home/jenkins/workspace/Test_openjdk21_hs_extended.openjdk_ppc64le_linux_rerun/aqa-tests/openjdk/openjdk-jdk/test/jdk/sun/security/ssl/X509TrustManagerImpl/distrust/Distrust.java uses unchecked or unsafe operations.
[2025-02-13T06:42:02.855Z] Note: Recompile with -Xlint:unchecked for details.
[2025-02-13T06:42:02.855Z]
[2025-02-13T06:42:02.855Z] ACTION: main -- Failed. Execution failed: `main' threw exception: java.lang.RuntimeException: Unexpected exception: sun.security.validator.ValidatorException: PKIX path building failed: sun.security.provider.certpath.SunCertPathBuilderException: unable to find valid certification path to requested target
[2025-02-13T06:42:02.855Z] REASON: User specified action: run main/othervm Entrust after policyOn invalid
[2025-02-13T06:42:02.855Z] TIME: 1.169 seconds
[2025-02-13T06:42:02.855Z] messages:
[2025-02-13T06:42:02.855Z] command: main Entrust after policyOn invalid
[2025-02-13T06:42:02.855Z] reason: User specified action: run main/othervm Entrust after policyOn invalid
[2025-02-13T06:42:02.855Z] started: Thu Feb 13 06:41:51 UTC 2025
[2025-02-13T06:42:02.855Z] Mode: othervm [/othervm specified]
[2025-02-13T06:42:02.855Z] Additional options from @modules: --add-modules java.base --add-exports java.base/sun.security.validator=ALL-UNNAMED
[2025-02-13T06:42:02.855Z] finished: Thu Feb 13 06:41:52 UTC 2025
[2025-02-13T06:42:02.855Z] elapsed time (seconds): 1.169
[2025-02-13T06:42:02.855Z] configuration:
[2025-02-13T06:42:02.855Z] Boot Layer
[2025-02-13T06:42:02.855Z] add modules: java.base
[2025-02-13T06:42:02.855Z] add exports: java.base/sun.security.validator ALL-UNNAMED
[2025-02-13T06:42:02.855Z]
[2025-02-13T06:42:02.855Z] STDOUT:
[2025-02-13T06:42:02.855Z] STDERR:
[2025-02-13T06:42:02.855Z] Testing entrustevca
[2025-02-13T06:42:02.855Z] Testing entrustrootcaec1
[2025-02-13T06:42:02.855Z] Testing entrustrootcag2
[2025-02-13T06:42:02.855Z] Testing entrustrootcag4
[2025-02-13T06:42:02.855Z] sun.security.validator.ValidatorException: PKIX path building failed: sun.security.provider.certpath.SunCertPathBuilderException: unable to find valid certification path to requested target
[2025-02-13T06:42:02.855Z] at java.base/sun.security.validator.PKIXValidator.doBuild(PKIXValidator.java:388)
[2025-02-13T06:42:02.855Z] at java.base/sun.security.validator.PKIXValidator.engineValidate(PKIXValidator.java:271)
[2025-02-13T06:42:02.856Z] at java.base/sun.security.validator.Validator.validate(Validator.java:256)
[2025-02-13T06:42:02.856Z] at java.base/sun.security.ssl.X509TrustManagerImpl.checkTrusted(X509TrustManagerImpl.java:241)
[2025-02-13T06:42:02.856Z] at java.base/sun.security.ssl.X509TrustManagerImpl.checkServerTrusted(X509TrustManagerImpl.java:113)
[2025-02-13T06:42:02.856Z] at Distrust.testTM(Distrust.java:125)
[2025-02-13T06:42:02.856Z] at Distrust.testCertificateChain(Distrust.java:82)
[2025-02-13T06:42:02.856Z] at Entrust.main(Entrust.java:66)
[2025-02-13T06:42:02.856Z] at java.base/jdk.internal.reflect.DirectMethodHandleAccessor.invoke(DirectMethodHandleAccessor.java:103)
[2025-02-13T06:42:02.856Z] at java.base/java.lang.reflect.Method.invoke(Method.java:580)
[2025-02-13T06:42:02.856Z] at com.sun.javatest.regtest.agent.MainWrapper$MainTask.run(MainWrapper.java:138)
[2025-02-13T06:42:02.856Z] at java.base/java.lang.Thread.run(Thread.java:1583)
[2025-02-13T06:42:02.856Z] Caused by: sun.security.provider.certpath.SunCertPathBuilderException: unable to find valid certification path to requested target
[2025-02-13T06:42:02.856Z] at java.base/sun.security.provider.certpath.SunCertPathBuilder.build(SunCertPathBuilder.java:148)
[2025-02-13T06:42:02.856Z] at java.base/sun.security.provider.certpath.SunCertPathBuilder.engineBuild(SunCertPathBuilder.java:129)
[2025-02-13T06:42:02.856Z] at java.base/java.security.cert.CertPathBuilder.build(CertPathBuilder.java:297)
[2025-02-13T06:42:02.856Z] at java.base/sun.security.validator.PKIXValidator.doBuild(PKIXValidator.java:383)
[2025-02-13T06:42:02.856Z] ... 11 more
[2025-02-13T06:42:02.856Z] java.lang.RuntimeException: Unexpected exception: sun.security.validator.ValidatorException: PKIX path building failed: sun.security.provider.certpath.SunCertPathBuilderException: unable to find valid certification path to requested target
[2025-02-13T06:42:02.856Z] at Distrust.testTM(Distrust.java:138)
[2025-02-13T06:42:02.856Z] at Distrust.testCertificateChain(Distrust.java:82)
[2025-02-13T06:42:02.856Z] at Entrust.main(Entrust.java:66)
[2025-02-13T06:42:02.856Z] at java.base/jdk.internal.reflect.DirectMethodHandleAccessor.invoke(DirectMethodHandleAccessor.java:103)
[2025-02-13T06:42:02.856Z] at java.base/java.lang.reflect.Method.invoke(Method.java:580)
[2025-02-13T06:42:02.856Z] at com.sun.javatest.regtest.agent.MainWrapper$MainTask.run(MainWrapper.java:138)
[2025-02-13T06:42:02.856Z] at java.base/java.lang.Thread.run(Thread.java:1583)
[2025-02-13T06:42:02.856Z]
[2025-02-13T06:42:02.856Z] JavaTest Message: Test threw exception: java.lang.RuntimeException: Unexpected exception: sun.security.validator.ValidatorException: PKIX path building failed: sun.security.provider.certpath.SunCertPathBuilderException: unable to find valid certification path to requested target
[2025-02-13T06:42:02.856Z] JavaTest Message: shutting down test
[2025-02-13T06:42:02.856Z]
[2025-02-13T06:42:02.856Z] STATUS:Failed.`main' threw exception: java.lang.RuntimeException: Unexpected exception: sun.security.validator.ValidatorException: PKIX path building failed: sun.security.provider.certpath.SunCertPathBuilderException: unable to find valid certification path to requested target
[2025-02-13T06:42:02.856Z] rerun:
[2025-02-13T06:42:02.856Z] cd /home/jenkins/workspace/Test_openjdk21_hs_extended.openjdk_ppc64le_linux_rerun/aqa-tests/TKG/output_17394226109969/jdk_security3_0/work/scratch/0 && \
[2025-02-13T06:42:02.856Z] DISPLAY=:0 \
[2025-02-13T06:42:02.856Z] HOME=/home/jenkins \
[2025-02-13T06:42:02.856Z] LANG=C.utf8 \
[2025-02-13T06:42:02.856Z] PATH=/bin:/usr/bin:/usr/sbin \
[2025-02-13T06:42:02.856Z] CLASSPATH=/home/jenkins/workspace/Test_openjdk21_hs_extended.openjdk_ppc64le_linux_rerun/aqa-tests/TKG/output_17394226109969/jdk_security3_0/work/classes/0/sun/security/ssl/X509TrustManagerImpl/distrust/Entrust.d:/home/jenkins/workspace/Test_openjdk21_hs_extended.openjdk_ppc64le_linux_rerun/aqa-tests/openjdk/openjdk-jdk/test/jdk/sun/security/ssl/X509TrustManagerImpl/distrust:/home/jenkins/workspace/Test_openjdk21_hs_extended.openjdk_ppc64le_linux_rerun/aqa-tests/TKG/output_17394226109969/jdk_security3_0/work/classes/0/test/lib:/home/jenkins/workspace/Test_openjdk21_hs_extended.openjdk_ppc64le_linux_rerun/aqa-tests/openjdk/openjdk-jdk/test/lib:/home/jenkins/workspace/Test_openjdk21_hs_extended.openjdk_ppc64le_linux_rerun/jvmtest/openjdk/jtreg/lib/javatest.jar:/home/jenkins/workspace/Test_openjdk21_hs_extended.openjdk_ppc64le_linux_rerun/jvmtest/openjdk/jtreg/lib/jtreg.jar \
[2025-02-13T06:42:02.856Z] /home/jenkins/workspace/Test_openjdk21_hs_extended.openjdk_ppc64le_linux_rerun/jdkbinary/j2sdk-image/bin/java \
[2025-02-13T06:42:02.856Z] -Dtest.vm.opts='-ea -esa -Xmx512m -XX:+UseCompressedOops' \
[2025-02-13T06:42:02.856Z] -Dtest.tool.vm.opts='-J-ea -J-esa -J-Xmx512m -J-XX:+UseCompressedOops' \
[2025-02-13T06:42:02.856Z] -Dtest.compiler.opts= \
[2025-02-13T06:42:02.856Z] -Dtest.java.opts= \
[2025-02-13T06:42:02.856Z] -Dtest.jdk=/home/jenkins/workspace/Test_openjdk21_hs_extended.openjdk_ppc64le_linux_rerun/jdkbinary/j2sdk-image \
[2025-02-13T06:42:02.856Z] -Dcompile.jdk=/home/jenkins/workspace/Test_openjdk21_hs_extended.openjdk_ppc64le_linux_rerun/jdkbinary/j2sdk-image \
[2025-02-13T06:42:02.856Z] -Dtest.timeout.factor=8.0 \
[2025-02-13T06:42:02.856Z] -Dtest.nativepath=/home/jenkins/workspace/Test_openjdk21_hs_extended.openjdk_ppc64le_linux_rerun/jdkbinary/openjdk-test-image/jdk/jtreg/native \
[2025-02-13T06:42:02.856Z] -Dtest.root=/home/jenkins/workspace/Test_openjdk21_hs_extended.openjdk_ppc64le_linux_rerun/aqa-tests/openjdk/openjdk-jdk/test/jdk \
[2025-02-13T06:42:02.856Z] -Dtest.name=sun/security/ssl/X509TrustManagerImpl/distrust/Entrust.java \
[2025-02-13T06:42:02.856Z] -Dtest.file=/home/jenkins/workspace/Test_openjdk21_hs_extended.openjdk_ppc64le_linux_rerun/aqa-tests/openjdk/openjdk-jdk/test/jdk/sun/security/ssl/X509TrustManagerImpl/distrust/Entrust.java \
[2025-02-13T06:42:02.856Z] -Dtest.src=/home/jenkins/workspace/Test_openjdk21_hs_extended.openjdk_ppc64le_linux_rerun/aqa-tests/openjdk/openjdk-jdk/test/jdk/sun/security/ssl/X509TrustManagerImpl/distrust \
[2025-02-13T06:42:02.856Z] -Dtest.src.path=/home/jenkins/workspace/Test_openjdk21_hs_extended.openjdk_ppc64le_linux_rerun/aqa-tests/openjdk/openjdk-jdk/test/jdk/sun/security/ssl/X509TrustManagerImpl/distrust:/home/jenkins/workspace/Test_openjdk21_hs_extended.openjdk_ppc64le_linux_rerun/aqa-tests/openjdk/openjdk-jdk/test/lib \
[2025-02-13T06:42:02.856Z] -Dtest.classes=/home/jenkins/workspace/Test_openjdk21_hs_extended.openjdk_ppc64le_linux_rerun/aqa-tests/TKG/output_17394226109969/jdk_security3_0/work/classes/0/sun/security/ssl/X509TrustManagerImpl/distrust/Entrust.d \
[2025-02-13T06:42:02.856Z] -Dtest.class.path=/home/jenkins/workspace/Test_openjdk21_hs_extended.openjdk_ppc64le_linux_rerun/aqa-tests/TKG/output_17394226109969/jdk_security3_0/work/classes/0/sun/security/ssl/X509TrustManagerImpl/distrust/Entrust.d:/home/jenkins/workspace/Test_openjdk21_hs_extended.openjdk_ppc64le_linux_rerun/aqa-tests/TKG/output_17394226109969/jdk_security3_0/work/classes/0/test/lib \
[2025-02-13T06:42:02.856Z] -Dtest.class.path.prefix=/home/jenkins/workspace/Test_openjdk21_hs_extended.openjdk_ppc64le_linux_rerun/aqa-tests/TKG/output_17394226109969/jdk_security3_0/work/classes/0/sun/security/ssl/X509TrustManagerImpl/distrust/Entrust.d:/home/jenkins/workspace/Test_openjdk21_hs_extended.openjdk_ppc64le_linux_rerun/aqa-tests/openjdk/openjdk-jdk/test/jdk/sun/security/ssl/X509TrustManagerImpl/distrust:/home/jenkins/workspace/Test_openjdk21_hs_extended.openjdk_ppc64le_linux_rerun/aqa-tests/TKG/output_17394226109969/jdk_security3_0/work/classes/0/test/lib \
[2025-02-13T06:42:02.856Z] -Dtest.modules=java.base/sun.security.validator \
[2025-02-13T06:42:02.856Z] --add-modules java.base \
[2025-02-13T06:42:02.856Z] --add-exports java.base/sun.security.validator=ALL-UNNAMED \
[2025-02-13T06:42:02.856Z] -ea \
[2025-02-13T06:42:02.856Z] -esa \
[2025-02-13T06:42:02.856Z] -Xmx512m \
[2025-02-13T06:42:02.856Z] -XX:+UseCompressedOops \
[2025-02-13T06:42:02.856Z] -Djava.library.path=/home/jenkins/workspace/Test_openjdk21_hs_extended.openjdk_ppc64le_linux_rerun/jdkbinary/openjdk-test-image/jdk/jtreg/native \
[2025-02-13T06:42:02.856Z] com.sun.javatest.regtest.agent.MainWrapper /home/jenkins/workspace/Test_openjdk21_hs_extended.openjdk_ppc64le_linux_rerun/aqa-tests/TKG/output_17394226109969/jdk_security3_0/work/sun/security/ssl/X509TrustManagerImpl/distrust/Entrust.d/main.0.jta after policyOn invalid
[2025-02-13T06:42:02.856Z]
[2025-02-13T06:42:02.856Z] TEST RESULT: Failed. Execution failed: `main' threw exception: java.lang.RuntimeException: Unexpected exception: sun.security.validator.ValidatorException: PKIX path building failed: sun.security.provider.certpath.SunCertPathBuilderException: unable to find valid certification path to requested target
[2025-02-13T06:42:02.856Z] --------------------------------------------------
[2025-02-13T07:01:48.936Z] Test results: passed: 940; failed: 1
[2025-02-13T07:02:05.038Z] Report written to /home/jenkins/workspace/Test_openjdk21_hs_extended.openjdk_ppc64le_linux_rerun/aqa-tests/TKG/output_17394226109969/jdk_security3_0/report/html/report.html
[2025-02-13T07:02:05.038Z] Results written to /home/jenkins/workspace/Test_openjdk21_hs_extended.openjdk_ppc64le_linux_rerun/aqa-tests/TKG/output_17394226109969/jdk_security3_0/work
[2025-02-13T07:02:05.038Z] Error: Some tests failed or other problems occurred.
[2025-02-13T07:02:05.038Z] -----------------------------------
[2025-02-13T07:02:05.038Z] jdk_security3_0_FAILED
[2025-02-13T07:02:05.038Z] -----------------------------------
[2025-02-13T07:02:05.038Z]
[2025-02-13T07:02:05.038Z] TEST TEARDOWN:
[2025-02-13T07:02:05.038Z] Nothing to be done for teardown.
[2025-02-13T07:02:05.038Z] jdk_security3_0 Finish Time: Thu Feb 13 07:02:04 2025 Epoch Time (ms): 1739430124543