jdk_beans_0
[2024-11-28T08:51:31.675Z] Running test jdk_beans_0 ...
[2024-11-28T08:51:31.675Z] ===============================================
[2024-11-28T08:51:31.675Z] jdk_beans_0 Start Time: Thu Nov 28 08:51:21 2024 Epoch Time (ms): 1732783881622
[2024-11-28T08:51:31.675Z] variation: Mode150
[2024-11-28T08:51:31.675Z] JVM_OPTIONS: -XX:+UseCompressedOops
[2024-11-28T08:51:31.675Z] { \
[2024-11-28T08:51:31.675Z] echo ""; echo "TEST SETUP:"; \
[2024-11-28T08:51:31.675Z] echo "Nothing to be done for setup."; \
[2024-11-28T08:51:31.675Z] mkdir -p "C:/jenkins/workspace/Test_openjdk21_hs_extended.openjdk_x86-64_windows_testList_0/aqa-tests/\\TKG\\output_17327770449218\\jdk_beans_0"; \
[2024-11-28T08:51:31.675Z] cd "C:/jenkins/workspace/Test_openjdk21_hs_extended.openjdk_x86-64_windows_testList_0/aqa-tests/\\TKG\\output_17327770449218\\jdk_beans_0"; \
[2024-11-28T08:51:31.675Z] echo ""; echo "TESTING:"; \
[2024-11-28T08:51:31.675Z] "c:/jenkins/workspace/Test_openjdk21_hs_extended.openjdk_x86-64_windows_testList_0/jdkbinary/j2sdk-image\\bin\\java" -Xmx512m -jar "C:/jenkins/workspace/Test_openjdk21_hs_extended.openjdk_x86-64_windows_testList_0/aqa-tests///..//jvmtest\\openjdk\\jtreg\\lib\\jtreg.jar" \
[2024-11-28T08:51:31.675Z] -agentvm -a -ea -esa -v:fail,error,time,nopass -retain:fail,error,*.dmp,javacore.*,heapdump.*,*.trc -ignore:quiet -timeoutFactor:8 -xml:verify -concurrency:3 -nativepath:"c:\jenkins\workspace\Test_openjdk21_hs_extended.openjdk_x86-64_windows_testList_0/jdkbinary/openjdk-test-image\\jdk\\jtreg\\native" -vmoptions:"-Xmx512m -XX:+UseCompressedOops " \
[2024-11-28T08:51:31.675Z] -w ""C:/jenkins/workspace/Test_openjdk21_hs_extended.openjdk_x86-64_windows_testList_0/aqa-tests/\\TKG\\output_17327770449218\\jdk_beans_0"\\work" \
[2024-11-28T08:51:31.675Z] -r ""C:/jenkins/workspace/Test_openjdk21_hs_extended.openjdk_x86-64_windows_testList_0/aqa-tests/\\TKG\\output_17327770449218\\jdk_beans_0"\\report" \
[2024-11-28T08:51:31.675Z] -jdk:"c:/jenkins/workspace/Test_openjdk21_hs_extended.openjdk_x86-64_windows_testList_0/jdkbinary/j2sdk-image" \
[2024-11-28T08:51:31.675Z] -exclude:"C:/jenkins/workspace/Test_openjdk21_hs_extended.openjdk_x86-64_windows_testList_0/aqa-tests/\\openjdk\\openjdk-jdk\\test\\jdk\\ProblemList.txt" \
[2024-11-28T08:51:31.675Z] -exclude:"C:/jenkins/workspace/Test_openjdk21_hs_extended.openjdk_x86-64_windows_testList_0/aqa-tests///..//jvmtest\\openjdk\\excludes/ProblemList_openjdk21.txt" \
[2024-11-28T08:51:31.675Z] \
[2024-11-28T08:51:31.675Z] -exclude:"C:/jenkins/workspace/Test_openjdk21_hs_extended.openjdk_x86-64_windows_testList_0/aqa-tests/\\openjdk\\excludes\\vendors\\eclipse\\ProblemList_openjdk21.txt" \
[2024-11-28T08:51:31.675Z] "C:/jenkins/workspace/Test_openjdk21_hs_extended.openjdk_x86-64_windows_testList_0/aqa-tests/\\openjdk\\openjdk-jdk\\test\\jdk:jdk_beans"; \
[2024-11-28T08:51:31.675Z] if [ $? -eq 0 ]; then echo "-----------------------------------"; echo "jdk_beans_0""_PASSED"; echo "-----------------------------------"; cd C:/jenkins/workspace/Test_openjdk21_hs_extended.openjdk_x86-64_windows_testList_0/aqa-tests/; else echo "-----------------------------------"; echo "jdk_beans_0""_FAILED"; echo "-----------------------------------"; fi; \
[2024-11-28T08:51:31.675Z] echo ""; echo "TEST TEARDOWN:"; \
[2024-11-28T08:51:31.675Z] echo "Nothing to be done for teardown."; \
[2024-11-28T08:51:31.675Z] } 2>&1 | tee -a "C:/jenkins/workspace/Test_openjdk21_hs_extended.openjdk_x86-64_windows_testList_0/aqa-tests/\\TKG\\output_17327770449218\\TestTargetResult";
[2024-11-28T08:51:31.675Z]
[2024-11-28T08:51:31.675Z] TEST SETUP:
[2024-11-28T08:51:31.675Z] Nothing to be done for setup.
[2024-11-28T08:51:31.675Z]
[2024-11-28T08:51:31.675Z] TESTING:
[2024-11-28T08:51:31.675Z] Directory "C:\jenkins\workspace\Test_openjdk21_hs_extended.openjdk_x86-64_windows_testList_0\aqa-tests\TKG\output_17327770449218\jdk_beans_0\work" not found: creating
[2024-11-28T08:51:31.675Z] Directory "C:\jenkins\workspace\Test_openjdk21_hs_extended.openjdk_x86-64_windows_testList_0\aqa-tests\TKG\output_17327770449218\jdk_beans_0\report" not found: creating
[2024-11-28T08:51:31.676Z] XML output with verification to C:\Jenkins\workspace\Test_openjdk21_hs_extended.openjdk_x86-64_windows_testList_0\aqa-tests\TKG\output_17327770449218\jdk_beans_0\work
[2024-11-28T08:53:25.012Z] --------------------------------------------------
[2024-11-28T08:53:25.012Z] TEST: java/beans/PropertyEditor/6380849/TestPropertyEditor.java
[2024-11-28T08:53:25.012Z] TEST JDK: c:\jenkins\workspace\Test_openjdk21_hs_extended.openjdk_x86-64_windows_testList_0\jdkbinary\j2sdk-image
[2024-11-28T08:53:25.012Z]
[2024-11-28T08:53:25.012Z] ACTION: compile -- Passed. Compilation successful
[2024-11-28T08:53:25.012Z] REASON: User specified action: run compile -XDignore.symbol.file TestPropertyEditor.java
[2024-11-28T08:53:25.012Z] TIME: 2.295 seconds
[2024-11-28T08:53:25.012Z] messages:
[2024-11-28T08:53:25.012Z] command: compile -XDignore.symbol.file C:\Jenkins\workspace\Test_openjdk21_hs_extended.openjdk_x86-64_windows_testList_0\aqa-tests\openjdk\openjdk-jdk\test\jdk\java\beans\PropertyEditor\6380849\TestPropertyEditor.java
[2024-11-28T08:53:25.012Z] reason: User specified action: run compile -XDignore.symbol.file TestPropertyEditor.java
[2024-11-28T08:53:25.012Z] started: Thu Nov 28 08:53:22 UTC 2024
[2024-11-28T08:53:25.012Z] Additional options from @modules: --add-modules java.desktop --add-exports java.desktop/com.sun.beans.editors=ALL-UNNAMED
[2024-11-28T08:53:25.012Z] Mode: othervm
[2024-11-28T08:53:25.012Z] finished: Thu Nov 28 08:53:24 UTC 2024
[2024-11-28T08:53:25.012Z] elapsed time (seconds): 2.295
[2024-11-28T08:53:25.012Z] configuration:
[2024-11-28T08:53:25.012Z] javac compilation environment
[2024-11-28T08:53:25.012Z] add modules: java.desktop
[2024-11-28T08:53:25.012Z] add exports: java.desktop/com.sun.beans.editors ALL-UNNAMED
[2024-11-28T08:53:25.012Z] source path: C:\Jenkins\workspace\Test_openjdk21_hs_extended.openjdk_x86-64_windows_testList_0\aqa-tests\openjdk\openjdk-jdk\test\jdk\java\beans\PropertyEditor\6380849
[2024-11-28T08:53:25.012Z] class path: C:\Jenkins\workspace\Test_openjdk21_hs_extended.openjdk_x86-64_windows_testList_0\aqa-tests\openjdk\openjdk-jdk\test\jdk\java\beans\PropertyEditor\6380849
[2024-11-28T08:53:25.012Z] C:\Jenkins\workspace\Test_openjdk21_hs_extended.openjdk_x86-64_windows_testList_0\aqa-tests\TKG\output_17327770449218\jdk_beans_0\work\classes\1\java\beans\PropertyEditor\6380849\TestPropertyEditor.d
[2024-11-28T08:53:25.012Z]
[2024-11-28T08:53:25.012Z] rerun:
[2024-11-28T08:53:25.012Z] cd 'C:\Jenkins\workspace\Test_openjdk21_hs_extended.openjdk_x86-64_windows_testList_0\aqa-tests\TKG\output_17327770449218\jdk_beans_0\work\java\beans\PropertyEditor\6380849\TestPropertyEditor' && \
[2024-11-28T08:53:25.012Z] PATH='C:\Program Files\Java\jdk-17.0.8.1+1\bin;C:\cygwin64\bin;C:\Windows\system32;C:\Windows;C:\Windows\System32\Wbem;C:\Windows\System32\WindowsPowerShell\v1.0;C:\Windows\System32\OpenSSH;C:\Program Files\dotnet;C:\Users\adoptopenjdk\AppData\Local\Microsoft\WindowsApps;C:\Strawberry\perl\bin;C:\Program Files\Git\cmd;C:\openjdk\jdk-8\bin;C:\apache-ant\apache-ant-1.10.15\bin;C:\Program Files (x86)\IncrediBuild;C:\Program Files (x86)\Windows Kits\10\Windows Performance Toolkit;C:\rust\bin;C:\Program Files\IcedTeaWEB\bin;C:\Program Files\Microsoft SQL Server\110\Tools\Binn;C:\Program Files (x86)\Microsoft SDKs\TypeScript\1.0;C:\Program Files\Microsoft SQL Server\120\Tools\Binn;C:\Users\jenkins\AppData\Local\Microsoft\WindowsApps' \
[2024-11-28T08:53:25.012Z] SystemDrive=C: \
[2024-11-28T08:53:25.012Z] SystemRoot='C:\Windows' \
[2024-11-28T08:53:25.012Z] TEMP='C:\Users\jenkins\AppData\Local\Temp\3' \
[2024-11-28T08:53:25.012Z] TMP='C:\Users\jenkins\AppData\Local\Temp\3' \
[2024-11-28T08:53:25.013Z] windir='C:\Windows' \
[2024-11-28T08:53:25.013Z] 'c:\jenkins\workspace\Test_openjdk21_hs_extended.openjdk_x86-64_windows_testList_0\jdkbinary\j2sdk-image\bin\javac' \
[2024-11-28T08:53:25.013Z] -J-ea \
[2024-11-28T08:53:25.013Z] -J-esa \
[2024-11-28T08:53:25.013Z] -J-Xmx512m \
[2024-11-28T08:53:25.013Z] -J-XX:+UseCompressedOops \
[2024-11-28T08:53:25.013Z] -J-Dtest.vm.opts='-ea -esa -Xmx512m -XX:+UseCompressedOops' \
[2024-11-28T08:53:25.013Z] -J-Dtest.tool.vm.opts='-J-ea -J-esa -J-Xmx512m -J-XX:+UseCompressedOops' \
[2024-11-28T08:53:25.013Z] -J-Dtest.compiler.opts= \
[2024-11-28T08:53:25.013Z] -J-Dtest.java.opts= \
[2024-11-28T08:53:25.013Z] -J-Dtest.jdk='c:\jenkins\workspace\Test_openjdk21_hs_extended.openjdk_x86-64_windows_testList_0\jdkbinary\j2sdk-image' \
[2024-11-28T08:53:25.013Z] -J-Dcompile.jdk='c:\jenkins\workspace\Test_openjdk21_hs_extended.openjdk_x86-64_windows_testList_0\jdkbinary\j2sdk-image' \
[2024-11-28T08:53:25.013Z] -J-Dtest.timeout.factor=8.0 \
[2024-11-28T08:53:25.013Z] -J-Dtest.nativepath='c:\jenkins\workspace\Test_openjdk21_hs_extended.openjdk_x86-64_windows_testList_0\jdkbinary\openjdk-test-image\jdk\jtreg\native' \
[2024-11-28T08:53:25.013Z] -J-Dtest.root='C:\Jenkins\workspace\Test_openjdk21_hs_extended.openjdk_x86-64_windows_testList_0\aqa-tests\openjdk\openjdk-jdk\test\jdk' \
[2024-11-28T08:53:25.013Z] -J-Dtest.name=java/beans/PropertyEditor/6380849/TestPropertyEditor.java \
[2024-11-28T08:53:25.013Z] -J-Dtest.file='C:\Jenkins\workspace\Test_openjdk21_hs_extended.openjdk_x86-64_windows_testList_0\aqa-tests\openjdk\openjdk-jdk\test\jdk\java\beans\PropertyEditor\6380849\TestPropertyEditor.java' \
[2024-11-28T08:53:25.013Z] -J-Dtest.src='C:\Jenkins\workspace\Test_openjdk21_hs_extended.openjdk_x86-64_windows_testList_0\aqa-tests\openjdk\openjdk-jdk\test\jdk\java\beans\PropertyEditor\6380849' \
[2024-11-28T08:53:25.013Z] -J-Dtest.src.path='C:\Jenkins\workspace\Test_openjdk21_hs_extended.openjdk_x86-64_windows_testList_0\aqa-tests\openjdk\openjdk-jdk\test\jdk\java\beans\PropertyEditor\6380849' \
[2024-11-28T08:53:25.013Z] -J-Dtest.classes='C:\Jenkins\workspace\Test_openjdk21_hs_extended.openjdk_x86-64_windows_testList_0\aqa-tests\TKG\output_17327770449218\jdk_beans_0\work\classes\1\java\beans\PropertyEditor\6380849\TestPropertyEditor.d' \
[2024-11-28T08:53:25.013Z] -J-Dtest.class.path='C:\Jenkins\workspace\Test_openjdk21_hs_extended.openjdk_x86-64_windows_testList_0\aqa-tests\TKG\output_17327770449218\jdk_beans_0\work\classes\1\java\beans\PropertyEditor\6380849\TestPropertyEditor.d' \
[2024-11-28T08:53:25.013Z] -J-Dtest.modules=java.desktop/com.sun.beans.editors \
[2024-11-28T08:53:25.013Z] '@C:\Jenkins\workspace\Test_openjdk21_hs_extended.openjdk_x86-64_windows_testList_0\aqa-tests\TKG\output_17327770449218\jdk_beans_0\work\java\beans\PropertyEditor\6380849\TestPropertyEditor.d\compile.0.jta'
[2024-11-28T08:53:25.013Z] STDOUT:
[2024-11-28T08:53:25.013Z] STDERR:
[2024-11-28T08:53:25.013Z]
[2024-11-28T08:53:25.013Z] ACTION: build -- Passed. All files up to date
[2024-11-28T08:53:25.013Z] REASON: Named class compiled on demand
[2024-11-28T08:53:25.013Z] TIME: 0.012 seconds
[2024-11-28T08:53:25.013Z] messages:
[2024-11-28T08:53:25.013Z] command: build TestPropertyEditor
[2024-11-28T08:53:25.013Z] reason: Named class compiled on demand
[2024-11-28T08:53:25.013Z] started: Thu Nov 28 08:53:24 UTC 2024
[2024-11-28T08:53:25.013Z] finished: Thu Nov 28 08:53:24 UTC 2024
[2024-11-28T08:53:25.013Z] elapsed time (seconds): 0.012
[2024-11-28T08:53:25.013Z]
[2024-11-28T08:53:25.013Z] ACTION: main -- Failed. Execution failed: `main' threw exception: java.lang.Error: expected editor is not found
[2024-11-28T08:53:25.013Z] REASON: User specified action: run main TestPropertyEditor
[2024-11-28T08:53:25.013Z] TIME: 0.534 seconds
[2024-11-28T08:53:25.013Z] messages:
[2024-11-28T08:53:25.013Z] command: main TestPropertyEditor
[2024-11-28T08:53:25.013Z] reason: User specified action: run main TestPropertyEditor
[2024-11-28T08:53:25.013Z] started: Thu Nov 28 08:53:24 UTC 2024
[2024-11-28T08:53:25.013Z] Mode: othervm
[2024-11-28T08:53:25.013Z] Additional options from @modules: --add-modules java.desktop --add-exports java.desktop/com.sun.beans.editors=ALL-UNNAMED
[2024-11-28T08:53:25.013Z] finished: Thu Nov 28 08:53:24 UTC 2024
[2024-11-28T08:53:25.013Z] elapsed time (seconds): 0.534
[2024-11-28T08:53:25.013Z] configuration:
[2024-11-28T08:53:25.013Z] Boot Layer
[2024-11-28T08:53:25.013Z] add modules: java.desktop
[2024-11-28T08:53:25.013Z] add exports: java.desktop/com.sun.beans.editors ALL-UNNAMED
[2024-11-28T08:53:25.013Z]
[2024-11-28T08:53:25.013Z] STDOUT:
[2024-11-28T08:53:25.013Z] STDERR:
[2024-11-28T08:53:25.013Z] java.lang.Error: expected editor is not found
[2024-11-28T08:53:25.013Z] at TestPropertyEditor.test(TestPropertyEditor.java:76)
[2024-11-28T08:53:25.013Z] at TestPropertyEditor.run(TestPropertyEditor.java:106)
[2024-11-28T08:53:25.013Z] at TestPropertyEditor.main(TestPropertyEditor.java:65)
[2024-11-28T08:53:25.013Z] at java.base/jdk.internal.reflect.DirectMethodHandleAccessor.invoke(DirectMethodHandleAccessor.java:103)
[2024-11-28T08:53:25.013Z] at java.base/java.lang.reflect.Method.invoke(Method.java:580)
[2024-11-28T08:53:25.013Z] at com.sun.javatest.regtest.agent.MainWrapper$MainTask.run(MainWrapper.java:138)
[2024-11-28T08:53:25.013Z] at java.base/java.lang.Thread.run(Thread.java:1583)
[2024-11-28T08:53:25.013Z]
[2024-11-28T08:53:25.013Z] JavaTest Message: Test threw exception: java.lang.Error: expected editor is not found
[2024-11-28T08:53:25.013Z] JavaTest Message: shutting down test
[2024-11-28T08:53:25.013Z]
[2024-11-28T08:53:25.013Z] STATUS:Failed.`main' threw exception: java.lang.Error: expected editor is not found
[2024-11-28T08:53:25.013Z] rerun:
[2024-11-28T08:53:25.013Z] cd 'C:\Jenkins\workspace\Test_openjdk21_hs_extended.openjdk_x86-64_windows_testList_0\aqa-tests\TKG\output_17327770449218\jdk_beans_0\work\java\beans\PropertyEditor\6380849\TestPropertyEditor' && \
[2024-11-28T08:53:25.013Z] PATH='C:\Program Files\Java\jdk-17.0.8.1+1\bin;C:\cygwin64\bin;C:\Windows\system32;C:\Windows;C:\Windows\System32\Wbem;C:\Windows\System32\WindowsPowerShell\v1.0;C:\Windows\System32\OpenSSH;C:\Program Files\dotnet;C:\Users\adoptopenjdk\AppData\Local\Microsoft\WindowsApps;C:\Strawberry\perl\bin;C:\Program Files\Git\cmd;C:\openjdk\jdk-8\bin;C:\apache-ant\apache-ant-1.10.15\bin;C:\Program Files (x86)\IncrediBuild;C:\Program Files (x86)\Windows Kits\10\Windows Performance Toolkit;C:\rust\bin;C:\Program Files\IcedTeaWEB\bin;C:\Program Files\Microsoft SQL Server\110\Tools\Binn;C:\Program Files (x86)\Microsoft SDKs\TypeScript\1.0;C:\Program Files\Microsoft SQL Server\120\Tools\Binn;C:\Users\jenkins\AppData\Local\Microsoft\WindowsApps' \
[2024-11-28T08:53:25.013Z] SystemDrive=C: \
[2024-11-28T08:53:25.014Z] SystemRoot='C:\Windows' \
[2024-11-28T08:53:25.014Z] TEMP='C:\Users\jenkins\AppData\Local\Temp\3' \
[2024-11-28T08:53:25.014Z] TMP='C:\Users\jenkins\AppData\Local\Temp\3' \
[2024-11-28T08:53:25.014Z] windir='C:\Windows' \
[2024-11-28T08:53:25.014Z] CLASSPATH='C:\Jenkins\workspace\Test_openjdk21_hs_extended.openjdk_x86-64_windows_testList_0\aqa-tests\TKG\output_17327770449218\jdk_beans_0\work\classes\1\java\beans\PropertyEditor\6380849\TestPropertyEditor.d;C:\Jenkins\workspace\Test_openjdk21_hs_extended.openjdk_x86-64_windows_testList_0\aqa-tests\openjdk\openjdk-jdk\test\jdk\java\beans\PropertyEditor\6380849;C:\Jenkins\workspace\Test_openjdk21_hs_extended.openjdk_x86-64_windows_testList_0\jvmtest\openjdk\jtreg\lib\javatest.jar;C:\Jenkins\workspace\Test_openjdk21_hs_extended.openjdk_x86-64_windows_testList_0\jvmtest\openjdk\jtreg\lib\jtreg.jar' \
[2024-11-28T08:53:25.014Z] 'c:\jenkins\workspace\Test_openjdk21_hs_extended.openjdk_x86-64_windows_testList_0\jdkbinary\j2sdk-image\bin\java' \
[2024-11-28T08:53:25.014Z] -Dtest.vm.opts='-ea -esa -Xmx512m -XX:+UseCompressedOops' \
[2024-11-28T08:53:25.014Z] -Dtest.tool.vm.opts='-J-ea -J-esa -J-Xmx512m -J-XX:+UseCompressedOops' \
[2024-11-28T08:53:25.014Z] -Dtest.compiler.opts= \
[2024-11-28T08:53:25.014Z] -Dtest.java.opts= \
[2024-11-28T08:53:25.014Z] -Dtest.jdk='c:\jenkins\workspace\Test_openjdk21_hs_extended.openjdk_x86-64_windows_testList_0\jdkbinary\j2sdk-image' \
[2024-11-28T08:53:25.014Z] -Dcompile.jdk='c:\jenkins\workspace\Test_openjdk21_hs_extended.openjdk_x86-64_windows_testList_0\jdkbinary\j2sdk-image' \
[2024-11-28T08:53:25.014Z] -Dtest.timeout.factor=8.0 \
[2024-11-28T08:53:25.014Z] -Dtest.nativepath='c:\jenkins\workspace\Test_openjdk21_hs_extended.openjdk_x86-64_windows_testList_0\jdkbinary\openjdk-test-image\jdk\jtreg\native' \
[2024-11-28T08:53:25.014Z] -Dtest.root='C:\Jenkins\workspace\Test_openjdk21_hs_extended.openjdk_x86-64_windows_testList_0\aqa-tests\openjdk\openjdk-jdk\test\jdk' \
[2024-11-28T08:53:25.014Z] -Dtest.name=java/beans/PropertyEditor/6380849/TestPropertyEditor.java \
[2024-11-28T08:53:25.014Z] -Dtest.file='C:\Jenkins\workspace\Test_openjdk21_hs_extended.openjdk_x86-64_windows_testList_0\aqa-tests\openjdk\openjdk-jdk\test\jdk\java\beans\PropertyEditor\6380849\TestPropertyEditor.java' \
[2024-11-28T08:53:25.014Z] -Dtest.src='C:\Jenkins\workspace\Test_openjdk21_hs_extended.openjdk_x86-64_windows_testList_0\aqa-tests\openjdk\openjdk-jdk\test\jdk\java\beans\PropertyEditor\6380849' \
[2024-11-28T08:53:25.014Z] -Dtest.src.path='C:\Jenkins\workspace\Test_openjdk21_hs_extended.openjdk_x86-64_windows_testList_0\aqa-tests\openjdk\openjdk-jdk\test\jdk\java\beans\PropertyEditor\6380849' \
[2024-11-28T08:53:25.014Z] -Dtest.classes='C:\Jenkins\workspace\Test_openjdk21_hs_extended.openjdk_x86-64_windows_testList_0\aqa-tests\TKG\output_17327770449218\jdk_beans_0\work\classes\1\java\beans\PropertyEditor\6380849\TestPropertyEditor.d' \
[2024-11-28T08:53:25.014Z] -Dtest.class.path='C:\Jenkins\workspace\Test_openjdk21_hs_extended.openjdk_x86-64_windows_testList_0\aqa-tests\TKG\output_17327770449218\jdk_beans_0\work\classes\1\java\beans\PropertyEditor\6380849\TestPropertyEditor.d' \
[2024-11-28T08:53:25.014Z] -Dtest.modules=java.desktop/com.sun.beans.editors \
[2024-11-28T08:53:25.014Z] --add-modules java.desktop \
[2024-11-28T08:53:25.014Z] --add-exports java.desktop/com.sun.beans.editors=ALL-UNNAMED \
[2024-11-28T08:53:25.014Z] -ea \
[2024-11-28T08:53:25.014Z] -esa \
[2024-11-28T08:53:25.014Z] -Xmx512m \
[2024-11-28T08:53:25.014Z] -XX:+UseCompressedOops \
[2024-11-28T08:53:25.014Z] '-Djava.library.path=c:\jenkins\workspace\Test_openjdk21_hs_extended.openjdk_x86-64_windows_testList_0\jdkbinary\openjdk-test-image\jdk\jtreg\native' \
[2024-11-28T08:53:25.014Z] com.sun.javatest.regtest.agent.MainWrapper 'C:\Jenkins\workspace\Test_openjdk21_hs_extended.openjdk_x86-64_windows_testList_0\aqa-tests\TKG\output_17327770449218\jdk_beans_0\work\java\beans\PropertyEditor\6380849\TestPropertyEditor.d\main.1.jta'
[2024-11-28T08:53:25.014Z]
[2024-11-28T08:53:25.014Z] TEST RESULT: Failed. Execution failed: `main' threw exception: java.lang.Error: expected editor is not found
[2024-11-28T08:53:25.014Z] --------------------------------------------------
[2024-11-28T08:53:52.947Z] TEST: java/beans/PropertyEditor/TestColorClass.java
[2024-11-28T08:53:52.947Z] TEST JDK: c:\jenkins\workspace\Test_openjdk21_hs_extended.openjdk_x86-64_windows_testList_0\jdkbinary\j2sdk-image
[2024-11-28T08:53:52.947Z]
[2024-11-28T08:53:52.947Z] ACTION: build -- Passed. Build successful
[2024-11-28T08:53:52.947Z] REASON: Named class compiled on demand
[2024-11-28T08:53:52.947Z] TIME: 2.934 seconds
[2024-11-28T08:53:52.947Z] messages:
[2024-11-28T08:53:52.947Z] command: build TestColorClass
[2024-11-28T08:53:52.947Z] reason: Named class compiled on demand
[2024-11-28T08:53:52.947Z] started: Thu Nov 28 08:53:48 UTC 2024
[2024-11-28T08:53:52.947Z] Test directory:
[2024-11-28T08:53:52.947Z] compile: TestColorClass
[2024-11-28T08:53:52.947Z] finished: Thu Nov 28 08:53:51 UTC 2024
[2024-11-28T08:53:52.947Z] elapsed time (seconds): 2.934
[2024-11-28T08:53:52.947Z]
[2024-11-28T08:53:52.947Z] ACTION: compile -- Passed. Compilation successful
[2024-11-28T08:53:52.947Z] REASON: .class file out of date or does not exist
[2024-11-28T08:53:52.947Z] TIME: 2.933 seconds
[2024-11-28T08:53:52.947Z] messages:
[2024-11-28T08:53:52.947Z] command: compile C:\Jenkins\workspace\Test_openjdk21_hs_extended.openjdk_x86-64_windows_testList_0\aqa-tests\openjdk\openjdk-jdk\test\jdk\java\beans\PropertyEditor\TestColorClass.java
[2024-11-28T08:53:52.947Z] reason: .class file out of date or does not exist
[2024-11-28T08:53:52.947Z] started: Thu Nov 28 08:53:48 UTC 2024
[2024-11-28T08:53:52.947Z] Additional options from @modules: --add-modules java.compiler,java.desktop,jdk.compiler
[2024-11-28T08:53:52.947Z] Mode: othervm
[2024-11-28T08:53:52.947Z] finished: Thu Nov 28 08:53:51 UTC 2024
[2024-11-28T08:53:52.947Z] elapsed time (seconds): 2.933
[2024-11-28T08:53:52.947Z] configuration:
[2024-11-28T08:53:52.947Z] javac compilation environment
[2024-11-28T08:53:52.947Z] add modules: java.compiler java.desktop jdk.compiler
[2024-11-28T08:53:52.947Z] source path: C:\Jenkins\workspace\Test_openjdk21_hs_extended.openjdk_x86-64_windows_testList_0\aqa-tests\openjdk\openjdk-jdk\test\jdk\java\beans\PropertyEditor
[2024-11-28T08:53:52.947Z] class path: C:\Jenkins\workspace\Test_openjdk21_hs_extended.openjdk_x86-64_windows_testList_0\aqa-tests\openjdk\openjdk-jdk\test\jdk\java\beans\PropertyEditor
[2024-11-28T08:53:52.947Z] C:\Jenkins\workspace\Test_openjdk21_hs_extended.openjdk_x86-64_windows_testList_0\aqa-tests\TKG\output_17327770449218\jdk_beans_0\work\classes\0\java\beans\PropertyEditor\TestColorClass.d
[2024-11-28T08:53:52.947Z]
[2024-11-28T08:53:52.947Z] rerun:
[2024-11-28T08:53:52.947Z] cd 'C:\Jenkins\workspace\Test_openjdk21_hs_extended.openjdk_x86-64_windows_testList_0\aqa-tests\TKG\output_17327770449218\jdk_beans_0\work\java\beans\PropertyEditor\TestColorClass' && \
[2024-11-28T08:53:52.947Z] PATH='C:\Program Files\Java\jdk-17.0.8.1+1\bin;C:\cygwin64\bin;C:\Windows\system32;C:\Windows;C:\Windows\System32\Wbem;C:\Windows\System32\WindowsPowerShell\v1.0;C:\Windows\System32\OpenSSH;C:\Program Files\dotnet;C:\Users\adoptopenjdk\AppData\Local\Microsoft\WindowsApps;C:\Strawberry\perl\bin;C:\Program Files\Git\cmd;C:\openjdk\jdk-8\bin;C:\apache-ant\apache-ant-1.10.15\bin;C:\Program Files (x86)\IncrediBuild;C:\Program Files (x86)\Windows Kits\10\Windows Performance Toolkit;C:\rust\bin;C:\Program Files\IcedTeaWEB\bin;C:\Program Files\Microsoft SQL Server\110\Tools\Binn;C:\Program Files (x86)\Microsoft SDKs\TypeScript\1.0;C:\Program Files\Microsoft SQL Server\120\Tools\Binn;C:\Users\jenkins\AppData\Local\Microsoft\WindowsApps' \
[2024-11-28T08:53:52.947Z] SystemDrive=C: \
[2024-11-28T08:53:52.947Z] SystemRoot='C:\Windows' \
[2024-11-28T08:53:52.947Z] TEMP='C:\Users\jenkins\AppData\Local\Temp\3' \
[2024-11-28T08:53:52.947Z] TMP='C:\Users\jenkins\AppData\Local\Temp\3' \
[2024-11-28T08:53:52.947Z] windir='C:\Windows' \
[2024-11-28T08:53:52.947Z] 'c:\jenkins\workspace\Test_openjdk21_hs_extended.openjdk_x86-64_windows_testList_0\jdkbinary\j2sdk-image\bin\javac' \
[2024-11-28T08:53:52.947Z] -J-ea \
[2024-11-28T08:53:52.947Z] -J-esa \
[2024-11-28T08:53:52.947Z] -J-Xmx512m \
[2024-11-28T08:53:52.947Z] -J-XX:+UseCompressedOops \
[2024-11-28T08:53:52.947Z] -J-Dtest.vm.opts='-ea -esa -Xmx512m -XX:+UseCompressedOops' \
[2024-11-28T08:53:52.947Z] -J-Dtest.tool.vm.opts='-J-ea -J-esa -J-Xmx512m -J-XX:+UseCompressedOops' \
[2024-11-28T08:53:52.947Z] -J-Dtest.compiler.opts= \
[2024-11-28T08:53:52.947Z] -J-Dtest.java.opts= \
[2024-11-28T08:53:52.947Z] -J-Dtest.jdk='c:\jenkins\workspace\Test_openjdk21_hs_extended.openjdk_x86-64_windows_testList_0\jdkbinary\j2sdk-image' \
[2024-11-28T08:53:52.947Z] -J-Dcompile.jdk='c:\jenkins\workspace\Test_openjdk21_hs_extended.openjdk_x86-64_windows_testList_0\jdkbinary\j2sdk-image' \
[2024-11-28T08:53:52.947Z] -J-Dtest.timeout.factor=8.0 \
[2024-11-28T08:53:52.947Z] -J-Dtest.nativepath='c:\jenkins\workspace\Test_openjdk21_hs_extended.openjdk_x86-64_windows_testList_0\jdkbinary\openjdk-test-image\jdk\jtreg\native' \
[2024-11-28T08:53:52.947Z] -J-Dtest.root='C:\Jenkins\workspace\Test_openjdk21_hs_extended.openjdk_x86-64_windows_testList_0\aqa-tests\openjdk\openjdk-jdk\test\jdk' \
[2024-11-28T08:53:52.947Z] -J-Dtest.name=java/beans/PropertyEditor/TestColorClass.java \
[2024-11-28T08:53:52.947Z] -J-Dtest.file='C:\Jenkins\workspace\Test_openjdk21_hs_extended.openjdk_x86-64_windows_testList_0\aqa-tests\openjdk\openjdk-jdk\test\jdk\java\beans\PropertyEditor\TestColorClass.java' \
[2024-11-28T08:53:52.947Z] -J-Dtest.src='C:\Jenkins\workspace\Test_openjdk21_hs_extended.openjdk_x86-64_windows_testList_0\aqa-tests\openjdk\openjdk-jdk\test\jdk\java\beans\PropertyEditor' \
[2024-11-28T08:53:52.947Z] -J-Dtest.src.path='C:\Jenkins\workspace\Test_openjdk21_hs_extended.openjdk_x86-64_windows_testList_0\aqa-tests\openjdk\openjdk-jdk\test\jdk\java\beans\PropertyEditor' \
[2024-11-28T08:53:52.947Z] -J-Dtest.classes='C:\Jenkins\workspace\Test_openjdk21_hs_extended.openjdk_x86-64_windows_testList_0\aqa-tests\TKG\output_17327770449218\jdk_beans_0\work\classes\0\java\beans\PropertyEditor\TestColorClass.d' \
[2024-11-28T08:53:52.947Z] -J-Dtest.class.path='C:\Jenkins\workspace\Test_openjdk21_hs_extended.openjdk_x86-64_windows_testList_0\aqa-tests\TKG\output_17327770449218\jdk_beans_0\work\classes\0\java\beans\PropertyEditor\TestColorClass.d' \
[2024-11-28T08:53:52.947Z] -J-Dtest.modules='java.compiler java.desktop jdk.compiler' \
[2024-11-28T08:53:52.947Z] --add-modules java.compiler,java.desktop,jdk.compiler \
[2024-11-28T08:53:52.947Z] -d 'C:\Jenkins\workspace\Test_openjdk21_hs_extended.openjdk_x86-64_windows_testList_0\aqa-tests\TKG\output_17327770449218\jdk_beans_0\work\classes\0\java\beans\PropertyEditor\TestColorClass.d' \
[2024-11-28T08:53:52.947Z] -sourcepath 'C:\Jenkins\workspace\Test_openjdk21_hs_extended.openjdk_x86-64_windows_testList_0\aqa-tests\openjdk\openjdk-jdk\test\jdk\java\beans\PropertyEditor' \
[2024-11-28T08:53:52.947Z] -classpath 'C:\Jenkins\workspace\Test_openjdk21_hs_extended.openjdk_x86-64_windows_testList_0\aqa-tests\openjdk\openjdk-jdk\test\jdk\java\beans\PropertyEditor;C:\Jenkins\workspace\Test_openjdk21_hs_extended.openjdk_x86-64_windows_testList_0\aqa-tests\TKG\output_17327770449218\jdk_beans_0\work\classes\0\java\beans\PropertyEditor\TestColorClass.d' 'C:\Jenkins\workspace\Test_openjdk21_hs_extended.openjdk_x86-64_windows_testList_0\aqa-tests\openjdk\openjdk-jdk\test\jdk\java\beans\PropertyEditor\TestColorClass.java'
[2024-11-28T08:53:52.947Z] STDOUT:
[2024-11-28T08:53:52.947Z] STDERR:
[2024-11-28T08:53:52.947Z] C:\Jenkins\workspace\Test_openjdk21_hs_extended.openjdk_x86-64_windows_testList_0\aqa-tests\openjdk\openjdk-jdk\test\jdk\java\beans\PropertyEditor\TestColorClass.java:40: warning: [removal] SecurityManager in java.lang has been deprecated and marked for removal
[2024-11-28T08:53:52.947Z] System.setSecurityManager(new SecurityManager());
[2024-11-28T08:53:52.947Z] ^
[2024-11-28T08:53:52.947Z] C:\Jenkins\workspace\Test_openjdk21_hs_extended.openjdk_x86-64_windows_testList_0\aqa-tests\openjdk\openjdk-jdk\test\jdk\java\beans\PropertyEditor\TestColorClass.java:40: warning: [removal] setSecurityManager(SecurityManager) in System has been deprecated and marked for removal
[2024-11-28T08:53:52.947Z] System.setSecurityManager(new SecurityManager());
[2024-11-28T08:53:52.947Z] ^
[2024-11-28T08:53:52.947Z] Note: C:\Jenkins\workspace\Test_openjdk21_hs_extended.openjdk_x86-64_windows_testList_0\aqa-tests\openjdk\openjdk-jdk\test\jdk\java\beans\PropertyEditor\TestEditor.java uses unchecked or unsafe operations.
[2024-11-28T08:53:52.947Z] Note: Recompile with -Xlint:unchecked for details.
[2024-11-28T08:53:52.947Z] 2 warnings
[2024-11-28T08:53:52.947Z]
[2024-11-28T08:53:52.947Z] ACTION: main -- Failed. Execution failed: `main' threw exception: java.lang.Error: could not find editor for class java.awt.Color
[2024-11-28T08:53:52.947Z] REASON: User specified action: run main/othervm -Djava.security.manager=allow TestColorClass
[2024-11-28T08:53:52.947Z] TIME: 0.586 seconds
[2024-11-28T08:53:52.947Z] messages:
[2024-11-28T08:53:52.947Z] command: main -Djava.security.manager=allow TestColorClass
[2024-11-28T08:53:52.947Z] reason: User specified action: run main/othervm -Djava.security.manager=allow TestColorClass
[2024-11-28T08:53:52.947Z] started: Thu Nov 28 08:53:51 UTC 2024
[2024-11-28T08:53:52.947Z] Mode: othervm [/othervm specified]
[2024-11-28T08:53:52.947Z] Additional options from @modules: --add-modules java.compiler,java.desktop,jdk.compiler
[2024-11-28T08:53:52.947Z] finished: Thu Nov 28 08:53:52 UTC 2024
[2024-11-28T08:53:52.947Z] elapsed time (seconds): 0.586
[2024-11-28T08:53:52.947Z] configuration:
[2024-11-28T08:53:52.947Z] Boot Layer
[2024-11-28T08:53:52.947Z] add modules: java.compiler java.desktop jdk.compiler
[2024-11-28T08:53:52.947Z]
[2024-11-28T08:53:52.947Z] STDOUT:
[2024-11-28T08:53:52.947Z] Property class: class java.awt.Color
[2024-11-28T08:53:52.947Z] STDERR:
[2024-11-28T08:53:52.947Z] WARNING: A terminally deprecated method in java.lang.System has been called
[2024-11-28T08:53:52.947Z] WARNING: System::setSecurityManager has been called by TestColorClass (file:/C:/Jenkins/workspace/Test_openjdk21_hs_extended.openjdk_x86-64_windows_testList_0/aqa-tests/TKG/output_17327770449218/jdk_beans_0/work/classes/0/java/beans/PropertyEditor/TestColorClass.d/)
[2024-11-28T08:53:52.947Z] WARNING: Please consider reporting this to the maintainers of TestColorClass
[2024-11-28T08:53:52.947Z] WARNING: System::setSecurityManager will be removed in a future release
[2024-11-28T08:53:52.947Z] java.lang.Error: could not find editor for class java.awt.Color
[2024-11-28T08:53:52.947Z] at TestEditor.<init>(TestEditor.java:35)
[2024-11-28T08:53:52.947Z] at TestColorClass.main(TestColorClass.java:41)
[2024-11-28T08:53:52.947Z] at java.base/jdk.internal.reflect.DirectMethodHandleAccessor.invoke(DirectMethodHandleAccessor.java:103)
[2024-11-28T08:53:52.947Z] at java.base/java.lang.reflect.Method.invoke(Method.java:580)
[2024-11-28T08:53:52.947Z] at com.sun.javatest.regtest.agent.MainWrapper$MainTask.run(MainWrapper.java:138)
[2024-11-28T08:53:52.947Z] at java.base/java.lang.Thread.run(Thread.java:1583)
[2024-11-28T08:53:52.947Z]
[2024-11-28T08:53:52.947Z] JavaTest Message: Test threw exception: java.lang.Error: could not find editor for class java.awt.Color
[2024-11-28T08:53:52.947Z] JavaTest Message: shutting down test
[2024-11-28T08:53:52.947Z]
[2024-11-28T08:53:52.947Z] STATUS:Failed.`main' threw exception: java.lang.Error: could not find editor for class java.awt.Color
[2024-11-28T08:53:52.947Z] rerun:
[2024-11-28T08:53:52.947Z] cd 'C:\Jenkins\workspace\Test_openjdk21_hs_extended.openjdk_x86-64_windows_testList_0\aqa-tests\TKG\output_17327770449218\jdk_beans_0\work\java\beans\PropertyEditor\TestColorClass' && \
[2024-11-28T08:53:52.947Z] PATH='C:\Program Files\Java\jdk-17.0.8.1+1\bin;C:\cygwin64\bin;C:\Windows\system32;C:\Windows;C:\Windows\System32\Wbem;C:\Windows\System32\WindowsPowerShell\v1.0;C:\Windows\System32\OpenSSH;C:\Program Files\dotnet;C:\Users\adoptopenjdk\AppData\Local\Microsoft\WindowsApps;C:\Strawberry\perl\bin;C:\Program Files\Git\cmd;C:\openjdk\jdk-8\bin;C:\apache-ant\apache-ant-1.10.15\bin;C:\Program Files (x86)\IncrediBuild;C:\Program Files (x86)\Windows Kits\10\Windows Performance Toolkit;C:\rust\bin;C:\Program Files\IcedTeaWEB\bin;C:\Program Files\Microsoft SQL Server\110\Tools\Binn;C:\Program Files (x86)\Microsoft SDKs\TypeScript\1.0;C:\Program Files\Microsoft SQL Server\120\Tools\Binn;C:\Users\jenkins\AppData\Local\Microsoft\WindowsApps' \
[2024-11-28T08:53:52.947Z] SystemDrive=C: \
[2024-11-28T08:53:52.947Z] SystemRoot='C:\Windows' \
[2024-11-28T08:53:52.947Z] TEMP='C:\Users\jenkins\AppData\Local\Temp\3' \
[2024-11-28T08:53:52.947Z] TMP='C:\Users\jenkins\AppData\Local\Temp\3' \
[2024-11-28T08:53:52.947Z] windir='C:\Windows' \
[2024-11-28T08:53:52.948Z] CLASSPATH='C:\Jenkins\workspace\Test_openjdk21_hs_extended.openjdk_x86-64_windows_testList_0\aqa-tests\TKG\output_17327770449218\jdk_beans_0\work\classes\0\java\beans\PropertyEditor\TestColorClass.d;C:\Jenkins\workspace\Test_openjdk21_hs_extended.openjdk_x86-64_windows_testList_0\aqa-tests\openjdk\openjdk-jdk\test\jdk\java\beans\PropertyEditor;C:\Jenkins\workspace\Test_openjdk21_hs_extended.openjdk_x86-64_windows_testList_0\jvmtest\openjdk\jtreg\lib\javatest.jar;C:\Jenkins\workspace\Test_openjdk21_hs_extended.openjdk_x86-64_windows_testList_0\jvmtest\openjdk\jtreg\lib\jtreg.jar' \
[2024-11-28T08:53:52.948Z] 'c:\jenkins\workspace\Test_openjdk21_hs_extended.openjdk_x86-64_windows_testList_0\jdkbinary\j2sdk-image\bin\java' \
[2024-11-28T08:53:52.948Z] -Dtest.vm.opts='-ea -esa -Xmx512m -XX:+UseCompressedOops' \
[2024-11-28T08:53:52.948Z] -Dtest.tool.vm.opts='-J-ea -J-esa -J-Xmx512m -J-XX:+UseCompressedOops' \
[2024-11-28T08:53:52.948Z] -Dtest.compiler.opts= \
[2024-11-28T08:53:52.948Z] -Dtest.java.opts= \
[2024-11-28T08:53:52.948Z] -Dtest.jdk='c:\jenkins\workspace\Test_openjdk21_hs_extended.openjdk_x86-64_windows_testList_0\jdkbinary\j2sdk-image' \
[2024-11-28T08:53:52.948Z] -Dcompile.jdk='c:\jenkins\workspace\Test_openjdk21_hs_extended.openjdk_x86-64_windows_testList_0\jdkbinary\j2sdk-image' \
[2024-11-28T08:53:52.948Z] -Dtest.timeout.factor=8.0 \
[2024-11-28T08:53:52.948Z] -Dtest.nativepath='c:\jenkins\workspace\Test_openjdk21_hs_extended.openjdk_x86-64_windows_testList_0\jdkbinary\openjdk-test-image\jdk\jtreg\native' \
[2024-11-28T08:53:52.948Z] -Dtest.root='C:\Jenkins\workspace\Test_openjdk21_hs_extended.openjdk_x86-64_windows_testList_0\aqa-tests\openjdk\openjdk-jdk\test\jdk' \
[2024-11-28T08:53:52.948Z] -Dtest.name=java/beans/PropertyEditor/TestColorClass.java \
[2024-11-28T08:53:52.948Z] -Dtest.file='C:\Jenkins\workspace\Test_openjdk21_hs_extended.openjdk_x86-64_windows_testList_0\aqa-tests\openjdk\openjdk-jdk\test\jdk\java\beans\PropertyEditor\TestColorClass.java' \
[2024-11-28T08:53:52.948Z] -Dtest.src='C:\Jenkins\workspace\Test_openjdk21_hs_extended.openjdk_x86-64_windows_testList_0\aqa-tests\openjdk\openjdk-jdk\test\jdk\java\beans\PropertyEditor' \
[2024-11-28T08:53:52.948Z] -Dtest.src.path='C:\Jenkins\workspace\Test_openjdk21_hs_extended.openjdk_x86-64_windows_testList_0\aqa-tests\openjdk\openjdk-jdk\test\jdk\java\beans\PropertyEditor' \
[2024-11-28T08:53:52.948Z] -Dtest.classes='C:\Jenkins\workspace\Test_openjdk21_hs_extended.openjdk_x86-64_windows_testList_0\aqa-tests\TKG\output_17327770449218\jdk_beans_0\work\classes\0\java\beans\PropertyEditor\TestColorClass.d' \
[2024-11-28T08:53:52.948Z] -Dtest.class.path='C:\Jenkins\workspace\Test_openjdk21_hs_extended.openjdk_x86-64_windows_testList_0\aqa-tests\TKG\output_17327770449218\jdk_beans_0\work\classes\0\java\beans\PropertyEditor\TestColorClass.d' \
[2024-11-28T08:53:52.948Z] -Dtest.modules='java.compiler java.desktop jdk.compiler' \
[2024-11-28T08:53:52.948Z] --add-modules java.compiler,java.desktop,jdk.compiler \
[2024-11-28T08:53:52.948Z] -ea \
[2024-11-28T08:53:52.948Z] -esa \
[2024-11-28T08:53:52.948Z] -Xmx512m \
[2024-11-28T08:53:52.948Z] -XX:+UseCompressedOops \
[2024-11-28T08:53:52.948Z] '-Djava.library.path=c:\jenkins\workspace\Test_openjdk21_hs_extended.openjdk_x86-64_windows_testList_0\jdkbinary\openjdk-test-image\jdk\jtreg\native' \
[2024-11-28T08:53:52.948Z] -Djava.security.manager=allow \
[2024-11-28T08:53:52.948Z] com.sun.javatest.regtest.agent.MainWrapper 'C:\Jenkins\workspace\Test_openjdk21_hs_extended.openjdk_x86-64_windows_testList_0\aqa-tests\TKG\output_17327770449218\jdk_beans_0\work\java\beans\PropertyEditor\TestColorClass.d\main.0.jta'
[2024-11-28T08:53:52.948Z]
[2024-11-28T08:53:52.948Z] TEST RESULT: Failed. Execution failed: `main' threw exception: java.lang.Error: could not find editor for class java.awt.Color
[2024-11-28T08:53:52.948Z] --------------------------------------------------
[2024-11-28T08:53:52.948Z] TEST: java/beans/PropertyEditor/TestColorClassJava.java
[2024-11-28T08:53:52.948Z] TEST JDK: c:\jenkins\workspace\Test_openjdk21_hs_extended.openjdk_x86-64_windows_testList_0\jdkbinary\j2sdk-image
[2024-11-28T08:53:52.948Z]
[2024-11-28T08:53:52.948Z] ACTION: build -- Passed. Build successful
[2024-11-28T08:53:52.948Z] REASON: Named class compiled on demand
[2024-11-28T08:53:52.948Z] TIME: 2.617 seconds
[2024-11-28T08:53:52.948Z] messages:
[2024-11-28T08:53:52.948Z] command: build TestColorClassJava
[2024-11-28T08:53:52.948Z] reason: Named class compiled on demand
[2024-11-28T08:53:52.948Z] started: Thu Nov 28 08:53:49 UTC 2024
[2024-11-28T08:53:52.948Z] Test directory:
[2024-11-28T08:53:52.948Z] compile: TestColorClassJava
[2024-11-28T08:53:52.948Z] finished: Thu Nov 28 08:53:51 UTC 2024
[2024-11-28T08:53:52.948Z] elapsed time (seconds): 2.617
[2024-11-28T08:53:52.948Z]
[2024-11-28T08:53:52.948Z] ACTION: compile -- Passed. Compilation successful
[2024-11-28T08:53:52.948Z] REASON: .class file out of date or does not exist
[2024-11-28T08:53:52.948Z] TIME: 2.617 seconds
[2024-11-28T08:53:52.948Z] messages:
[2024-11-28T08:53:52.948Z] command: compile C:\Jenkins\workspace\Test_openjdk21_hs_extended.openjdk_x86-64_windows_testList_0\aqa-tests\openjdk\openjdk-jdk\test\jdk\java\beans\PropertyEditor\TestColorClassJava.java
[2024-11-28T08:53:52.948Z] reason: .class file out of date or does not exist
[2024-11-28T08:53:52.948Z] started: Thu Nov 28 08:53:49 UTC 2024
[2024-11-28T08:53:52.948Z] Additional options from @modules: --add-modules java.compiler,java.desktop,jdk.compiler
[2024-11-28T08:53:52.948Z] Mode: othervm
[2024-11-28T08:53:52.948Z] finished: Thu Nov 28 08:53:51 UTC 2024
[2024-11-28T08:53:52.948Z] elapsed time (seconds): 2.617
[2024-11-28T08:53:52.948Z] configuration:
[2024-11-28T08:53:52.948Z] javac compilation environment
[2024-11-28T08:53:52.948Z] add modules: java.compiler java.desktop jdk.compiler
[2024-11-28T08:53:52.948Z] source path: C:\Jenkins\workspace\Test_openjdk21_hs_extended.openjdk_x86-64_windows_testList_0\aqa-tests\openjdk\openjdk-jdk\test\jdk\java\beans\PropertyEditor
[2024-11-28T08:53:52.948Z] class path: C:\Jenkins\workspace\Test_openjdk21_hs_extended.openjdk_x86-64_windows_testList_0\aqa-tests\openjdk\openjdk-jdk\test\jdk\java\beans\PropertyEditor
[2024-11-28T08:53:52.948Z] C:\Jenkins\workspace\Test_openjdk21_hs_extended.openjdk_x86-64_windows_testList_0\aqa-tests\TKG\output_17327770449218\jdk_beans_0\work\classes\2\java\beans\PropertyEditor\TestColorClassJava.d
[2024-11-28T08:53:52.948Z]
[2024-11-28T08:53:52.948Z] rerun:
[2024-11-28T08:53:52.948Z] cd 'C:\Jenkins\workspace\Test_openjdk21_hs_extended.openjdk_x86-64_windows_testList_0\aqa-tests\TKG\output_17327770449218\jdk_beans_0\work\java\beans\PropertyEditor\TestColorClassJava' && \
[2024-11-28T08:53:52.948Z] PATH='C:\Program Files\Java\jdk-17.0.8.1+1\bin;C:\cygwin64\bin;C:\Windows\system32;C:\Windows;C:\Windows\System32\Wbem;C:\Windows\System32\WindowsPowerShell\v1.0;C:\Windows\System32\OpenSSH;C:\Program Files\dotnet;C:\Users\adoptopenjdk\AppData\Local\Microsoft\WindowsApps;C:\Strawberry\perl\bin;C:\Program Files\Git\cmd;C:\openjdk\jdk-8\bin;C:\apache-ant\apache-ant-1.10.15\bin;C:\Program Files (x86)\IncrediBuild;C:\Program Files (x86)\Windows Kits\10\Windows Performance Toolkit;C:\rust\bin;C:\Program Files\IcedTeaWEB\bin;C:\Program Files\Microsoft SQL Server\110\Tools\Binn;C:\Program Files (x86)\Microsoft SDKs\TypeScript\1.0;C:\Program Files\Microsoft SQL Server\120\Tools\Binn;C:\Users\jenkins\AppData\Local\Microsoft\WindowsApps' \
[2024-11-28T08:53:52.948Z] SystemDrive=C: \
[2024-11-28T08:53:52.948Z] SystemRoot='C:\Windows' \
[2024-11-28T08:53:52.948Z] TEMP='C:\Users\jenkins\AppData\Local\Temp\3' \
[2024-11-28T08:53:52.948Z] TMP='C:\Users\jenkins\AppData\Local\Temp\3' \
[2024-11-28T08:53:52.948Z] windir='C:\Windows' \
[2024-11-28T08:53:52.948Z] 'c:\jenkins\workspace\Test_openjdk21_hs_extended.openjdk_x86-64_windows_testList_0\jdkbinary\j2sdk-image\bin\javac' \
[2024-11-28T08:53:52.948Z] -J-ea \
[2024-11-28T08:53:52.948Z] -J-esa \
[2024-11-28T08:53:52.948Z] -J-Xmx512m \
[2024-11-28T08:53:52.948Z] -J-XX:+UseCompressedOops \
[2024-11-28T08:53:52.948Z] -J-Dtest.vm.opts='-ea -esa -Xmx512m -XX:+UseCompressedOops' \
[2024-11-28T08:53:52.948Z] -J-Dtest.tool.vm.opts='-J-ea -J-esa -J-Xmx512m -J-XX:+UseCompressedOops' \
[2024-11-28T08:53:52.948Z] -J-Dtest.compiler.opts= \
[2024-11-28T08:53:52.948Z] -J-Dtest.java.opts= \
[2024-11-28T08:53:52.948Z] -J-Dtest.jdk='c:\jenkins\workspace\Test_openjdk21_hs_extended.openjdk_x86-64_windows_testList_0\jdkbinary\j2sdk-image' \
[2024-11-28T08:53:52.948Z] -J-Dcompile.jdk='c:\jenkins\workspace\Test_openjdk21_hs_extended.openjdk_x86-64_windows_testList_0\jdkbinary\j2sdk-image' \
[2024-11-28T08:53:52.948Z] -J-Dtest.timeout.factor=8.0 \
[2024-11-28T08:53:52.948Z] -J-Dtest.nativepath='c:\jenkins\workspace\Test_openjdk21_hs_extended.openjdk_x86-64_windows_testList_0\jdkbinary\openjdk-test-image\jdk\jtreg\native' \
[2024-11-28T08:53:52.948Z] -J-Dtest.root='C:\Jenkins\workspace\Test_openjdk21_hs_extended.openjdk_x86-64_windows_testList_0\aqa-tests\openjdk\openjdk-jdk\test\jdk' \
[2024-11-28T08:53:52.948Z] -J-Dtest.name=java/beans/PropertyEditor/TestColorClassJava.java \
[2024-11-28T08:53:52.948Z] -J-Dtest.file='C:\Jenkins\workspace\Test_openjdk21_hs_extended.openjdk_x86-64_windows_testList_0\aqa-tests\openjdk\openjdk-jdk\test\jdk\java\beans\PropertyEditor\TestColorClassJava.java' \
[2024-11-28T08:53:52.948Z] -J-Dtest.src='C:\Jenkins\workspace\Test_openjdk21_hs_extended.openjdk_x86-64_windows_testList_0\aqa-tests\openjdk\openjdk-jdk\test\jdk\java\beans\PropertyEditor' \
[2024-11-28T08:53:52.948Z] -J-Dtest.src.path='C:\Jenkins\workspace\Test_openjdk21_hs_extended.openjdk_x86-64_windows_testList_0\aqa-tests\openjdk\openjdk-jdk\test\jdk\java\beans\PropertyEditor' \
[2024-11-28T08:53:52.948Z] -J-Dtest.classes='C:\Jenkins\workspace\Test_openjdk21_hs_extended.openjdk_x86-64_windows_testList_0\aqa-tests\TKG\output_17327770449218\jdk_beans_0\work\classes\2\java\beans\PropertyEditor\TestColorClassJava.d' \
[2024-11-28T08:53:52.948Z] -J-Dtest.class.path='C:\Jenkins\workspace\Test_openjdk21_hs_extended.openjdk_x86-64_windows_testList_0\aqa-tests\TKG\output_17327770449218\jdk_beans_0\work\classes\2\java\beans\PropertyEditor\TestColorClassJava.d' \
[2024-11-28T08:53:52.948Z] -J-Dtest.modules='java.compiler java.desktop jdk.compiler' \
[2024-11-28T08:53:52.948Z] --add-modules java.compiler,java.desktop,jdk.compiler \
[2024-11-28T08:53:52.948Z] -d 'C:\Jenkins\workspace\Test_openjdk21_hs_extended.openjdk_x86-64_windows_testList_0\aqa-tests\TKG\output_17327770449218\jdk_beans_0\work\classes\2\java\beans\PropertyEditor\TestColorClassJava.d' \
[2024-11-28T08:53:52.948Z] -sourcepath 'C:\Jenkins\workspace\Test_openjdk21_hs_extended.openjdk_x86-64_windows_testList_0\aqa-tests\openjdk\openjdk-jdk\test\jdk\java\beans\PropertyEditor' \
[2024-11-28T08:53:52.948Z] -classpath 'C:\Jenkins\workspace\Test_openjdk21_hs_extended.openjdk_x86-64_windows_testList_0\aqa-tests\openjdk\openjdk-jdk\test\jdk\java\beans\PropertyEditor;C:\Jenkins\workspace\Test_openjdk21_hs_extended.openjdk_x86-64_windows_testList_0\aqa-tests\TKG\output_17327770449218\jdk_beans_0\work\classes\2\java\beans\PropertyEditor\TestColorClassJava.d' 'C:\Jenkins\workspace\Test_openjdk21_hs_extended.openjdk_x86-64_windows_testList_0\aqa-tests\openjdk\openjdk-jdk\test\jdk\java\beans\PropertyEditor\TestColorClassJava.java'
[2024-11-28T08:53:52.948Z] STDOUT:
[2024-11-28T08:53:52.948Z] STDERR:
[2024-11-28T08:53:52.948Z] Note: C:\Jenkins\workspace\Test_openjdk21_hs_extended.openjdk_x86-64_windows_testList_0\aqa-tests\openjdk\openjdk-jdk\test\jdk\java\beans\PropertyEditor\TestEditor.java uses unchecked or unsafe operations.
[2024-11-28T08:53:52.948Z] Note: Recompile with -Xlint:unchecked for details.
[2024-11-28T08:53:52.948Z]
[2024-11-28T08:53:52.948Z] ACTION: main -- Failed. Execution failed: `main' threw exception: java.lang.Error: could not find editor for class java.awt.Color
[2024-11-28T08:53:52.948Z] REASON: Assumed action based on file name: run main TestColorClassJava
[2024-11-28T08:53:52.948Z] TIME: 0.678 seconds
[2024-11-28T08:53:52.948Z] messages:
[2024-11-28T08:53:52.948Z] command: main TestColorClassJava
[2024-11-28T08:53:52.948Z] reason: Assumed action based on file name: run main TestColorClassJava
[2024-11-28T08:53:52.948Z] started: Thu Nov 28 08:53:51 UTC 2024
[2024-11-28T08:53:52.948Z] Mode: othervm
[2024-11-28T08:53:52.948Z] Additional options from @modules: --add-modules java.compiler,java.desktop,jdk.compiler
[2024-11-28T08:53:52.948Z] finished: Thu Nov 28 08:53:52 UTC 2024
[2024-11-28T08:53:52.948Z] elapsed time (seconds): 0.678
[2024-11-28T08:53:52.948Z] configuration:
[2024-11-28T08:53:52.948Z] Boot Layer
[2024-11-28T08:53:52.948Z] add modules: java.compiler java.desktop jdk.compiler
[2024-11-28T08:53:52.948Z]
[2024-11-28T08:53:52.948Z] STDOUT:
[2024-11-28T08:53:52.948Z] Property class: class java.awt.Color
[2024-11-28T08:53:52.948Z] STDERR:
[2024-11-28T08:53:52.948Z] java.lang.Error: could not find editor for class java.awt.Color
[2024-11-28T08:53:52.948Z] at TestEditor.<init>(TestEditor.java:35)
[2024-11-28T08:53:52.948Z] at TestColorClassJava.main(TestColorClassJava.java:39)
[2024-11-28T08:53:52.948Z] at java.base/jdk.internal.reflect.DirectMethodHandleAccessor.invoke(DirectMethodHandleAccessor.java:103)
[2024-11-28T08:53:52.948Z] at java.base/java.lang.reflect.Method.invoke(Method.java:580)
[2024-11-28T08:53:52.948Z] at com.sun.javatest.regtest.agent.MainWrapper$MainTask.run(MainWrapper.java:138)
[2024-11-28T08:53:52.948Z] at java.base/java.lang.Thread.run(Thread.java:1583)
[2024-11-28T08:53:52.948Z]
[2024-11-28T08:53:52.948Z] JavaTest Message: Test threw exception: java.lang.Error: could not find editor for class java.awt.Color
[2024-11-28T08:53:52.948Z] JavaTest Message: shutting down test
[2024-11-28T08:53:52.948Z]
[2024-11-28T08:53:52.948Z] STATUS:Failed.`main' threw exception: java.lang.Error: could not find editor for class java.awt.Color
[2024-11-28T08:53:52.948Z] rerun:
[2024-11-28T08:53:52.948Z] cd 'C:\Jenkins\workspace\Test_openjdk21_hs_extended.openjdk_x86-64_windows_testList_0\aqa-tests\TKG\output_17327770449218\jdk_beans_0\work\java\beans\PropertyEditor\TestColorClassJava' && \
[2024-11-28T08:53:52.948Z] PATH='C:\Program Files\Java\jdk-17.0.8.1+1\bin;C:\cygwin64\bin;C:\Windows\system32;C:\Windows;C:\Windows\System32\Wbem;C:\Windows\System32\WindowsPowerShell\v1.0;C:\Windows\System32\OpenSSH;C:\Program Files\dotnet;C:\Users\adoptopenjdk\AppData\Local\Microsoft\WindowsApps;C:\Strawberry\perl\bin;C:\Program Files\Git\cmd;C:\openjdk\jdk-8\bin;C:\apache-ant\apache-ant-1.10.15\bin;C:\Program Files (x86)\IncrediBuild;C:\Program Files (x86)\Windows Kits\10\Windows Performance Toolkit;C:\rust\bin;C:\Program Files\IcedTeaWEB\bin;C:\Program Files\Microsoft SQL Server\110\Tools\Binn;C:\Program Files (x86)\Microsoft SDKs\TypeScript\1.0;C:\Program Files\Microsoft SQL Server\120\Tools\Binn;C:\Users\jenkins\AppData\Local\Microsoft\WindowsApps' \
[2024-11-28T08:53:52.948Z] SystemDrive=C: \
[2024-11-28T08:53:52.948Z] SystemRoot='C:\Windows' \
[2024-11-28T08:53:52.948Z] TEMP='C:\Users\jenkins\AppData\Local\Temp\3' \
[2024-11-28T08:53:52.948Z] TMP='C:\Users\jenkins\AppData\Local\Temp\3' \
[2024-11-28T08:53:52.948Z] windir='C:\Windows' \
[2024-11-28T08:53:52.948Z] CLASSPATH='C:\Jenkins\workspace\Test_openjdk21_hs_extended.openjdk_x86-64_windows_testList_0\aqa-tests\TKG\output_17327770449218\jdk_beans_0\work\classes\2\java\beans\PropertyEditor\TestColorClassJava.d;C:\Jenkins\workspace\Test_openjdk21_hs_extended.openjdk_x86-64_windows_testList_0\aqa-tests\openjdk\openjdk-jdk\test\jdk\java\beans\PropertyEditor;C:\Jenkins\workspace\Test_openjdk21_hs_extended.openjdk_x86-64_windows_testList_0\jvmtest\openjdk\jtreg\lib\javatest.jar;C:\Jenkins\workspace\Test_openjdk21_hs_extended.openjdk_x86-64_windows_testList_0\jvmtest\openjdk\jtreg\lib\jtreg.jar' \
[2024-11-28T08:53:52.948Z] 'c:\jenkins\workspace\Test_openjdk21_hs_extended.openjdk_x86-64_windows_testList_0\jdkbinary\j2sdk-image\bin\java' \
[2024-11-28T08:53:52.948Z] -Dtest.vm.opts='-ea -esa -Xmx512m -XX:+UseCompressedOops' \
[2024-11-28T08:53:52.948Z] -Dtest.tool.vm.opts='-J-ea -J-esa -J-Xmx512m -J-XX:+UseCompressedOops' \
[2024-11-28T08:53:52.948Z] -Dtest.compiler.opts= \
[2024-11-28T08:53:52.948Z] -Dtest.java.opts= \
[2024-11-28T08:53:52.948Z] -Dtest.jdk='c:\jenkins\workspace\Test_openjdk21_hs_extended.openjdk_x86-64_windows_testList_0\jdkbinary\j2sdk-image' \
[2024-11-28T08:53:52.948Z] -Dcompile.jdk='c:\jenkins\workspace\Test_openjdk21_hs_extended.openjdk_x86-64_windows_testList_0\jdkbinary\j2sdk-image' \
[2024-11-28T08:53:52.948Z] -Dtest.timeout.factor=8.0 \
[2024-11-28T08:53:52.948Z] -Dtest.nativepath='c:\jenkins\workspace\Test_openjdk21_hs_extended.openjdk_x86-64_windows_testList_0\jdkbinary\openjdk-test-image\jdk\jtreg\native' \
[2024-11-28T08:53:52.948Z] -Dtest.root='C:\Jenkins\workspace\Test_openjdk21_hs_extended.openjdk_x86-64_windows_testList_0\aqa-tests\openjdk\openjdk-jdk\test\jdk' \
[2024-11-28T08:53:52.948Z] -Dtest.name=java/beans/PropertyEditor/TestColorClassJava.java \
[2024-11-28T08:53:52.948Z] -Dtest.file='C:\Jenkins\workspace\Test_openjdk21_hs_extended.openjdk_x86-64_windows_testList_0\aqa-tests\openjdk\openjdk-jdk\test\jdk\java\beans\PropertyEditor\TestColorClassJava.java' \
[2024-11-28T08:53:52.948Z] -Dtest.src='C:\Jenkins\workspace\Test_openjdk21_hs_extended.openjdk_x86-64_windows_testList_0\aqa-tests\openjdk\openjdk-jdk\test\jdk\java\beans\PropertyEditor' \
[2024-11-28T08:53:52.948Z] -Dtest.src.path='C:\Jenkins\workspace\Test_openjdk21_hs_extended.openjdk_x86-64_windows_testList_0\aqa-tests\openjdk\openjdk-jdk\test\jdk\java\beans\PropertyEditor' \
[2024-11-28T08:53:52.948Z] -Dtest.classes='C:\Jenkins\workspace\Test_openjdk21_hs_extended.openjdk_x86-64_windows_testList_0\aqa-tests\TKG\output_17327770449218\jdk_beans_0\work\classes\2\java\beans\PropertyEditor\TestColorClassJava.d' \
[2024-11-28T08:53:52.948Z] -Dtest.class.path='C:\Jenkins\workspace\Test_openjdk21_hs_extended.openjdk_x86-64_windows_testList_0\aqa-tests\TKG\output_17327770449218\jdk_beans_0\work\classes\2\java\beans\PropertyEditor\TestColorClassJava.d' \
[2024-11-28T08:53:52.948Z] -Dtest.modules='java.compiler java.desktop jdk.compiler' \
[2024-11-28T08:53:52.948Z] --add-modules java.compiler,java.desktop,jdk.compiler \
[2024-11-28T08:53:52.948Z] -ea \
[2024-11-28T08:53:52.948Z] -esa \
[2024-11-28T08:53:52.948Z] -Xmx512m \
[2024-11-28T08:53:52.948Z] -XX:+UseCompressedOops \
[2024-11-28T08:53:52.948Z] '-Djava.library.path=c:\jenkins\workspace\Test_openjdk21_hs_extended.openjdk_x86-64_windows_testList_0\jdkbinary\openjdk-test-image\jdk\jtreg\native' \
[2024-11-28T08:53:52.948Z] com.sun.javatest.regtest.agent.MainWrapper 'C:\Jenkins\workspace\Test_openjdk21_hs_extended.openjdk_x86-64_windows_testList_0\aqa-tests\TKG\output_17327770449218\jdk_beans_0\work\java\beans\PropertyEditor\TestColorClassJava.d\main.0.jta'
[2024-11-28T08:53:52.949Z]
[2024-11-28T08:53:52.949Z] TEST RESULT: Failed. Execution failed: `main' threw exception: java.lang.Error: could not find editor for class java.awt.Color
[2024-11-28T08:53:52.949Z] --------------------------------------------------
[2024-11-28T08:53:53.665Z] TEST: java/beans/PropertyEditor/TestColorClassNull.java
[2024-11-28T08:53:53.665Z] TEST JDK: c:\jenkins\workspace\Test_openjdk21_hs_extended.openjdk_x86-64_windows_testList_0\jdkbinary\j2sdk-image
[2024-11-28T08:53:53.665Z]
[2024-11-28T08:53:53.665Z] ACTION: build -- Passed. Build successful
[2024-11-28T08:53:53.665Z] REASON: Named class compiled on demand
[2024-11-28T08:53:53.665Z] TIME: 2.701 seconds
[2024-11-28T08:53:53.665Z] messages:
[2024-11-28T08:53:53.665Z] command: build TestColorClassNull
[2024-11-28T08:53:53.665Z] reason: Named class compiled on demand
[2024-11-28T08:53:53.665Z] started: Thu Nov 28 08:53:50 UTC 2024
[2024-11-28T08:53:53.665Z] Test directory:
[2024-11-28T08:53:53.665Z] compile: TestColorClassNull
[2024-11-28T08:53:53.665Z] finished: Thu Nov 28 08:53:53 UTC 2024
[2024-11-28T08:53:53.665Z] elapsed time (seconds): 2.701
[2024-11-28T08:53:53.665Z]
[2024-11-28T08:53:53.665Z] ACTION: compile -- Passed. Compilation successful
[2024-11-28T08:53:53.665Z] REASON: .class file out of date or does not exist
[2024-11-28T08:53:53.665Z] TIME: 2.7 seconds
[2024-11-28T08:53:53.665Z] messages:
[2024-11-28T08:53:53.665Z] command: compile C:\Jenkins\workspace\Test_openjdk21_hs_extended.openjdk_x86-64_windows_testList_0\aqa-tests\openjdk\openjdk-jdk\test\jdk\java\beans\PropertyEditor\TestColorClassNull.java
[2024-11-28T08:53:53.665Z] reason: .class file out of date or does not exist
[2024-11-28T08:53:53.665Z] started: Thu Nov 28 08:53:50 UTC 2024
[2024-11-28T08:53:53.665Z] Additional options from @modules: --add-modules java.compiler,java.desktop,jdk.compiler
[2024-11-28T08:53:53.665Z] Mode: othervm
[2024-11-28T08:53:53.665Z] finished: Thu Nov 28 08:53:53 UTC 2024
[2024-11-28T08:53:53.665Z] elapsed time (seconds): 2.7
[2024-11-28T08:53:53.665Z] configuration:
[2024-11-28T08:53:53.665Z] javac compilation environment
[2024-11-28T08:53:53.665Z] add modules: java.compiler java.desktop jdk.compiler
[2024-11-28T08:53:53.665Z] source path: C:\Jenkins\workspace\Test_openjdk21_hs_extended.openjdk_x86-64_windows_testList_0\aqa-tests\openjdk\openjdk-jdk\test\jdk\java\beans\PropertyEditor
[2024-11-28T08:53:53.665Z] class path: C:\Jenkins\workspace\Test_openjdk21_hs_extended.openjdk_x86-64_windows_testList_0\aqa-tests\openjdk\openjdk-jdk\test\jdk\java\beans\PropertyEditor
[2024-11-28T08:53:53.665Z] C:\Jenkins\workspace\Test_openjdk21_hs_extended.openjdk_x86-64_windows_testList_0\aqa-tests\TKG\output_17327770449218\jdk_beans_0\work\classes\1\java\beans\PropertyEditor\TestColorClassNull.d
[2024-11-28T08:53:53.665Z]
[2024-11-28T08:53:53.665Z] rerun:
[2024-11-28T08:53:53.666Z] cd 'C:\Jenkins\workspace\Test_openjdk21_hs_extended.openjdk_x86-64_windows_testList_0\aqa-tests\TKG\output_17327770449218\jdk_beans_0\work\java\beans\PropertyEditor\TestColorClassNull' && \
[2024-11-28T08:53:53.666Z] PATH='C:\Program Files\Java\jdk-17.0.8.1+1\bin;C:\cygwin64\bin;C:\Windows\system32;C:\Windows;C:\Windows\System32\Wbem;C:\Windows\System32\WindowsPowerShell\v1.0;C:\Windows\System32\OpenSSH;C:\Program Files\dotnet;C:\Users\adoptopenjdk\AppData\Local\Microsoft\WindowsApps;C:\Strawberry\perl\bin;C:\Program Files\Git\cmd;C:\openjdk\jdk-8\bin;C:\apache-ant\apache-ant-1.10.15\bin;C:\Program Files (x86)\IncrediBuild;C:\Program Files (x86)\Windows Kits\10\Windows Performance Toolkit;C:\rust\bin;C:\Program Files\IcedTeaWEB\bin;C:\Program Files\Microsoft SQL Server\110\Tools\Binn;C:\Program Files (x86)\Microsoft SDKs\TypeScript\1.0;C:\Program Files\Microsoft SQL Server\120\Tools\Binn;C:\Users\jenkins\AppData\Local\Microsoft\WindowsApps' \
[2024-11-28T08:53:53.666Z] SystemDrive=C: \
[2024-11-28T08:53:53.666Z] SystemRoot='C:\Windows' \
[2024-11-28T08:53:53.666Z] TEMP='C:\Users\jenkins\AppData\Local\Temp\3' \
[2024-11-28T08:53:53.666Z] TMP='C:\Users\jenkins\AppData\Local\Temp\3' \
[2024-11-28T08:53:53.666Z] windir='C:\Windows' \
[2024-11-28T08:53:53.666Z] 'c:\jenkins\workspace\Test_openjdk21_hs_extended.openjdk_x86-64_windows_testList_0\jdkbinary\j2sdk-image\bin\javac' \
[2024-11-28T08:53:53.666Z] -J-ea \
[2024-11-28T08:53:53.666Z] -J-esa \
[2024-11-28T08:53:53.666Z] -J-Xmx512m \
[2024-11-28T08:53:53.666Z] -J-XX:+UseCompressedOops \
[2024-11-28T08:53:53.666Z] -J-Dtest.vm.opts='-ea -esa -Xmx512m -XX:+UseCompressedOops' \
[2024-11-28T08:53:53.666Z] -J-Dtest.tool.vm.opts='-J-ea -J-esa -J-Xmx512m -J-XX:+UseCompressedOops' \
[2024-11-28T08:53:53.666Z] -J-Dtest.compiler.opts= \
[2024-11-28T08:53:53.666Z] -J-Dtest.java.opts= \
[2024-11-28T08:53:53.666Z] -J-Dtest.jdk='c:\jenkins\workspace\Test_openjdk21_hs_extended.openjdk_x86-64_windows_testList_0\jdkbinary\j2sdk-image' \
[2024-11-28T08:53:53.666Z] -J-Dcompile.jdk='c:\jenkins\workspace\Test_openjdk21_hs_extended.openjdk_x86-64_windows_testList_0\jdkbinary\j2sdk-image' \
[2024-11-28T08:53:53.666Z] -J-Dtest.timeout.factor=8.0 \
[2024-11-28T08:53:53.666Z] -J-Dtest.nativepath='c:\jenkins\workspace\Test_openjdk21_hs_extended.openjdk_x86-64_windows_testList_0\jdkbinary\openjdk-test-image\jdk\jtreg\native' \
[2024-11-28T08:53:53.666Z] -J-Dtest.root='C:\Jenkins\workspace\Test_openjdk21_hs_extended.openjdk_x86-64_windows_testList_0\aqa-tests\openjdk\openjdk-jdk\test\jdk' \
[2024-11-28T08:53:53.666Z] -J-Dtest.name=java/beans/PropertyEditor/TestColorClassNull.java \
[2024-11-28T08:53:53.666Z] -J-Dtest.file='C:\Jenkins\workspace\Test_openjdk21_hs_extended.openjdk_x86-64_windows_testList_0\aqa-tests\openjdk\openjdk-jdk\test\jdk\java\beans\PropertyEditor\TestColorClassNull.java' \
[2024-11-28T08:53:53.666Z] -J-Dtest.src='C:\Jenkins\workspace\Test_openjdk21_hs_extended.openjdk_x86-64_windows_testList_0\aqa-tests\openjdk\openjdk-jdk\test\jdk\java\beans\PropertyEditor' \
[2024-11-28T08:53:53.666Z] -J-Dtest.src.path='C:\Jenkins\workspace\Test_openjdk21_hs_extended.openjdk_x86-64_windows_testList_0\aqa-tests\openjdk\openjdk-jdk\test\jdk\java\beans\PropertyEditor' \
[2024-11-28T08:53:53.666Z] -J-Dtest.classes='C:\Jenkins\workspace\Test_openjdk21_hs_extended.openjdk_x86-64_windows_testList_0\aqa-tests\TKG\output_17327770449218\jdk_beans_0\work\classes\1\java\beans\PropertyEditor\TestColorClassNull.d' \
[2024-11-28T08:53:53.666Z] -J-Dtest.class.path='C:\Jenkins\workspace\Test_openjdk21_hs_extended.openjdk_x86-64_windows_testList_0\aqa-tests\TKG\output_17327770449218\jdk_beans_0\work\classes\1\java\beans\PropertyEditor\TestColorClassNull.d' \
[2024-11-28T08:53:53.666Z] -J-Dtest.modules='java.compiler java.desktop jdk.compiler' \
[2024-11-28T08:53:53.666Z] --add-modules java.compiler,java.desktop,jdk.compiler \
[2024-11-28T08:53:53.666Z] -d 'C:\Jenkins\workspace\Test_openjdk21_hs_extended.openjdk_x86-64_windows_testList_0\aqa-tests\TKG\output_17327770449218\jdk_beans_0\work\classes\1\java\beans\PropertyEditor\TestColorClassNull.d' \
[2024-11-28T08:53:53.666Z] -sourcepath 'C:\Jenkins\workspace\Test_openjdk21_hs_extended.openjdk_x86-64_windows_testList_0\aqa-tests\openjdk\openjdk-jdk\test\jdk\java\beans\PropertyEditor' \
[2024-11-28T08:53:53.666Z] -classpath 'C:\Jenkins\workspace\Test_openjdk21_hs_extended.openjdk_x86-64_windows_testList_0\aqa-tests\openjdk\openjdk-jdk\test\jdk\java\beans\PropertyEditor;C:\Jenkins\workspace\Test_openjdk21_hs_extended.openjdk_x86-64_windows_testList_0\aqa-tests\TKG\output_17327770449218\jdk_beans_0\work\classes\1\java\beans\PropertyEditor\TestColorClassNull.d' 'C:\Jenkins\workspace\Test_openjdk21_hs_extended.openjdk_x86-64_windows_testList_0\aqa-tests\openjdk\openjdk-jdk\test\jdk\java\beans\PropertyEditor\TestColorClassNull.java'
[2024-11-28T08:53:53.666Z] STDOUT:
[2024-11-28T08:53:53.666Z] STDERR:
[2024-11-28T08:53:53.666Z] Note: C:\Jenkins\workspace\Test_openjdk21_hs_extended.openjdk_x86-64_windows_testList_0\aqa-tests\openjdk\openjdk-jdk\test\jdk\java\beans\PropertyEditor\TestEditor.java uses unchecked or unsafe operations.
[2024-11-28T08:53:53.666Z] Note: Recompile with -Xlint:unchecked for details.
[2024-11-28T08:53:53.666Z]
[2024-11-28T08:53:53.666Z] ACTION: main -- Failed. Execution failed: `main' threw exception: java.lang.Error: could not find editor for class java.awt.Color
[2024-11-28T08:53:53.666Z] REASON: Assumed action based on file name: run main TestColorClassNull
[2024-11-28T08:53:53.666Z] TIME: 0.491 seconds
[2024-11-28T08:53:53.666Z] messages:
[2024-11-28T08:53:53.666Z] command: main TestColorClassNull
[2024-11-28T08:53:53.666Z] reason: Assumed action based on file name: run main TestColorClassNull
[2024-11-28T08:53:53.666Z] started: Thu Nov 28 08:53:53 UTC 2024
[2024-11-28T08:53:53.666Z] Mode: othervm
[2024-11-28T08:53:53.666Z] Additional options from @modules: --add-modules java.compiler,java.desktop,jdk.compiler
[2024-11-28T08:53:53.666Z] finished: Thu Nov 28 08:53:53 UTC 2024
[2024-11-28T08:53:53.666Z] elapsed time (seconds): 0.491
[2024-11-28T08:53:53.666Z] configuration:
[2024-11-28T08:53:53.666Z] Boot Layer
[2024-11-28T08:53:53.666Z] add modules: java.compiler java.desktop jdk.compiler
[2024-11-28T08:53:53.666Z]
[2024-11-28T08:53:53.666Z] STDOUT:
[2024-11-28T08:53:53.666Z] Property class: class java.awt.Color
[2024-11-28T08:53:53.666Z] STDERR:
[2024-11-28T08:53:53.666Z] java.lang.Error: could not find editor for class java.awt.Color
[2024-11-28T08:53:53.666Z] at TestEditor.<init>(TestEditor.java:35)
[2024-11-28T08:53:53.666Z] at TestColorClassNull.main(TestColorClassNull.java:39)
[2024-11-28T08:53:53.666Z] at java.base/jdk.internal.reflect.DirectMethodHandleAccessor.invoke(DirectMethodHandleAccessor.java:103)
[2024-11-28T08:53:53.666Z] at java.base/java.lang.reflect.Method.invoke(Method.java:580)
[2024-11-28T08:53:53.666Z] at com.sun.javatest.regtest.agent.MainWrapper$MainTask.run(MainWrapper.java:138)
[2024-11-28T08:53:53.666Z] at java.base/java.lang.Thread.run(Thread.java:1583)
[2024-11-28T08:53:53.666Z]
[2024-11-28T08:53:53.666Z] JavaTest Message: Test threw exception: java.lang.Error: could not find editor for class java.awt.Color
[2024-11-28T08:53:53.666Z] JavaTest Message: shutting down test
[2024-11-28T08:53:53.666Z]
[2024-11-28T08:53:53.666Z] STATUS:Failed.`main' threw exception: java.lang.Error: could not find editor for class java.awt.Color
[2024-11-28T08:53:53.666Z] rerun:
[2024-11-28T08:53:53.666Z] cd 'C:\Jenkins\workspace\Test_openjdk21_hs_extended.openjdk_x86-64_windows_testList_0\aqa-tests\TKG\output_17327770449218\jdk_beans_0\work\java\beans\PropertyEditor\TestColorClassNull' && \
[2024-11-28T08:53:53.667Z] PATH='C:\Program Files\Java\jdk-17.0.8.1+1\bin;C:\cygwin64\bin;C:\Windows\system32;C:\Windows;C:\Windows\System32\Wbem;C:\Windows\System32\WindowsPowerShell\v1.0;C:\Windows\System32\OpenSSH;C:\Program Files\dotnet;C:\Users\adoptopenjdk\AppData\Local\Microsoft\WindowsApps;C:\Strawberry\perl\bin;C:\Program Files\Git\cmd;C:\openjdk\jdk-8\bin;C:\apache-ant\apache-ant-1.10.15\bin;C:\Program Files (x86)\IncrediBuild;C:\Program Files (x86)\Windows Kits\10\Windows Performance Toolkit;C:\rust\bin;C:\Program Files\IcedTeaWEB\bin;C:\Program Files\Microsoft SQL Server\110\Tools\Binn;C:\Program Files (x86)\Microsoft SDKs\TypeScript\1.0;C:\Program Files\Microsoft SQL Server\120\Tools\Binn;C:\Users\jenkins\AppData\Local\Microsoft\WindowsApps' \
[2024-11-28T08:53:53.667Z] SystemDrive=C: \
[2024-11-28T08:53:53.667Z] SystemRoot='C:\Windows' \
[2024-11-28T08:53:53.667Z] TEMP='C:\Users\jenkins\AppData\Local\Temp\3' \
[2024-11-28T08:53:53.667Z] TMP='C:\Users\jenkins\AppData\Local\Temp\3' \
[2024-11-28T08:53:53.667Z] windir='C:\Windows' \
[2024-11-28T08:53:53.667Z] CLASSPATH='C:\Jenkins\workspace\Test_openjdk21_hs_extended.openjdk_x86-64_windows_testList_0\aqa-tests\TKG\output_17327770449218\jdk_beans_0\work\classes\1\java\beans\PropertyEditor\TestColorClassNull.d;C:\Jenkins\workspace\Test_openjdk21_hs_extended.openjdk_x86-64_windows_testList_0\aqa-tests\openjdk\openjdk-jdk\test\jdk\java\beans\PropertyEditor;C:\Jenkins\workspace\Test_openjdk21_hs_extended.openjdk_x86-64_windows_testList_0\jvmtest\openjdk\jtreg\lib\javatest.jar;C:\Jenkins\workspace\Test_openjdk21_hs_extended.openjdk_x86-64_windows_testList_0\jvmtest\openjdk\jtreg\lib\jtreg.jar' \
[2024-11-28T08:53:53.667Z] 'c:\jenkins\workspace\Test_openjdk21_hs_extended.openjdk_x86-64_windows_testList_0\jdkbinary\j2sdk-image\bin\java' \
[2024-11-28T08:53:53.667Z] -Dtest.vm.opts='-ea -esa -Xmx512m -XX:+UseCompressedOops' \
[2024-11-28T08:53:53.667Z] -Dtest.tool.vm.opts='-J-ea -J-esa -J-Xmx512m -J-XX:+UseCompressedOops' \
[2024-11-28T08:53:53.667Z] -Dtest.compiler.opts= \
[2024-11-28T08:53:53.667Z] -Dtest.java.opts= \
[2024-11-28T08:53:53.667Z] -Dtest.jdk='c:\jenkins\workspace\Test_openjdk21_hs_extended.openjdk_x86-64_windows_testList_0\jdkbinary\j2sdk-image' \
[2024-11-28T08:53:53.667Z] -Dcompile.jdk='c:\jenkins\workspace\Test_openjdk21_hs_extended.openjdk_x86-64_windows_testList_0\jdkbinary\j2sdk-image' \
[2024-11-28T08:53:53.667Z] -Dtest.timeout.factor=8.0 \
[2024-11-28T08:53:53.667Z] -Dtest.nativepath='c:\jenkins\workspace\Test_openjdk21_hs_extended.openjdk_x86-64_windows_testList_0\jdkbinary\openjdk-test-image\jdk\jtreg\native' \
[2024-11-28T08:53:53.667Z] -Dtest.root='C:\Jenkins\workspace\Test_openjdk21_hs_extended.openjdk_x86-64_windows_testList_0\aqa-tests\openjdk\openjdk-jdk\test\jdk' \
[2024-11-28T08:53:53.667Z] -Dtest.name=java/beans/PropertyEditor/TestColorClassNull.java \
[2024-11-28T08:53:53.667Z] -Dtest.file='C:\Jenkins\workspace\Test_openjdk21_hs_extended.openjdk_x86-64_windows_testList_0\aqa-tests\openjdk\openjdk-jdk\test\jdk\java\beans\PropertyEditor\TestColorClassNull.java' \
[2024-11-28T08:53:53.667Z] -Dtest.src='C:\Jenkins\workspace\Test_openjdk21_hs_extended.openjdk_x86-64_windows_testList_0\aqa-tests\openjdk\openjdk-jdk\test\jdk\java\beans\PropertyEditor' \
[2024-11-28T08:53:53.667Z] -Dtest.src.path='C:\Jenkins\workspace\Test_openjdk21_hs_extended.openjdk_x86-64_windows_testList_0\aqa-tests\openjdk\openjdk-jdk\test\jdk\java\beans\PropertyEditor' \
[2024-11-28T08:53:53.667Z] -Dtest.classes='C:\Jenkins\workspace\Test_openjdk21_hs_extended.openjdk_x86-64_windows_testList_0\aqa-tests\TKG\output_17327770449218\jdk_beans_0\work\classes\1\java\beans\PropertyEditor\TestColorClassNull.d' \
[2024-11-28T08:53:53.667Z] -Dtest.class.path='C:\Jenkins\workspace\Test_openjdk21_hs_extended.openjdk_x86-64_windows_testList_0\aqa-tests\TKG\output_17327770449218\jdk_beans_0\work\classes\1\java\beans\PropertyEditor\TestColorClassNull.d' \
[2024-11-28T08:53:53.667Z] -Dtest.modules='java.compiler java.desktop jdk.compiler' \
[2024-11-28T08:53:53.667Z] --add-modules java.compiler,java.desktop,jdk.compiler \
[2024-11-28T08:53:53.667Z] -ea \
[2024-11-28T08:53:53.667Z] -esa \
[2024-11-28T08:53:53.667Z] -Xmx512m \
[2024-11-28T08:53:53.667Z] -XX:+UseCompressedOops \
[2024-11-28T08:53:53.667Z] '-Djava.library.path=c:\jenkins\workspace\Test_openjdk21_hs_extended.openjdk_x86-64_windows_testList_0\jdkbinary\openjdk-test-image\jdk\jtreg\native' \
[2024-11-28T08:53:53.667Z] com.sun.javatest.regtest.agent.MainWrapper 'C:\Jenkins\workspace\Test_openjdk21_hs_extended.openjdk_x86-64_windows_testList_0\aqa-tests\TKG\output_17327770449218\jdk_beans_0\work\java\beans\PropertyEditor\TestColorClassNull.d\main.0.jta'
[2024-11-28T08:53:53.667Z]
[2024-11-28T08:53:53.667Z] TEST RESULT: Failed. Execution failed: `main' threw exception: java.lang.Error: could not find editor for class java.awt.Color
[2024-11-28T08:53:53.668Z] --------------------------------------------------
[2024-11-28T08:53:56.045Z] TEST: java/beans/PropertyEditor/TestColorClassValue.java
[2024-11-28T08:53:56.045Z] TEST JDK: c:\jenkins\workspace\Test_openjdk21_hs_extended.openjdk_x86-64_windows_testList_0\jdkbinary\j2sdk-image
[2024-11-28T08:53:56.045Z]
[2024-11-28T08:53:56.045Z] ACTION: build -- Passed. Build successful
[2024-11-28T08:53:56.045Z] REASON: Named class compiled on demand
[2024-11-28T08:53:56.045Z] TIME: 2.649 seconds
[2024-11-28T08:53:56.045Z] messages:
[2024-11-28T08:53:56.045Z] command: build TestColorClassValue
[2024-11-28T08:53:56.045Z] reason: Named class compiled on demand
[2024-11-28T08:53:56.045Z] started: Thu Nov 28 08:53:52 UTC 2024
[2024-11-28T08:53:56.045Z] Test directory:
[2024-11-28T08:53:56.045Z] compile: TestColorClassValue
[2024-11-28T08:53:56.045Z] finished: Thu Nov 28 08:53:55 UTC 2024
[2024-11-28T08:53:56.045Z] elapsed time (seconds): 2.649
[2024-11-28T08:53:56.045Z]
[2024-11-28T08:53:56.045Z] ACTION: compile -- Passed. Compilation successful
[2024-11-28T08:53:56.045Z] REASON: .class file out of date or does not exist
[2024-11-28T08:53:56.045Z] TIME: 2.625 seconds
[2024-11-28T08:53:56.045Z] messages:
[2024-11-28T08:53:56.045Z] command: compile C:\Jenkins\workspace\Test_openjdk21_hs_extended.openjdk_x86-64_windows_testList_0\aqa-tests\openjdk\openjdk-jdk\test\jdk\java\beans\PropertyEditor\TestColorClassValue.java
[2024-11-28T08:53:56.045Z] reason: .class file out of date or does not exist
[2024-11-28T08:53:56.045Z] started: Thu Nov 28 08:53:52 UTC 2024
[2024-11-28T08:53:56.045Z] Additional options from @modules: --add-modules java.compiler,java.desktop,jdk.compiler
[2024-11-28T08:53:56.045Z] Mode: othervm
[2024-11-28T08:53:56.045Z] finished: Thu Nov 28 08:53:55 UTC 2024
[2024-11-28T08:53:56.045Z] elapsed time (seconds): 2.625
[2024-11-28T08:53:56.045Z] configuration:
[2024-11-28T08:53:56.045Z] javac compilation environment
[2024-11-28T08:53:56.045Z] add modules: java.compiler java.desktop jdk.compiler
[2024-11-28T08:53:56.045Z] source path: C:\Jenkins\workspace\Test_openjdk21_hs_extended.openjdk_x86-64_windows_testList_0\aqa-tests\openjdk\openjdk-jdk\test\jdk\java\beans\PropertyEditor
[2024-11-28T08:53:56.045Z] class path: C:\Jenkins\workspace\Test_openjdk21_hs_extended.openjdk_x86-64_windows_testList_0\aqa-tests\openjdk\openjdk-jdk\test\jdk\java\beans\PropertyEditor
[2024-11-28T08:53:56.045Z] C:\Jenkins\workspace\Test_openjdk21_hs_extended.openjdk_x86-64_windows_testList_0\aqa-tests\TKG\output_17327770449218\jdk_beans_0\work\classes\0\java\beans\PropertyEditor\TestColorClassValue.d
[2024-11-28T08:53:56.045Z]
[2024-11-28T08:53:56.045Z] rerun:
[2024-11-28T08:53:56.045Z] cd 'C:\Jenkins\workspace\Test_openjdk21_hs_extended.openjdk_x86-64_windows_testList_0\aqa-tests\TKG\output_17327770449218\jdk_beans_0\work\java\beans\PropertyEditor\TestColorClassValue' && \
[2024-11-28T08:53:56.045Z] PATH='C:\Program Files\Java\jdk-17.0.8.1+1\bin;C:\cygwin64\bin;C:\Windows\system32;C:\Windows;C:\Windows\System32\Wbem;C:\Windows\System32\WindowsPowerShell\v1.0;C:\Windows\System32\OpenSSH;C:\Program Files\dotnet;C:\Users\adoptopenjdk\AppData\Local\Microsoft\WindowsApps;C:\Strawberry\perl\bin;C:\Program Files\Git\cmd;C:\openjdk\jdk-8\bin;C:\apache-ant\apache-ant-1.10.15\bin;C:\Program Files (x86)\IncrediBuild;C:\Program Files (x86)\Windows Kits\10\Windows Performance Toolkit;C:\rust\bin;C:\Program Files\IcedTeaWEB\bin;C:\Program Files\Microsoft SQL Server\110\Tools\Binn;C:\Program Files (x86)\Microsoft SDKs\TypeScript\1.0;C:\Program Files\Microsoft SQL Server\120\Tools\Binn;C:\Users\jenkins\AppData\Local\Microsoft\WindowsApps' \
[2024-11-28T08:53:56.045Z] SystemDrive=C: \
[2024-11-28T08:53:56.045Z] SystemRoot='C:\Windows' \
[2024-11-28T08:53:56.045Z] TEMP='C:\Users\jenkins\AppData\Local\Temp\3' \
[2024-11-28T08:53:56.045Z] TMP='C:\Users\jenkins\AppData\Local\Temp\3' \
[2024-11-28T08:53:56.045Z] windir='C:\Windows' \
[2024-11-28T08:53:56.045Z] 'c:\jenkins\workspace\Test_openjdk21_hs_extended.openjdk_x86-64_windows_testList_0\jdkbinary\j2sdk-image\bin\javac' \
[2024-11-28T08:53:56.045Z] -J-ea \
[2024-11-28T08:53:56.045Z] -J-esa \
[2024-11-28T08:53:56.045Z] -J-Xmx512m \
[2024-11-28T08:53:56.045Z] -J-XX:+UseCompressedOops \
[2024-11-28T08:53:56.046Z] -J-Dtest.vm.opts='-ea -esa -Xmx512m -XX:+UseCompressedOops' \
[2024-11-28T08:53:56.046Z] -J-Dtest.tool.vm.opts='-J-ea -J-esa -J-Xmx512m -J-XX:+UseCompressedOops' \
[2024-11-28T08:53:56.046Z] -J-Dtest.compiler.opts= \
[2024-11-28T08:53:56.046Z] -J-Dtest.java.opts= \
[2024-11-28T08:53:56.046Z] -J-Dtest.jdk='c:\jenkins\workspace\Test_openjdk21_hs_extended.openjdk_x86-64_windows_testList_0\jdkbinary\j2sdk-image' \
[2024-11-28T08:53:56.046Z] -J-Dcompile.jdk='c:\jenkins\workspace\Test_openjdk21_hs_extended.openjdk_x86-64_windows_testList_0\jdkbinary\j2sdk-image' \
[2024-11-28T08:53:56.046Z] -J-Dtest.timeout.factor=8.0 \
[2024-11-28T08:53:56.046Z] -J-Dtest.nativepath='c:\jenkins\workspace\Test_openjdk21_hs_extended.openjdk_x86-64_windows_testList_0\jdkbinary\openjdk-test-image\jdk\jtreg\native' \
[2024-11-28T08:53:56.046Z] -J-Dtest.root='C:\Jenkins\workspace\Test_openjdk21_hs_extended.openjdk_x86-64_windows_testList_0\aqa-tests\openjdk\openjdk-jdk\test\jdk' \
[2024-11-28T08:53:56.046Z] -J-Dtest.name=java/beans/PropertyEditor/TestColorClassValue.java \
[2024-11-28T08:53:56.046Z] -J-Dtest.file='C:\Jenkins\workspace\Test_openjdk21_hs_extended.openjdk_x86-64_windows_testList_0\aqa-tests\openjdk\openjdk-jdk\test\jdk\java\beans\PropertyEditor\TestColorClassValue.java' \
[2024-11-28T08:53:56.046Z] -J-Dtest.src='C:\Jenkins\workspace\Test_openjdk21_hs_extended.openjdk_x86-64_windows_testList_0\aqa-tests\openjdk\openjdk-jdk\test\jdk\java\beans\PropertyEditor' \
[2024-11-28T08:53:56.046Z] -J-Dtest.src.path='C:\Jenkins\workspace\Test_openjdk21_hs_extended.openjdk_x86-64_windows_testList_0\aqa-tests\openjdk\openjdk-jdk\test\jdk\java\beans\PropertyEditor' \
[2024-11-28T08:53:56.046Z] -J-Dtest.classes='C:\Jenkins\workspace\Test_openjdk21_hs_extended.openjdk_x86-64_windows_testList_0\aqa-tests\TKG\output_17327770449218\jdk_beans_0\work\classes\0\java\beans\PropertyEditor\TestColorClassValue.d' \
[2024-11-28T08:53:56.046Z] -J-Dtest.class.path='C:\Jenkins\workspace\Test_openjdk21_hs_extended.openjdk_x86-64_windows_testList_0\aqa-tests\TKG\output_17327770449218\jdk_beans_0\work\classes\0\java\beans\PropertyEditor\TestColorClassValue.d' \
[2024-11-28T08:53:56.046Z] -J-Dtest.modules='java.compiler java.desktop jdk.compiler' \
[2024-11-28T08:53:56.046Z] --add-modules java.compiler,java.desktop,jdk.compiler \
[2024-11-28T08:53:56.046Z] -d 'C:\Jenkins\workspace\Test_openjdk21_hs_extended.openjdk_x86-64_windows_testList_0\aqa-tests\TKG\output_17327770449218\jdk_beans_0\work\classes\0\java\beans\PropertyEditor\TestColorClassValue.d' \
[2024-11-28T08:53:56.046Z] -sourcepath 'C:\Jenkins\workspace\Test_openjdk21_hs_extended.openjdk_x86-64_windows_testList_0\aqa-tests\openjdk\openjdk-jdk\test\jdk\java\beans\PropertyEditor' \
[2024-11-28T08:53:56.046Z] -classpath 'C:\Jenkins\workspace\Test_openjdk21_hs_extended.openjdk_x86-64_windows_testList_0\aqa-tests\openjdk\openjdk-jdk\test\jdk\java\beans\PropertyEditor;C:\Jenkins\workspace\Test_openjdk21_hs_extended.openjdk_x86-64_windows_testList_0\aqa-tests\TKG\output_17327770449218\jdk_beans_0\work\classes\0\java\beans\PropertyEditor\TestColorClassValue.d' 'C:\Jenkins\workspace\Test_openjdk21_hs_extended.openjdk_x86-64_windows_testList_0\aqa-tests\openjdk\openjdk-jdk\test\jdk\java\beans\PropertyEditor\TestColorClassValue.java'
[2024-11-28T08:53:56.046Z] STDOUT:
[2024-11-28T08:53:56.046Z] STDERR:
[2024-11-28T08:53:56.046Z] Note: C:\Jenkins\workspace\Test_openjdk21_hs_extended.openjdk_x86-64_windows_testList_0\aqa-tests\openjdk\openjdk-jdk\test\jdk\java\beans\PropertyEditor\TestEditor.java uses unchecked or unsafe operations.
[2024-11-28T08:53:56.046Z] Note: Recompile with -Xlint:unchecked for details.
[2024-11-28T08:53:56.046Z]
[2024-11-28T08:53:56.046Z] ACTION: main -- Failed. Execution failed: `main' threw exception: java.lang.Error: could not find editor for class java.awt.Color
[2024-11-28T08:53:56.046Z] REASON: Assumed action based on file name: run main TestColorClassValue
[2024-11-28T08:53:56.046Z] TIME: 0.492 seconds
[2024-11-28T08:53:56.046Z] messages:
[2024-11-28T08:53:56.046Z] command: main TestColorClassValue
[2024-11-28T08:53:56.046Z] reason: Assumed action based on file name: run main TestColorClassValue
[2024-11-28T08:53:56.046Z] started: Thu Nov 28 08:53:55 UTC 2024
[2024-11-28T08:53:56.046Z] Mode: othervm
[2024-11-28T08:53:56.046Z] Additional options from @modules: --add-modules java.compiler,java.desktop,jdk.compiler
[2024-11-28T08:53:56.046Z] finished: Thu Nov 28 08:53:55 UTC 2024
[2024-11-28T08:53:56.046Z] elapsed time (seconds): 0.492
[2024-11-28T08:53:56.046Z] configuration:
[2024-11-28T08:53:56.046Z] Boot Layer
[2024-11-28T08:53:56.046Z] add modules: java.compiler java.desktop jdk.compiler
[2024-11-28T08:53:56.046Z]
[2024-11-28T08:53:56.046Z] STDOUT:
[2024-11-28T08:53:56.046Z] Property class: class java.awt.Color
[2024-11-28T08:53:56.046Z] STDERR:
[2024-11-28T08:53:56.046Z] java.lang.Error: could not find editor for class java.awt.Color
[2024-11-28T08:53:56.046Z] at TestEditor.<init>(TestEditor.java:35)
[2024-11-28T08:53:56.046Z] at TestColorClassValue.main(TestColorClassValue.java:39)
[2024-11-28T08:53:56.046Z] at java.base/jdk.internal.reflect.DirectMethodHandleAccessor.invoke(DirectMethodHandleAccessor.java:103)
[2024-11-28T08:53:56.046Z] at java.base/java.lang.reflect.Method.invoke(Method.java:580)
[2024-11-28T08:53:56.046Z] at com.sun.javatest.regtest.agent.MainWrapper$MainTask.run(MainWrapper.java:138)
[2024-11-28T08:53:56.046Z] at java.base/java.lang.Thread.run(Thread.java:1583)
[2024-11-28T08:53:56.046Z]
[2024-11-28T08:53:56.046Z] JavaTest Message: Test threw exception: java.lang.Error: could not find editor for class java.awt.Color
[2024-11-28T08:53:56.046Z] JavaTest Message: shutting down test
[2024-11-28T08:53:56.046Z]
[2024-11-28T08:53:56.046Z] STATUS:Failed.`main' threw exception: java.lang.Error: could not find editor for class java.awt.Color
[2024-11-28T08:53:56.046Z] rerun:
[2024-11-28T08:53:56.046Z] cd 'C:\Jenkins\workspace\Test_openjdk21_hs_extended.openjdk_x86-64_windows_testList_0\aqa-tests\TKG\output_17327770449218\jdk_beans_0\work\java\beans\PropertyEditor\TestColorClassValue' && \
[2024-11-28T08:53:56.062Z] PATH='C:\Program Files\Java\jdk-17.0.8.1+1\bin;C:\cygwin64\bin;C:\Windows\system32;C:\Windows;C:\Windows\System32\Wbem;C:\Windows\System32\WindowsPowerShell\v1.0;C:\Windows\System32\OpenSSH;C:\Program Files\dotnet;C:\Users\adoptopenjdk\AppData\Local\Microsoft\WindowsApps;C:\Strawberry\perl\bin;C:\Program Files\Git\cmd;C:\openjdk\jdk-8\bin;C:\apache-ant\apache-ant-1.10.15\bin;C:\Program Files (x86)\IncrediBuild;C:\Program Files (x86)\Windows Kits\10\Windows Performance Toolkit;C:\rust\bin;C:\Program Files\IcedTeaWEB\bin;C:\Program Files\Microsoft SQL Server\110\Tools\Binn;C:\Program Files (x86)\Microsoft SDKs\TypeScript\1.0;C:\Program Files\Microsoft SQL Server\120\Tools\Binn;C:\Users\jenkins\AppData\Local\Microsoft\WindowsApps' \
[2024-11-28T08:53:56.062Z] SystemDrive=C: \
[2024-11-28T08:53:56.062Z] SystemRoot='C:\Windows' \
[2024-11-28T08:53:56.062Z] TEMP='C:\Users\jenkins\AppData\Local\Temp\3' \
[2024-11-28T08:53:56.062Z] TMP='C:\Users\jenkins\AppData\Local\Temp\3' \
[2024-11-28T08:53:56.062Z] windir='C:\Windows' \
[2024-11-28T08:53:56.062Z] CLASSPATH='C:\Jenkins\workspace\Test_openjdk21_hs_extended.openjdk_x86-64_windows_testList_0\aqa-tests\TKG\output_17327770449218\jdk_beans_0\work\classes\0\java\beans\PropertyEditor\TestColorClassValue.d;C:\Jenkins\workspace\Test_openjdk21_hs_extended.openjdk_x86-64_windows_testList_0\aqa-tests\openjdk\openjdk-jdk\test\jdk\java\beans\PropertyEditor;C:\Jenkins\workspace\Test_openjdk21_hs_extended.openjdk_x86-64_windows_testList_0\jvmtest\openjdk\jtreg\lib\javatest.jar;C:\Jenkins\workspace\Test_openjdk21_hs_extended.openjdk_x86-64_windows_testList_0\jvmtest\openjdk\jtreg\lib\jtreg.jar' \
[2024-11-28T08:53:56.062Z] 'c:\jenkins\workspace\Test_openjdk21_hs_extended.openjdk_x86-64_windows_testList_0\jdkbinary\j2sdk-image\bin\java' \
[2024-11-28T08:53:56.062Z] -Dtest.vm.opts='-ea -esa -Xmx512m -XX:+UseCompressedOops' \
[2024-11-28T08:53:56.062Z] -Dtest.tool.vm.opts='-J-ea -J-esa -J-Xmx512m -J-XX:+UseCompressedOops' \
[2024-11-28T08:53:56.062Z] -Dtest.compiler.opts= \
[2024-11-28T08:53:56.062Z] -Dtest.java.opts= \
[2024-11-28T08:53:56.062Z] -Dtest.jdk='c:\jenkins\workspace\Test_openjdk21_hs_extended.openjdk_x86-64_windows_testList_0\jdkbinary\j2sdk-image' \
[2024-11-28T08:53:56.062Z] -Dcompile.jdk='c:\jenkins\workspace\Test_openjdk21_hs_extended.openjdk_x86-64_windows_testList_0\jdkbinary\j2sdk-image' \
[2024-11-28T08:53:56.062Z] -Dtest.timeout.factor=8.0 \
[2024-11-28T08:53:56.062Z] -Dtest.nativepath='c:\jenkins\workspace\Test_openjdk21_hs_extended.openjdk_x86-64_windows_testList_0\jdkbinary\openjdk-test-image\jdk\jtreg\native' \
[2024-11-28T08:53:56.062Z] -Dtest.root='C:\Jenkins\workspace\Test_openjdk21_hs_extended.openjdk_x86-64_windows_testList_0\aqa-tests\openjdk\openjdk-jdk\test\jdk' \
[2024-11-28T08:53:56.062Z] -Dtest.name=java/beans/PropertyEditor/TestColorClassValue.java \
[2024-11-28T08:53:56.062Z] -Dtest.file='C:\Jenkins\workspace\Test_openjdk21_hs_extended.openjdk_x86-64_windows_testList_0\aqa-tests\openjdk\openjdk-jdk\test\jdk\java\beans\PropertyEditor\TestColorClassValue.java' \
[2024-11-28T08:53:56.062Z] -Dtest.src='C:\Jenkins\workspace\Test_openjdk21_hs_extended.openjdk_x86-64_windows_testList_0\aqa-tests\openjdk\openjdk-jdk\test\jdk\java\beans\PropertyEditor' \
[2024-11-28T08:53:56.062Z] -Dtest.src.path='C:\Jenkins\workspace\Test_openjdk21_hs_extended.openjdk_x86-64_windows_testList_0\aqa-tests\openjdk\openjdk-jdk\test\jdk\java\beans\PropertyEditor' \
[2024-11-28T08:53:56.062Z] -Dtest.classes='C:\Jenkins\workspace\Test_openjdk21_hs_extended.openjdk_x86-64_windows_testList_0\aqa-tests\TKG\output_17327770449218\jdk_beans_0\work\classes\0\java\beans\PropertyEditor\TestColorClassValue.d' \
[2024-11-28T08:53:56.062Z] -Dtest.class.path='C:\Jenkins\workspace\Test_openjdk21_hs_extended.openjdk_x86-64_windows_testList_0\aqa-tests\TKG\output_17327770449218\jdk_beans_0\work\classes\0\java\beans\PropertyEditor\TestColorClassValue.d' \
[2024-11-28T08:53:56.062Z] -Dtest.modules='java.compiler java.desktop jdk.compiler' \
[2024-11-28T08:53:56.062Z] --add-modules java.compiler,java.desktop,jdk.compiler \
[2024-11-28T08:53:56.062Z] -ea \
[2024-11-28T08:53:56.062Z] -esa \
[2024-11-28T08:53:56.062Z] -Xmx512m \
[2024-11-28T08:53:56.062Z] -XX:+UseCompressedOops \
[2024-11-28T08:53:56.062Z] '-Djava.library.path=c:\jenkins\workspace\Test_openjdk21_hs_extended.openjdk_x86-64_windows_testList_0\jdkbinary\openjdk-test-image\jdk\jtreg\native' \
[2024-11-28T08:53:56.062Z] com.sun.javatest.regtest.agent.MainWrapper 'C:\Jenkins\workspace\Test_openjdk21_hs_extended.openjdk_x86-64_windows_testList_0\aqa-tests\TKG\output_17327770449218\jdk_beans_0\work\java\beans\PropertyEditor\TestColorClassValue.d\main.0.jta'
[2024-11-28T08:53:56.062Z]
[2024-11-28T08:53:56.062Z] TEST RESULT: Failed. Execution failed: `main' threw exception: java.lang.Error: could not find editor for class java.awt.Color
[2024-11-28T08:53:56.062Z] --------------------------------------------------
[2024-11-28T08:54:29.375Z] TEST: java/beans/PropertyEditor/TestFontClassJava.java
[2024-11-28T08:54:29.375Z] TEST JDK: c:\jenkins\workspace\Test_openjdk21_hs_extended.openjdk_x86-64_windows_testList_0\jdkbinary\j2sdk-image
[2024-11-28T08:54:29.375Z]
[2024-11-28T08:54:29.375Z] ACTION: build -- Passed. Build successful
[2024-11-28T08:54:29.375Z] REASON: Named class compiled on demand
[2024-11-28T08:54:29.375Z] TIME: 2.978 seconds
[2024-11-28T08:54:29.375Z] messages:
[2024-11-28T08:54:29.375Z] command: build TestFontClassJava
[2024-11-28T08:54:29.375Z] reason: Named class compiled on demand
[2024-11-28T08:54:29.375Z] started: Thu Nov 28 08:54:25 UTC 2024
[2024-11-28T08:54:29.375Z] Test directory:
[2024-11-28T08:54:29.375Z] compile: TestFontClassJava
[2024-11-28T08:54:29.375Z] finished: Thu Nov 28 08:54:28 UTC 2024
[2024-11-28T08:54:29.375Z] elapsed time (seconds): 2.978
[2024-11-28T08:54:29.375Z]
[2024-11-28T08:54:29.375Z] ACTION: compile -- Passed. Compilation successful
[2024-11-28T08:54:29.375Z] REASON: .class file out of date or does not exist
[2024-11-28T08:54:29.375Z] TIME: 2.977 seconds
[2024-11-28T08:54:29.375Z] messages:
[2024-11-28T08:54:29.375Z] command: compile C:\Jenkins\workspace\Test_openjdk21_hs_extended.openjdk_x86-64_windows_testList_0\aqa-tests\openjdk\openjdk-jdk\test\jdk\java\beans\PropertyEditor\TestFontClassJava.java
[2024-11-28T08:54:29.375Z] reason: .class file out of date or does not exist
[2024-11-28T08:54:29.375Z] started: Thu Nov 28 08:54:25 UTC 2024
[2024-11-28T08:54:29.375Z] Additional options from @modules: --add-modules java.compiler,java.desktop,jdk.compiler
[2024-11-28T08:54:29.375Z] Mode: othervm
[2024-11-28T08:54:29.375Z] finished: Thu Nov 28 08:54:28 UTC 2024
[2024-11-28T08:54:29.375Z] elapsed time (seconds): 2.977
[2024-11-28T08:54:29.375Z] configuration:
[2024-11-28T08:54:29.375Z] javac compilation environment
[2024-11-28T08:54:29.375Z] add modules: java.compiler java.desktop jdk.compiler
[2024-11-28T08:54:29.375Z] source path: C:\Jenkins\workspace\Test_openjdk21_hs_extended.openjdk_x86-64_windows_testList_0\aqa-tests\openjdk\openjdk-jdk\test\jdk\java\beans\PropertyEditor
[2024-11-28T08:54:29.375Z] class path: C:\Jenkins\workspace\Test_openjdk21_hs_extended.openjdk_x86-64_windows_testList_0\aqa-tests\openjdk\openjdk-jdk\test\jdk\java\beans\PropertyEditor
[2024-11-28T08:54:29.375Z] C:\Jenkins\workspace\Test_openjdk21_hs_extended.openjdk_x86-64_windows_testList_0\aqa-tests\TKG\output_17327770449218\jdk_beans_0\work\classes\0\java\beans\PropertyEditor\TestFontClassJava.d
[2024-11-28T08:54:29.375Z]
[2024-11-28T08:54:29.375Z] rerun:
[2024-11-28T08:54:29.375Z] cd 'C:\Jenkins\workspace\Test_openjdk21_hs_extended.openjdk_x86-64_windows_testList_0\aqa-tests\TKG\output_17327770449218\jdk_beans_0\work\java\beans\PropertyEditor\TestFontClassJava' && \
[2024-11-28T08:54:29.375Z] PATH='C:\Program Files\Java\jdk-17.0.8.1+1\bin;C:\cygwin64\bin;C:\Windows\system32;C:\Windows;C:\Windows\System32\Wbem;C:\Windows\System32\WindowsPowerShell\v1.0;C:\Windows\System32\OpenSSH;C:\Program Files\dotnet;C:\Users\adoptopenjdk\AppData\Local\Microsoft\WindowsApps;C:\Strawberry\perl\bin;C:\Program Files\Git\cmd;C:\openjdk\jdk-8\bin;C:\apache-ant\apache-ant-1.10.15\bin;C:\Program Files (x86)\IncrediBuild;C:\Program Files (x86)\Windows Kits\10\Windows Performance Toolkit;C:\rust\bin;C:\Program Files\IcedTeaWEB\bin;C:\Program Files\Microsoft SQL Server\110\Tools\Binn;C:\Program Files (x86)\Microsoft SDKs\TypeScript\1.0;C:\Program Files\Microsoft SQL Server\120\Tools\Binn;C:\Users\jenkins\AppData\Local\Microsoft\WindowsApps' \
[2024-11-28T08:54:29.375Z] SystemDrive=C: \
[2024-11-28T08:54:29.375Z] SystemRoot='C:\Windows' \
[2024-11-28T08:54:29.375Z] TEMP='C:\Users\jenkins\AppData\Local\Temp\3' \
[2024-11-28T08:54:29.375Z] TMP='C:\Users\jenkins\AppData\Local\Temp\3' \
[2024-11-28T08:54:29.375Z] windir='C:\Windows' \
[2024-11-28T08:54:29.375Z] 'c:\jenkins\workspace\Test_openjdk21_hs_extended.openjdk_x86-64_windows_testList_0\jdkbinary\j2sdk-image\bin\javac' \
[2024-11-28T08:54:29.375Z] -J-ea \
[2024-11-28T08:54:29.375Z] -J-esa \
[2024-11-28T08:54:29.375Z] -J-Xmx512m \
[2024-11-28T08:54:29.375Z] -J-XX:+UseCompressedOops \
[2024-11-28T08:54:29.375Z] -J-Dtest.vm.opts='-ea -esa -Xmx512m -XX:+UseCompressedOops' \
[2024-11-28T08:54:29.375Z] -J-Dtest.tool.vm.opts='-J-ea -J-esa -J-Xmx512m -J-XX:+UseCompressedOops' \
[2024-11-28T08:54:29.375Z] -J-Dtest.compiler.opts= \
[2024-11-28T08:54:29.375Z] -J-Dtest.java.opts= \
[2024-11-28T08:54:29.375Z] -J-Dtest.jdk='c:\jenkins\workspace\Test_openjdk21_hs_extended.openjdk_x86-64_windows_testList_0\jdkbinary\j2sdk-image' \
[2024-11-28T08:54:29.375Z] -J-Dcompile.jdk='c:\jenkins\workspace\Test_openjdk21_hs_extended.openjdk_x86-64_windows_testList_0\jdkbinary\j2sdk-image' \
[2024-11-28T08:54:29.375Z] -J-Dtest.timeout.factor=8.0 \
[2024-11-28T08:54:29.375Z] -J-Dtest.nativepath='c:\jenkins\workspace\Test_openjdk21_hs_extended.openjdk_x86-64_windows_testList_0\jdkbinary\openjdk-test-image\jdk\jtreg\native' \
[2024-11-28T08:54:29.375Z] -J-Dtest.root='C:\Jenkins\workspace\Test_openjdk21_hs_extended.openjdk_x86-64_windows_testList_0\aqa-tests\openjdk\openjdk-jdk\test\jdk' \
[2024-11-28T08:54:29.375Z] -J-Dtest.name=java/beans/PropertyEditor/TestFontClassJava.java \
[2024-11-28T08:54:29.375Z] -J-Dtest.file='C:\Jenkins\workspace\Test_openjdk21_hs_extended.openjdk_x86-64_windows_testList_0\aqa-tests\openjdk\openjdk-jdk\test\jdk\java\beans\PropertyEditor\TestFontClassJava.java' \
[2024-11-28T08:54:29.375Z] -J-Dtest.src='C:\Jenkins\workspace\Test_openjdk21_hs_extended.openjdk_x86-64_windows_testList_0\aqa-tests\openjdk\openjdk-jdk\test\jdk\java\beans\PropertyEditor' \
[2024-11-28T08:54:29.375Z] -J-Dtest.src.path='C:\Jenkins\workspace\Test_openjdk21_hs_extended.openjdk_x86-64_windows_testList_0\aqa-tests\openjdk\openjdk-jdk\test\jdk\java\beans\PropertyEditor' \
[2024-11-28T08:54:29.375Z] -J-Dtest.classes='C:\Jenkins\workspace\Test_openjdk21_hs_extended.openjdk_x86-64_windows_testList_0\aqa-tests\TKG\output_17327770449218\jdk_beans_0\work\classes\0\java\beans\PropertyEditor\TestFontClassJava.d' \
[2024-11-28T08:54:29.375Z] -J-Dtest.class.path='C:\Jenkins\workspace\Test_openjdk21_hs_extended.openjdk_x86-64_windows_testList_0\aqa-tests\TKG\output_17327770449218\jdk_beans_0\work\classes\0\java\beans\PropertyEditor\TestFontClassJava.d' \
[2024-11-28T08:54:29.375Z] -J-Dtest.modules='java.compiler java.desktop jdk.compiler' \
[2024-11-28T08:54:29.375Z] --add-modules java.compiler,java.desktop,jdk.compiler \
[2024-11-28T08:54:29.375Z] -d 'C:\Jenkins\workspace\Test_openjdk21_hs_extended.openjdk_x86-64_windows_testList_0\aqa-tests\TKG\output_17327770449218\jdk_beans_0\work\classes\0\java\beans\PropertyEditor\TestFontClassJava.d' \
[2024-11-28T08:54:29.375Z] -sourcepath 'C:\Jenkins\workspace\Test_openjdk21_hs_extended.openjdk_x86-64_windows_testList_0\aqa-tests\openjdk\openjdk-jdk\test\jdk\java\beans\PropertyEditor' \
[2024-11-28T08:54:29.375Z] -classpath 'C:\Jenkins\workspace\Test_openjdk21_hs_extended.openjdk_x86-64_windows_testList_0\aqa-tests\openjdk\openjdk-jdk\test\jdk\java\beans\PropertyEditor;C:\Jenkins\workspace\Test_openjdk21_hs_extended.openjdk_x86-64_windows_testList_0\aqa-tests\TKG\output_17327770449218\jdk_beans_0\work\classes\0\java\beans\PropertyEditor\TestFontClassJava.d' 'C:\Jenkins\workspace\Test_openjdk21_hs_extended.openjdk_x86-64_windows_testList_0\aqa-tests\openjdk\openjdk-jdk\test\jdk\java\beans\PropertyEditor\TestFontClassJava.java'
[2024-11-28T08:54:29.375Z] STDOUT:
[2024-11-28T08:54:29.375Z] STDERR:
[2024-11-28T08:54:29.375Z] Note: C:\Jenkins\workspace\Test_openjdk21_hs_extended.openjdk_x86-64_windows_testList_0\aqa-tests\openjdk\openjdk-jdk\test\jdk\java\beans\PropertyEditor\TestEditor.java uses unchecked or unsafe operations.
[2024-11-28T08:54:29.375Z] Note: Recompile with -Xlint:unchecked for details.
[2024-11-28T08:54:29.375Z]
[2024-11-28T08:54:29.375Z] ACTION: main -- Failed. Execution failed: `main' threw exception: java.lang.Error: could not find editor for class java.awt.Font
[2024-11-28T08:54:29.375Z] REASON: Assumed action based on file name: run main TestFontClassJava
[2024-11-28T08:54:29.375Z] TIME: 0.998 seconds
[2024-11-28T08:54:29.375Z] messages:
[2024-11-28T08:54:29.375Z] command: main TestFontClassJava
[2024-11-28T08:54:29.375Z] reason: Assumed action based on file name: run main TestFontClassJava
[2024-11-28T08:54:29.375Z] started: Thu Nov 28 08:54:28 UTC 2024
[2024-11-28T08:54:29.375Z] Mode: othervm
[2024-11-28T08:54:29.375Z] Additional options from @modules: --add-modules java.compiler,java.desktop,jdk.compiler
[2024-11-28T08:54:29.375Z] finished: Thu Nov 28 08:54:29 UTC 2024
[2024-11-28T08:54:29.375Z] elapsed time (seconds): 0.998
[2024-11-28T08:54:29.375Z] configuration:
[2024-11-28T08:54:29.375Z] Boot Layer
[2024-11-28T08:54:29.375Z] add modules: java.compiler java.desktop jdk.compiler
[2024-11-28T08:54:29.375Z]
[2024-11-28T08:54:29.375Z] STDOUT:
[2024-11-28T08:54:29.375Z] Property class: class java.awt.Font
[2024-11-28T08:54:29.375Z] STDERR:
[2024-11-28T08:54:29.375Z] java.lang.Error: could not find editor for class java.awt.Font
[2024-11-28T08:54:29.375Z] at TestEditor.<init>(TestEditor.java:35)
[2024-11-28T08:54:29.375Z] at TestFontClassJava.main(TestFontClassJava.java:39)
[2024-11-28T08:54:29.375Z] at java.base/jdk.internal.reflect.DirectMethodHandleAccessor.invoke(DirectMethodHandleAccessor.java:103)
[2024-11-28T08:54:29.375Z] at java.base/java.lang.reflect.Method.invoke(Method.java:580)
[2024-11-28T08:54:29.375Z] at com.sun.javatest.regtest.agent.MainWrapper$MainTask.run(MainWrapper.java:138)
[2024-11-28T08:54:29.375Z] at java.base/java.lang.Thread.run(Thread.java:1583)
[2024-11-28T08:54:29.375Z]
[2024-11-28T08:54:29.375Z] JavaTest Message: Test threw exception: java.lang.Error: could not find editor for class java.awt.Font
[2024-11-28T08:54:29.375Z] JavaTest Message: shutting down test
[2024-11-28T08:54:29.375Z]
[2024-11-28T08:54:29.375Z] STATUS:Failed.`main' threw exception: java.lang.Error: could not find editor for class java.awt.Font
[2024-11-28T08:54:29.375Z] rerun:
[2024-11-28T08:54:29.375Z] cd 'C:\Jenkins\workspace\Test_openjdk21_hs_extended.openjdk_x86-64_windows_testList_0\aqa-tests\TKG\output_17327770449218\jdk_beans_0\work\java\beans\PropertyEditor\TestFontClassJava' && \
[2024-11-28T08:54:29.376Z] PATH='C:\Program Files\Java\jdk-17.0.8.1+1\bin;C:\cygwin64\bin;C:\Windows\system32;C:\Windows;C:\Windows\System32\Wbem;C:\Windows\System32\WindowsPowerShell\v1.0;C:\Windows\System32\OpenSSH;C:\Program Files\dotnet;C:\Users\adoptopenjdk\AppData\Local\Microsoft\WindowsApps;C:\Strawberry\perl\bin;C:\Program Files\Git\cmd;C:\openjdk\jdk-8\bin;C:\apache-ant\apache-ant-1.10.15\bin;C:\Program Files (x86)\IncrediBuild;C:\Program Files (x86)\Windows Kits\10\Windows Performance Toolkit;C:\rust\bin;C:\Program Files\IcedTeaWEB\bin;C:\Program Files\Microsoft SQL Server\110\Tools\Binn;C:\Program Files (x86)\Microsoft SDKs\TypeScript\1.0;C:\Program Files\Microsoft SQL Server\120\Tools\Binn;C:\Users\jenkins\AppData\Local\Microsoft\WindowsApps' \
[2024-11-28T08:54:29.376Z] SystemDrive=C: \
[2024-11-28T08:54:29.376Z] SystemRoot='C:\Windows' \
[2024-11-28T08:54:29.376Z] TEMP='C:\Users\jenkins\AppData\Local\Temp\3' \
[2024-11-28T08:54:29.376Z] TMP='C:\Users\jenkins\AppData\Local\Temp\3' \
[2024-11-28T08:54:29.376Z] windir='C:\Windows' \
[2024-11-28T08:54:29.376Z] CLASSPATH='C:\Jenkins\workspace\Test_openjdk21_hs_extended.openjdk_x86-64_windows_testList_0\aqa-tests\TKG\output_17327770449218\jdk_beans_0\work\classes\0\java\beans\PropertyEditor\TestFontClassJava.d;C:\Jenkins\workspace\Test_openjdk21_hs_extended.openjdk_x86-64_windows_testList_0\aqa-tests\openjdk\openjdk-jdk\test\jdk\java\beans\PropertyEditor;C:\Jenkins\workspace\Test_openjdk21_hs_extended.openjdk_x86-64_windows_testList_0\jvmtest\openjdk\jtreg\lib\javatest.jar;C:\Jenkins\workspace\Test_openjdk21_hs_extended.openjdk_x86-64_windows_testList_0\jvmtest\openjdk\jtreg\lib\jtreg.jar' \
[2024-11-28T08:54:29.376Z] 'c:\jenkins\workspace\Test_openjdk21_hs_extended.openjdk_x86-64_windows_testList_0\jdkbinary\j2sdk-image\bin\java' \
[2024-11-28T08:54:29.376Z] -Dtest.vm.opts='-ea -esa -Xmx512m -XX:+UseCompressedOops' \
[2024-11-28T08:54:29.376Z] -Dtest.tool.vm.opts='-J-ea -J-esa -J-Xmx512m -J-XX:+UseCompressedOops' \
[2024-11-28T08:54:29.376Z] -Dtest.compiler.opts= \
[2024-11-28T08:54:29.376Z] -Dtest.java.opts= \
[2024-11-28T08:54:29.376Z] -Dtest.jdk='c:\jenkins\workspace\Test_openjdk21_hs_extended.openjdk_x86-64_windows_testList_0\jdkbinary\j2sdk-image' \
[2024-11-28T08:54:29.376Z] -Dcompile.jdk='c:\jenkins\workspace\Test_openjdk21_hs_extended.openjdk_x86-64_windows_testList_0\jdkbinary\j2sdk-image' \
[2024-11-28T08:54:29.376Z] -Dtest.timeout.factor=8.0 \
[2024-11-28T08:54:29.376Z] -Dtest.nativepath='c:\jenkins\workspace\Test_openjdk21_hs_extended.openjdk_x86-64_windows_testList_0\jdkbinary\openjdk-test-image\jdk\jtreg\native' \
[2024-11-28T08:54:29.376Z] -Dtest.root='C:\Jenkins\workspace\Test_openjdk21_hs_extended.openjdk_x86-64_windows_testList_0\aqa-tests\openjdk\openjdk-jdk\test\jdk' \
[2024-11-28T08:54:29.376Z] -Dtest.name=java/beans/PropertyEditor/TestFontClassJava.java \
[2024-11-28T08:54:29.376Z] -Dtest.file='C:\Jenkins\workspace\Test_openjdk21_hs_extended.openjdk_x86-64_windows_testList_0\aqa-tests\openjdk\openjdk-jdk\test\jdk\java\beans\PropertyEditor\TestFontClassJava.java' \
[2024-11-28T08:54:29.376Z] -Dtest.src='C:\Jenkins\workspace\Test_openjdk21_hs_extended.openjdk_x86-64_windows_testList_0\aqa-tests\openjdk\openjdk-jdk\test\jdk\java\beans\PropertyEditor' \
[2024-11-28T08:54:29.376Z] -Dtest.src.path='C:\Jenkins\workspace\Test_openjdk21_hs_extended.openjdk_x86-64_windows_testList_0\aqa-tests\openjdk\openjdk-jdk\test\jdk\java\beans\PropertyEditor' \
[2024-11-28T08:54:29.376Z] -Dtest.classes='C:\Jenkins\workspace\Test_openjdk21_hs_extended.openjdk_x86-64_windows_testList_0\aqa-tests\TKG\output_17327770449218\jdk_beans_0\work\classes\0\java\beans\PropertyEditor\TestFontClassJava.d' \
[2024-11-28T08:54:29.376Z] -Dtest.class.path='C:\Jenkins\workspace\Test_openjdk21_hs_extended.openjdk_x86-64_windows_testList_0\aqa-tests\TKG\output_17327770449218\jdk_beans_0\work\classes\0\java\beans\PropertyEditor\TestFontClassJava.d' \
[2024-11-28T08:54:29.376Z] -Dtest.modules='java.compiler java.desktop jdk.compiler' \
[2024-11-28T08:54:29.376Z] --add-modules java.compiler,java.desktop,jdk.compiler \
[2024-11-28T08:54:29.376Z] -ea \
[2024-11-28T08:54:29.376Z] -esa \
[2024-11-28T08:54:29.376Z] -Xmx512m \
[2024-11-28T08:54:29.376Z] -XX:+UseCompressedOops \
[2024-11-28T08:54:29.376Z] '-Djava.library.path=c:\jenkins\workspace\Test_openjdk21_hs_extended.openjdk_x86-64_windows_testList_0\jdkbinary\openjdk-test-image\jdk\jtreg\native' \
[2024-11-28T08:54:29.376Z] com.sun.javatest.regtest.agent.MainWrapper 'C:\Jenkins\workspace\Test_openjdk21_hs_extended.openjdk_x86-64_windows_testList_0\aqa-tests\TKG\output_17327770449218\jdk_beans_0\work\java\beans\PropertyEditor\TestFontClassJava.d\main.0.jta'
[2024-11-28T08:54:29.376Z]
[2024-11-28T08:54:29.376Z] TEST RESULT: Failed. Execution failed: `main' threw exception: java.lang.Error: could not find editor for class java.awt.Font
[2024-11-28T08:54:29.376Z] --------------------------------------------------
[2024-11-28T08:54:29.376Z] TEST: java/beans/PropertyEditor/TestFontClass.java
[2024-11-28T08:54:29.376Z] TEST JDK: c:\jenkins\workspace\Test_openjdk21_hs_extended.openjdk_x86-64_windows_testList_0\jdkbinary\j2sdk-image
[2024-11-28T08:54:29.376Z]
[2024-11-28T08:54:29.376Z] ACTION: build -- Passed. Build successful
[2024-11-28T08:54:29.376Z] REASON: Named class compiled on demand
[2024-11-28T08:54:29.376Z] TIME: 2.728 seconds
[2024-11-28T08:54:29.376Z] messages:
[2024-11-28T08:54:29.376Z] command: build TestFontClass
[2024-11-28T08:54:29.376Z] reason: Named class compiled on demand
[2024-11-28T08:54:29.376Z] started: Thu Nov 28 08:54:25 UTC 2024
[2024-11-28T08:54:29.376Z] Test directory:
[2024-11-28T08:54:29.376Z] compile: TestFontClass
[2024-11-28T08:54:29.376Z] finished: Thu Nov 28 08:54:27 UTC 2024
[2024-11-28T08:54:29.376Z] elapsed time (seconds): 2.728
[2024-11-28T08:54:29.376Z]
[2024-11-28T08:54:29.376Z] ACTION: compile -- Passed. Compilation successful
[2024-11-28T08:54:29.376Z] REASON: .class file out of date or does not exist
[2024-11-28T08:54:29.376Z] TIME: 2.727 seconds
[2024-11-28T08:54:29.376Z] messages:
[2024-11-28T08:54:29.376Z] command: compile C:\Jenkins\workspace\Test_openjdk21_hs_extended.openjdk_x86-64_windows_testList_0\aqa-tests\openjdk\openjdk-jdk\test\jdk\java\beans\PropertyEditor\TestFontClass.java
[2024-11-28T08:54:29.376Z] reason: .class file out of date or does not exist
[2024-11-28T08:54:29.376Z] started: Thu Nov 28 08:54:25 UTC 2024
[2024-11-28T08:54:29.376Z] Additional options from @modules: --add-modules java.compiler,java.desktop,jdk.compiler
[2024-11-28T08:54:29.376Z] Mode: othervm
[2024-11-28T08:54:29.376Z] finished: Thu Nov 28 08:54:27 UTC 2024
[2024-11-28T08:54:29.376Z] elapsed time (seconds): 2.727
[2024-11-28T08:54:29.376Z] configuration:
[2024-11-28T08:54:29.376Z] javac compilation environment
[2024-11-28T08:54:29.376Z] add modules: java.compiler java.desktop jdk.compiler
[2024-11-28T08:54:29.376Z] source path: C:\Jenkins\workspace\Test_openjdk21_hs_extended.openjdk_x86-64_windows_testList_0\aqa-tests\openjdk\openjdk-jdk\test\jdk\java\beans\PropertyEditor
[2024-11-28T08:54:29.376Z] class path: C:\Jenkins\workspace\Test_openjdk21_hs_extended.openjdk_x86-64_windows_testList_0\aqa-tests\openjdk\openjdk-jdk\test\jdk\java\beans\PropertyEditor
[2024-11-28T08:54:29.376Z] C:\Jenkins\workspace\Test_openjdk21_hs_extended.openjdk_x86-64_windows_testList_0\aqa-tests\TKG\output_17327770449218\jdk_beans_0\work\classes\1\java\beans\PropertyEditor\TestFontClass.d
[2024-11-28T08:54:29.376Z]
[2024-11-28T08:54:29.376Z] rerun:
[2024-11-28T08:54:29.376Z] cd 'C:\Jenkins\workspace\Test_openjdk21_hs_extended.openjdk_x86-64_windows_testList_0\aqa-tests\TKG\output_17327770449218\jdk_beans_0\work\java\beans\PropertyEditor\TestFontClass' && \
[2024-11-28T08:54:29.376Z] PATH='C:\Program Files\Java\jdk-17.0.8.1+1\bin;C:\cygwin64\bin;C:\Windows\system32;C:\Windows;C:\Windows\System32\Wbem;C:\Windows\System32\WindowsPowerShell\v1.0;C:\Windows\System32\OpenSSH;C:\Program Files\dotnet;C:\Users\adoptopenjdk\AppData\Local\Microsoft\WindowsApps;C:\Strawberry\perl\bin;C:\Program Files\Git\cmd;C:\openjdk\jdk-8\bin;C:\apache-ant\apache-ant-1.10.15\bin;C:\Program Files (x86)\IncrediBuild;C:\Program Files (x86)\Windows Kits\10\Windows Performance Toolkit;C:\rust\bin;C:\Program Files\IcedTeaWEB\bin;C:\Program Files\Microsoft SQL Server\110\Tools\Binn;C:\Program Files (x86)\Microsoft SDKs\TypeScript\1.0;C:\Program Files\Microsoft SQL Server\120\Tools\Binn;C:\Users\jenkins\AppData\Local\Microsoft\WindowsApps' \
[2024-11-28T08:54:29.376Z] SystemDrive=C: \
[2024-11-28T08:54:29.376Z] SystemRoot='C:\Windows' \
[2024-11-28T08:54:29.376Z] TEMP='C:\Users\jenkins\AppData\Local\Temp\3' \
[2024-11-28T08:54:29.376Z] TMP='C:\Users\jenkins\AppData\Local\Temp\3' \
[2024-11-28T08:54:29.376Z] windir='C:\Windows' \
[2024-11-28T08:54:29.376Z] 'c:\jenkins\workspace\Test_openjdk21_hs_extended.openjdk_x86-64_windows_testList_0\jdkbinary\j2sdk-image\bin\javac' \
[2024-11-28T08:54:29.376Z] -J-ea \
[2024-11-28T08:54:29.376Z] -J-esa \
[2024-11-28T08:54:29.376Z] -J-Xmx512m \
[2024-11-28T08:54:29.376Z] -J-XX:+UseCompressedOops \
[2024-11-28T08:54:29.376Z] -J-Dtest.vm.opts='-ea -esa -Xmx512m -XX:+UseCompressedOops' \
[2024-11-28T08:54:29.376Z] -J-Dtest.tool.vm.opts='-J-ea -J-esa -J-Xmx512m -J-XX:+UseCompressedOops' \
[2024-11-28T08:54:29.376Z] -J-Dtest.compiler.opts= \
[2024-11-28T08:54:29.376Z] -J-Dtest.java.opts= \
[2024-11-28T08:54:29.376Z] -J-Dtest.jdk='c:\jenkins\workspace\Test_openjdk21_hs_extended.openjdk_x86-64_windows_testList_0\jdkbinary\j2sdk-image' \
[2024-11-28T08:54:29.376Z] -J-Dcompile.jdk='c:\jenkins\workspace\Test_openjdk21_hs_extended.openjdk_x86-64_windows_testList_0\jdkbinary\j2sdk-image' \
[2024-11-28T08:54:29.376Z] -J-Dtest.timeout.factor=8.0 \
[2024-11-28T08:54:29.376Z] -J-Dtest.nativepath='c:\jenkins\workspace\Test_openjdk21_hs_extended.openjdk_x86-64_windows_testList_0\jdkbinary\openjdk-test-image\jdk\jtreg\native' \
[2024-11-28T08:54:29.376Z] -J-Dtest.root='C:\Jenkins\workspace\Test_openjdk21_hs_extended.openjdk_x86-64_windows_testList_0\aqa-tests\openjdk\openjdk-jdk\test\jdk' \
[2024-11-28T08:54:29.376Z] -J-Dtest.name=java/beans/PropertyEditor/TestFontClass.java \
[2024-11-28T08:54:29.376Z] -J-Dtest.file='C:\Jenkins\workspace\Test_openjdk21_hs_extended.openjdk_x86-64_windows_testList_0\aqa-tests\openjdk\openjdk-jdk\test\jdk\java\beans\PropertyEditor\TestFontClass.java' \
[2024-11-28T08:54:29.377Z] -J-Dtest.src='C:\Jenkins\workspace\Test_openjdk21_hs_extended.openjdk_x86-64_windows_testList_0\aqa-tests\openjdk\openjdk-jdk\test\jdk\java\beans\PropertyEditor' \
[2024-11-28T08:54:29.377Z] -J-Dtest.src.path='C:\Jenkins\workspace\Test_openjdk21_hs_extended.openjdk_x86-64_windows_testList_0\aqa-tests\openjdk\openjdk-jdk\test\jdk\java\beans\PropertyEditor' \
[2024-11-28T08:54:29.377Z] -J-Dtest.classes='C:\Jenkins\workspace\Test_openjdk21_hs_extended.openjdk_x86-64_windows_testList_0\aqa-tests\TKG\output_17327770449218\jdk_beans_0\work\classes\1\java\beans\PropertyEditor\TestFontClass.d' \
[2024-11-28T08:54:29.377Z] -J-Dtest.class.path='C:\Jenkins\workspace\Test_openjdk21_hs_extended.openjdk_x86-64_windows_testList_0\aqa-tests\TKG\output_17327770449218\jdk_beans_0\work\classes\1\java\beans\PropertyEditor\TestFontClass.d' \
[2024-11-28T08:54:29.377Z] -J-Dtest.modules='java.compiler java.desktop jdk.compiler' \
[2024-11-28T08:54:29.377Z] --add-modules java.compiler,java.desktop,jdk.compiler \
[2024-11-28T08:54:29.377Z] -d 'C:\Jenkins\workspace\Test_openjdk21_hs_extended.openjdk_x86-64_windows_testList_0\aqa-tests\TKG\output_17327770449218\jdk_beans_0\work\classes\1\java\beans\PropertyEditor\TestFontClass.d' \
[2024-11-28T08:54:29.377Z] -sourcepath 'C:\Jenkins\workspace\Test_openjdk21_hs_extended.openjdk_x86-64_windows_testList_0\aqa-tests\openjdk\openjdk-jdk\test\jdk\java\beans\PropertyEditor' \
[2024-11-28T08:54:29.377Z] -classpath 'C:\Jenkins\workspace\Test_openjdk21_hs_extended.openjdk_x86-64_windows_testList_0\aqa-tests\openjdk\openjdk-jdk\test\jdk\java\beans\PropertyEditor;C:\Jenkins\workspace\Test_openjdk21_hs_extended.openjdk_x86-64_windows_testList_0\aqa-tests\TKG\output_17327770449218\jdk_beans_0\work\classes\1\java\beans\PropertyEditor\TestFontClass.d' 'C:\Jenkins\workspace\Test_openjdk21_hs_extended.openjdk_x86-64_windows_testList_0\aqa-tests\openjdk\openjdk-jdk\test\jdk\java\beans\PropertyEditor\TestFontClass.java'
[2024-11-28T08:54:29.377Z] STDOUT:
[2024-11-28T08:54:29.377Z] STDERR:
[2024-11-28T08:54:29.377Z] C:\Jenkins\workspace\Test_openjdk21_hs_extended.openjdk_x86-64_windows_testList_0\aqa-tests\openjdk\openjdk-jdk\test\jdk\java\beans\PropertyEditor\TestFontClass.java:40: warning: [removal] SecurityManager in java.lang has been deprecated and marked for removal
[2024-11-28T08:54:29.377Z] System.setSecurityManager(new SecurityManager());
[2024-11-28T08:54:29.377Z] ^
[2024-11-28T08:54:29.377Z] C:\Jenkins\workspace\Test_openjdk21_hs_extended.openjdk_x86-64_windows_testList_0\aqa-tests\openjdk\openjdk-jdk\test\jdk\java\beans\PropertyEditor\TestFontClass.java:40: warning: [removal] setSecurityManager(SecurityManager) in System has been deprecated and marked for removal
[2024-11-28T08:54:29.377Z] System.setSecurityManager(new SecurityManager());
[2024-11-28T08:54:29.377Z] ^
[2024-11-28T08:54:29.377Z] Note: C:\Jenkins\workspace\Test_openjdk21_hs_extended.openjdk_x86-64_windows_testList_0\aqa-tests\openjdk\openjdk-jdk\test\jdk\java\beans\PropertyEditor\TestEditor.java uses unchecked or unsafe operations.
[2024-11-28T08:54:29.377Z] Note: Recompile with -Xlint:unchecked for details.
[2024-11-28T08:54:29.377Z] 2 warnings
[2024-11-28T08:54:29.377Z]
[2024-11-28T08:54:29.377Z] ACTION: main -- Failed. Execution failed: `main' threw exception: java.lang.Error: could not find editor for class java.awt.Font
[2024-11-28T08:54:29.377Z] REASON: User specified action: run main/othervm -Djava.security.manager=allow TestFontClass
[2024-11-28T08:54:29.377Z] TIME: 1.332 seconds
[2024-11-28T08:54:29.377Z] messages:
[2024-11-28T08:54:29.377Z] command: main -Djava.security.manager=allow TestFontClass
[2024-11-28T08:54:29.377Z] reason: User specified action: run main/othervm -Djava.security.manager=allow TestFontClass
[2024-11-28T08:54:29.377Z] started: Thu Nov 28 08:54:27 UTC 2024
[2024-11-28T08:54:29.377Z] Mode: othervm [/othervm specified]
[2024-11-28T08:54:29.377Z] Additional options from @modules: --add-modules java.compiler,java.desktop,jdk.compiler
[2024-11-28T08:54:29.377Z] finished: Thu Nov 28 08:54:29 UTC 2024
[2024-11-28T08:54:29.377Z] elapsed time (seconds): 1.332
[2024-11-28T08:54:29.377Z] configuration:
[2024-11-28T08:54:29.377Z] Boot Layer
[2024-11-28T08:54:29.377Z] add modules: java.compiler java.desktop jdk.compiler
[2024-11-28T08:54:29.377Z]
[2024-11-28T08:54:29.377Z] STDOUT:
[2024-11-28T08:54:29.377Z] Property class: class java.awt.Font
[2024-11-28T08:54:29.377Z] STDERR:
[2024-11-28T08:54:29.377Z] WARNING: A terminally deprecated method in java.lang.System has been called
[2024-11-28T08:54:29.377Z] WARNING: System::setSecurityManager has been called by TestFontClass (file:/C:/Jenkins/workspace/Test_openjdk21_hs_extended.openjdk_x86-64_windows_testList_0/aqa-tests/TKG/output_17327770449218/jdk_beans_0/work/classes/1/java/beans/PropertyEditor/TestFontClass.d/)
[2024-11-28T08:54:29.377Z] WARNING: Please consider reporting this to the maintainers of TestFontClass
[2024-11-28T08:54:29.377Z] WARNING: System::setSecurityManager will be removed in a future release
[2024-11-28T08:54:29.377Z] java.lang.Error: could not find editor for class java.awt.Font
[2024-11-28T08:54:29.377Z] at TestEditor.<init>(TestEditor.java:35)
[2024-11-28T08:54:29.377Z] at TestFontClass.main(TestFontClass.java:41)
[2024-11-28T08:54:29.377Z] at java.base/jdk.internal.reflect.DirectMethodHandleAccessor.invoke(DirectMethodHandleAccessor.java:103)
[2024-11-28T08:54:29.377Z] at java.base/java.lang.reflect.Method.invoke(Method.java:580)
[2024-11-28T08:54:29.377Z] at com.sun.javatest.regtest.agent.MainWrapper$MainTask.run(MainWrapper.java:138)
[2024-11-28T08:54:29.377Z] at java.base/java.lang.Thread.run(Thread.java:1583)
[2024-11-28T08:54:29.377Z]
[2024-11-28T08:54:29.377Z] JavaTest Message: Test threw exception: java.lang.Error: could not find editor for class java.awt.Font
[2024-11-28T08:54:29.377Z] JavaTest Message: shutting down test
[2024-11-28T08:54:29.377Z]
[2024-11-28T08:54:29.377Z] STATUS:Failed.`main' threw exception: java.lang.Error: could not find editor for class java.awt.Font
[2024-11-28T08:54:29.377Z] rerun:
[2024-11-28T08:54:29.377Z] cd 'C:\Jenkins\workspace\Test_openjdk21_hs_extended.openjdk_x86-64_windows_testList_0\aqa-tests\TKG\output_17327770449218\jdk_beans_0\work\java\beans\PropertyEditor\TestFontClass' && \
[2024-11-28T08:54:29.377Z] PATH='C:\Program Files\Java\jdk-17.0.8.1+1\bin;C:\cygwin64\bin;C:\Windows\system32;C:\Windows;C:\Windows\System32\Wbem;C:\Windows\System32\WindowsPowerShell\v1.0;C:\Windows\System32\OpenSSH;C:\Program Files\dotnet;C:\Users\adoptopenjdk\AppData\Local\Microsoft\WindowsApps;C:\Strawberry\perl\bin;C:\Program Files\Git\cmd;C:\openjdk\jdk-8\bin;C:\apache-ant\apache-ant-1.10.15\bin;C:\Program Files (x86)\IncrediBuild;C:\Program Files (x86)\Windows Kits\10\Windows Performance Toolkit;C:\rust\bin;C:\Program Files\IcedTeaWEB\bin;C:\Program Files\Microsoft SQL Server\110\Tools\Binn;C:\Program Files (x86)\Microsoft SDKs\TypeScript\1.0;C:\Program Files\Microsoft SQL Server\120\Tools\Binn;C:\Users\jenkins\AppData\Local\Microsoft\WindowsApps' \
[2024-11-28T08:54:29.377Z] SystemDrive=C: \
[2024-11-28T08:54:29.377Z] SystemRoot='C:\Windows' \
[2024-11-28T08:54:29.377Z] TEMP='C:\Users\jenkins\AppData\Local\Temp\3' \
[2024-11-28T08:54:29.377Z] TMP='C:\Users\jenkins\AppData\Local\Temp\3' \
[2024-11-28T08:54:29.377Z] windir='C:\Windows' \
[2024-11-28T08:54:29.377Z] CLASSPATH='C:\Jenkins\workspace\Test_openjdk21_hs_extended.openjdk_x86-64_windows_testList_0\aqa-tests\TKG\output_17327770449218\jdk_beans_0\work\classes\1\java\beans\PropertyEditor\TestFontClass.d;C:\Jenkins\workspace\Test_openjdk21_hs_extended.openjdk_x86-64_windows_testList_0\aqa-tests\openjdk\openjdk-jdk\test\jdk\java\beans\PropertyEditor;C:\Jenkins\workspace\Test_openjdk21_hs_extended.openjdk_x86-64_windows_testList_0\jvmtest\openjdk\jtreg\lib\javatest.jar;C:\Jenkins\workspace\Test_openjdk21_hs_extended.openjdk_x86-64_windows_testList_0\jvmtest\openjdk\jtreg\lib\jtreg.jar' \
[2024-11-28T08:54:29.377Z] 'c:\jenkins\workspace\Test_openjdk21_hs_extended.openjdk_x86-64_windows_testList_0\jdkbinary\j2sdk-image\bin\java' \
[2024-11-28T08:54:29.377Z] -Dtest.vm.opts='-ea -esa -Xmx512m -XX:+UseCompressedOops' \
[2024-11-28T08:54:29.377Z] -Dtest.tool.vm.opts='-J-ea -J-esa -J-Xmx512m -J-XX:+UseCompressedOops' \
[2024-11-28T08:54:29.377Z] -Dtest.compiler.opts= \
[2024-11-28T08:54:29.377Z] -Dtest.java.opts= \
[2024-11-28T08:54:29.377Z] -Dtest.jdk='c:\jenkins\workspace\Test_openjdk21_hs_extended.openjdk_x86-64_windows_testList_0\jdkbinary\j2sdk-image' \
[2024-11-28T08:54:29.377Z] -Dcompile.jdk='c:\jenkins\workspace\Test_openjdk21_hs_extended.openjdk_x86-64_windows_testList_0\jdkbinary\j2sdk-image' \
[2024-11-28T08:54:29.377Z] -Dtest.timeout.factor=8.0 \
[2024-11-28T08:54:29.377Z] -Dtest.nativepath='c:\jenkins\workspace\Test_openjdk21_hs_extended.openjdk_x86-64_windows_testList_0\jdkbinary\openjdk-test-image\jdk\jtreg\native' \
[2024-11-28T08:54:29.377Z] -Dtest.root='C:\Jenkins\workspace\Test_openjdk21_hs_extended.openjdk_x86-64_windows_testList_0\aqa-tests\openjdk\openjdk-jdk\test\jdk' \
[2024-11-28T08:54:29.377Z] -Dtest.name=java/beans/PropertyEditor/TestFontClass.java \
[2024-11-28T08:54:29.377Z] -Dtest.file='C:\Jenkins\workspace\Test_openjdk21_hs_extended.openjdk_x86-64_windows_testList_0\aqa-tests\openjdk\openjdk-jdk\test\jdk\java\beans\PropertyEditor\TestFontClass.java' \
[2024-11-28T08:54:29.377Z] -Dtest.src='C:\Jenkins\workspace\Test_openjdk21_hs_extended.openjdk_x86-64_windows_testList_0\aqa-tests\openjdk\openjdk-jdk\test\jdk\java\beans\PropertyEditor' \
[2024-11-28T08:54:29.377Z] -Dtest.src.path='C:\Jenkins\workspace\Test_openjdk21_hs_extended.openjdk_x86-64_windows_testList_0\aqa-tests\openjdk\openjdk-jdk\test\jdk\java\beans\PropertyEditor' \
[2024-11-28T08:54:29.378Z] -Dtest.classes='C:\Jenkins\workspace\Test_openjdk21_hs_extended.openjdk_x86-64_windows_testList_0\aqa-tests\TKG\output_17327770449218\jdk_beans_0\work\classes\1\java\beans\PropertyEditor\TestFontClass.d' \
[2024-11-28T08:54:29.378Z] -Dtest.class.path='C:\Jenkins\workspace\Test_openjdk21_hs_extended.openjdk_x86-64_windows_testList_0\aqa-tests\TKG\output_17327770449218\jdk_beans_0\work\classes\1\java\beans\PropertyEditor\TestFontClass.d' \
[2024-11-28T08:54:29.378Z] -Dtest.modules='java.compiler java.desktop jdk.compiler' \
[2024-11-28T08:54:29.378Z] --add-modules java.compiler,java.desktop,jdk.compiler \
[2024-11-28T08:54:29.378Z] -ea \
[2024-11-28T08:54:29.378Z] -esa \
[2024-11-28T08:54:29.378Z] -Xmx512m \
[2024-11-28T08:54:29.378Z] -XX:+UseCompressedOops \
[2024-11-28T08:54:29.378Z] '-Djava.library.path=c:\jenkins\workspace\Test_openjdk21_hs_extended.openjdk_x86-64_windows_testList_0\jdkbinary\openjdk-test-image\jdk\jtreg\native' \
[2024-11-28T08:54:29.378Z] -Djava.security.manager=allow \
[2024-11-28T08:54:29.378Z] com.sun.javatest.regtest.agent.MainWrapper 'C:\Jenkins\workspace\Test_openjdk21_hs_extended.openjdk_x86-64_windows_testList_0\aqa-tests\TKG\output_17327770449218\jdk_beans_0\work\java\beans\PropertyEditor\TestFontClass.d\main.0.jta'
[2024-11-28T08:54:29.378Z]
[2024-11-28T08:54:29.378Z] TEST RESULT: Failed. Execution failed: `main' threw exception: java.lang.Error: could not find editor for class java.awt.Font
[2024-11-28T08:54:29.378Z] --------------------------------------------------
[2024-11-28T08:54:29.741Z] TEST: java/beans/PropertyEditor/TestFontClassNull.java
[2024-11-28T08:54:29.741Z] TEST JDK: c:\jenkins\workspace\Test_openjdk21_hs_extended.openjdk_x86-64_windows_testList_0\jdkbinary\j2sdk-image
[2024-11-28T08:54:29.741Z]
[2024-11-28T08:54:29.741Z] ACTION: build -- Passed. Build successful
[2024-11-28T08:54:29.741Z] REASON: Named class compiled on demand
[2024-11-28T08:54:29.741Z] TIME: 2.694 seconds
[2024-11-28T08:54:29.741Z] messages:
[2024-11-28T08:54:29.741Z] command: build TestFontClassNull
[2024-11-28T08:54:29.741Z] reason: Named class compiled on demand
[2024-11-28T08:54:29.741Z] started: Thu Nov 28 08:54:25 UTC 2024
[2024-11-28T08:54:29.741Z] Test directory:
[2024-11-28T08:54:29.741Z] compile: TestFontClassNull
[2024-11-28T08:54:29.741Z] finished: Thu Nov 28 08:54:28 UTC 2024
[2024-11-28T08:54:29.741Z] elapsed time (seconds): 2.694
[2024-11-28T08:54:29.741Z]
[2024-11-28T08:54:29.741Z] ACTION: compile -- Passed. Compilation successful
[2024-11-28T08:54:29.741Z] REASON: .class file out of date or does not exist
[2024-11-28T08:54:29.741Z] TIME: 2.693 seconds
[2024-11-28T08:54:29.741Z] messages:
[2024-11-28T08:54:29.741Z] command: compile C:\Jenkins\workspace\Test_openjdk21_hs_extended.openjdk_x86-64_windows_testList_0\aqa-tests\openjdk\openjdk-jdk\test\jdk\java\beans\PropertyEditor\TestFontClassNull.java
[2024-11-28T08:54:29.741Z] reason: .class file out of date or does not exist
[2024-11-28T08:54:29.741Z] started: Thu Nov 28 08:54:25 UTC 2024
[2024-11-28T08:54:29.741Z] Additional options from @modules: --add-modules java.compiler,java.desktop,jdk.compiler
[2024-11-28T08:54:29.741Z] Mode: othervm
[2024-11-28T08:54:29.741Z] finished: Thu Nov 28 08:54:28 UTC 2024
[2024-11-28T08:54:29.741Z] elapsed time (seconds): 2.693
[2024-11-28T08:54:29.741Z] configuration:
[2024-11-28T08:54:29.741Z] javac compilation environment
[2024-11-28T08:54:29.741Z] add modules: java.compiler java.desktop jdk.compiler
[2024-11-28T08:54:29.741Z] source path: C:\Jenkins\workspace\Test_openjdk21_hs_extended.openjdk_x86-64_windows_testList_0\aqa-tests\openjdk\openjdk-jdk\test\jdk\java\beans\PropertyEditor
[2024-11-28T08:54:29.741Z] class path: C:\Jenkins\workspace\Test_openjdk21_hs_extended.openjdk_x86-64_windows_testList_0\aqa-tests\openjdk\openjdk-jdk\test\jdk\java\beans\PropertyEditor
[2024-11-28T08:54:29.741Z] C:\Jenkins\workspace\Test_openjdk21_hs_extended.openjdk_x86-64_windows_testList_0\aqa-tests\TKG\output_17327770449218\jdk_beans_0\work\classes\2\java\beans\PropertyEditor\TestFontClassNull.d
[2024-11-28T08:54:29.741Z]
[2024-11-28T08:54:29.741Z] rerun:
[2024-11-28T08:54:29.741Z] cd 'C:\Jenkins\workspace\Test_openjdk21_hs_extended.openjdk_x86-64_windows_testList_0\aqa-tests\TKG\output_17327770449218\jdk_beans_0\work\java\beans\PropertyEditor\TestFontClassNull' && \
[2024-11-28T08:54:29.741Z] PATH='C:\Program Files\Java\jdk-17.0.8.1+1\bin;C:\cygwin64\bin;C:\Windows\system32;C:\Windows;C:\Windows\System32\Wbem;C:\Windows\System32\WindowsPowerShell\v1.0;C:\Windows\System32\OpenSSH;C:\Program Files\dotnet;C:\Users\adoptopenjdk\AppData\Local\Microsoft\WindowsApps;C:\Strawberry\perl\bin;C:\Program Files\Git\cmd;C:\openjdk\jdk-8\bin;C:\apache-ant\apache-ant-1.10.15\bin;C:\Program Files (x86)\IncrediBuild;C:\Program Files (x86)\Windows Kits\10\Windows Performance Toolkit;C:\rust\bin;C:\Program Files\IcedTeaWEB\bin;C:\Program Files\Microsoft SQL Server\110\Tools\Binn;C:\Program Files (x86)\Microsoft SDKs\TypeScript\1.0;C:\Program Files\Microsoft SQL Server\120\Tools\Binn;C:\Users\jenkins\AppData\Local\Microsoft\WindowsApps' \
[2024-11-28T08:54:29.741Z] SystemDrive=C: \
[2024-11-28T08:54:29.741Z] SystemRoot='C:\Windows' \
[2024-11-28T08:54:29.741Z] TEMP='C:\Users\jenkins\AppData\Local\Temp\3' \
[2024-11-28T08:54:29.741Z] TMP='C:\Users\jenkins\AppData\Local\Temp\3' \
[2024-11-28T08:54:29.741Z] windir='C:\Windows' \
[2024-11-28T08:54:29.741Z] 'c:\jenkins\workspace\Test_openjdk21_hs_extended.openjdk_x86-64_windows_testList_0\jdkbinary\j2sdk-image\bin\javac' \
[2024-11-28T08:54:29.741Z] -J-ea \
[2024-11-28T08:54:29.741Z] -J-esa \
[2024-11-28T08:54:29.741Z] -J-Xmx512m \
[2024-11-28T08:54:29.741Z] -J-XX:+UseCompressedOops \
[2024-11-28T08:54:29.741Z] -J-Dtest.vm.opts='-ea -esa -Xmx512m -XX:+UseCompressedOops' \
[2024-11-28T08:54:29.741Z] -J-Dtest.tool.vm.opts='-J-ea -J-esa -J-Xmx512m -J-XX:+UseCompressedOops' \
[2024-11-28T08:54:29.741Z] -J-Dtest.compiler.opts= \
[2024-11-28T08:54:29.741Z] -J-Dtest.java.opts= \
[2024-11-28T08:54:29.741Z] -J-Dtest.jdk='c:\jenkins\workspace\Test_openjdk21_hs_extended.openjdk_x86-64_windows_testList_0\jdkbinary\j2sdk-image' \
[2024-11-28T08:54:29.741Z] -J-Dcompile.jdk='c:\jenkins\workspace\Test_openjdk21_hs_extended.openjdk_x86-64_windows_testList_0\jdkbinary\j2sdk-image' \
[2024-11-28T08:54:29.741Z] -J-Dtest.timeout.factor=8.0 \
[2024-11-28T08:54:29.741Z] -J-Dtest.nativepath='c:\jenkins\workspace\Test_openjdk21_hs_extended.openjdk_x86-64_windows_testList_0\jdkbinary\openjdk-test-image\jdk\jtreg\native' \
[2024-11-28T08:54:29.741Z] -J-Dtest.root='C:\Jenkins\workspace\Test_openjdk21_hs_extended.openjdk_x86-64_windows_testList_0\aqa-tests\openjdk\openjdk-jdk\test\jdk' \
[2024-11-28T08:54:29.741Z] -J-Dtest.name=java/beans/PropertyEditor/TestFontClassNull.java \
[2024-11-28T08:54:29.741Z] -J-Dtest.file='C:\Jenkins\workspace\Test_openjdk21_hs_extended.openjdk_x86-64_windows_testList_0\aqa-tests\openjdk\openjdk-jdk\test\jdk\java\beans\PropertyEditor\TestFontClassNull.java' \
[2024-11-28T08:54:29.741Z] -J-Dtest.src='C:\Jenkins\workspace\Test_openjdk21_hs_extended.openjdk_x86-64_windows_testList_0\aqa-tests\openjdk\openjdk-jdk\test\jdk\java\beans\PropertyEditor' \
[2024-11-28T08:54:29.741Z] -J-Dtest.src.path='C:\Jenkins\workspace\Test_openjdk21_hs_extended.openjdk_x86-64_windows_testList_0\aqa-tests\openjdk\openjdk-jdk\test\jdk\java\beans\PropertyEditor' \
[2024-11-28T08:54:29.741Z] -J-Dtest.classes='C:\Jenkins\workspace\Test_openjdk21_hs_extended.openjdk_x86-64_windows_testList_0\aqa-tests\TKG\output_17327770449218\jdk_beans_0\work\classes\2\java\beans\PropertyEditor\TestFontClassNull.d' \
[2024-11-28T08:54:29.741Z] -J-Dtest.class.path='C:\Jenkins\workspace\Test_openjdk21_hs_extended.openjdk_x86-64_windows_testList_0\aqa-tests\TKG\output_17327770449218\jdk_beans_0\work\classes\2\java\beans\PropertyEditor\TestFontClassNull.d' \
[2024-11-28T08:54:29.741Z] -J-Dtest.modules='java.compiler java.desktop jdk.compiler' \
[2024-11-28T08:54:29.741Z] --add-modules java.compiler,java.desktop,jdk.compiler \
[2024-11-28T08:54:29.741Z] -d 'C:\Jenkins\workspace\Test_openjdk21_hs_extended.openjdk_x86-64_windows_testList_0\aqa-tests\TKG\output_17327770449218\jdk_beans_0\work\classes\2\java\beans\PropertyEditor\TestFontClassNull.d' \
[2024-11-28T08:54:29.741Z] -sourcepath 'C:\Jenkins\workspace\Test_openjdk21_hs_extended.openjdk_x86-64_windows_testList_0\aqa-tests\openjdk\openjdk-jdk\test\jdk\java\beans\PropertyEditor' \
[2024-11-28T08:54:29.741Z] -classpath 'C:\Jenkins\workspace\Test_openjdk21_hs_extended.openjdk_x86-64_windows_testList_0\aqa-tests\openjdk\openjdk-jdk\test\jdk\java\beans\PropertyEditor;C:\Jenkins\workspace\Test_openjdk21_hs_extended.openjdk_x86-64_windows_testList_0\aqa-tests\TKG\output_17327770449218\jdk_beans_0\work\classes\2\java\beans\PropertyEditor\TestFontClassNull.d' 'C:\Jenkins\workspace\Test_openjdk21_hs_extended.openjdk_x86-64_windows_testList_0\aqa-tests\openjdk\openjdk-jdk\test\jdk\java\beans\PropertyEditor\TestFontClassNull.java'
[2024-11-28T08:54:29.741Z] STDOUT:
[2024-11-28T08:54:29.741Z] STDERR:
[2024-11-28T08:54:29.742Z] Note: C:\Jenkins\workspace\Test_openjdk21_hs_extended.openjdk_x86-64_windows_testList_0\aqa-tests\openjdk\openjdk-jdk\test\jdk\java\beans\PropertyEditor\TestEditor.java uses unchecked or unsafe operations.
[2024-11-28T08:54:29.742Z] Note: Recompile with -Xlint:unchecked for details.
[2024-11-28T08:54:29.742Z]
[2024-11-28T08:54:29.742Z] ACTION: main -- Failed. Execution failed: `main' threw exception: java.lang.Error: could not find editor for class java.awt.Font
[2024-11-28T08:54:29.742Z] REASON: Assumed action based on file name: run main TestFontClassNull
[2024-11-28T08:54:29.742Z] TIME: 0.669 seconds
[2024-11-28T08:54:29.742Z] messages:
[2024-11-28T08:54:29.742Z] command: main TestFontClassNull
[2024-11-28T08:54:29.742Z] reason: Assumed action based on file name: run main TestFontClassNull
[2024-11-28T08:54:29.742Z] started: Thu Nov 28 08:54:28 UTC 2024
[2024-11-28T08:54:29.742Z] Mode: othervm
[2024-11-28T08:54:29.742Z] Additional options from @modules: --add-modules java.compiler,java.desktop,jdk.compiler
[2024-11-28T08:54:29.742Z] finished: Thu Nov 28 08:54:29 UTC 2024
[2024-11-28T08:54:29.742Z] elapsed time (seconds): 0.669
[2024-11-28T08:54:29.742Z] configuration:
[2024-11-28T08:54:29.742Z] Boot Layer
[2024-11-28T08:54:29.742Z] add modules: java.compiler java.desktop jdk.compiler
[2024-11-28T08:54:29.742Z]
[2024-11-28T08:54:29.742Z] STDOUT:
[2024-11-28T08:54:29.742Z] Property class: class java.awt.Font
[2024-11-28T08:54:29.742Z] STDERR:
[2024-11-28T08:54:29.742Z] java.lang.Error: could not find editor for class java.awt.Font
[2024-11-28T08:54:29.742Z] at TestEditor.<init>(TestEditor.java:35)
[2024-11-28T08:54:29.742Z] at TestFontClassNull.main(TestFontClassNull.java:39)
[2024-11-28T08:54:29.742Z] at java.base/jdk.internal.reflect.DirectMethodHandleAccessor.invoke(DirectMethodHandleAccessor.java:103)
[2024-11-28T08:54:29.742Z] at java.base/java.lang.reflect.Method.invoke(Method.java:580)
[2024-11-28T08:54:29.742Z] at com.sun.javatest.regtest.agent.MainWrapper$MainTask.run(MainWrapper.java:138)
[2024-11-28T08:54:29.742Z] at java.base/java.lang.Thread.run(Thread.java:1583)
[2024-11-28T08:54:29.742Z]
[2024-11-28T08:54:29.742Z] JavaTest Message: Test threw exception: java.lang.Error: could not find editor for class java.awt.Font
[2024-11-28T08:54:29.742Z] JavaTest Message: shutting down test
[2024-11-28T08:54:29.742Z]
[2024-11-28T08:54:29.742Z] STATUS:Failed.`main' threw exception: java.lang.Error: could not find editor for class java.awt.Font
[2024-11-28T08:54:29.742Z] rerun:
[2024-11-28T08:54:29.742Z] cd 'C:\Jenkins\workspace\Test_openjdk21_hs_extended.openjdk_x86-64_windows_testList_0\aqa-tests\TKG\output_17327770449218\jdk_beans_0\work\java\beans\PropertyEditor\TestFontClassNull' && \
[2024-11-28T08:54:29.742Z] PATH='C:\Program Files\Java\jdk-17.0.8.1+1\bin;C:\cygwin64\bin;C:\Windows\system32;C:\Windows;C:\Windows\System32\Wbem;C:\Windows\System32\WindowsPowerShell\v1.0;C:\Windows\System32\OpenSSH;C:\Program Files\dotnet;C:\Users\adoptopenjdk\AppData\Local\Microsoft\WindowsApps;C:\Strawberry\perl\bin;C:\Program Files\Git\cmd;C:\openjdk\jdk-8\bin;C:\apache-ant\apache-ant-1.10.15\bin;C:\Program Files (x86)\IncrediBuild;C:\Program Files (x86)\Windows Kits\10\Windows Performance Toolkit;C:\rust\bin;C:\Program Files\IcedTeaWEB\bin;C:\Program Files\Microsoft SQL Server\110\Tools\Binn;C:\Program Files (x86)\Microsoft SDKs\TypeScript\1.0;C:\Program Files\Microsoft SQL Server\120\Tools\Binn;C:\Users\jenkins\AppData\Local\Microsoft\WindowsApps' \
[2024-11-28T08:54:29.742Z] SystemDrive=C: \
[2024-11-28T08:54:29.742Z] SystemRoot='C:\Windows' \
[2024-11-28T08:54:29.742Z] TEMP='C:\Users\jenkins\AppData\Local\Temp\3' \
[2024-11-28T08:54:29.742Z] TMP='C:\Users\jenkins\AppData\Local\Temp\3' \
[2024-11-28T08:54:29.742Z] windir='C:\Windows' \
[2024-11-28T08:54:29.742Z] CLASSPATH='C:\Jenkins\workspace\Test_openjdk21_hs_extended.openjdk_x86-64_windows_testList_0\aqa-tests\TKG\output_17327770449218\jdk_beans_0\work\classes\2\java\beans\PropertyEditor\TestFontClassNull.d;C:\Jenkins\workspace\Test_openjdk21_hs_extended.openjdk_x86-64_windows_testList_0\aqa-tests\openjdk\openjdk-jdk\test\jdk\java\beans\PropertyEditor;C:\Jenkins\workspace\Test_openjdk21_hs_extended.openjdk_x86-64_windows_testList_0\jvmtest\openjdk\jtreg\lib\javatest.jar;C:\Jenkins\workspace\Test_openjdk21_hs_extended.openjdk_x86-64_windows_testList_0\jvmtest\openjdk\jtreg\lib\jtreg.jar' \
[2024-11-28T08:54:29.742Z] 'c:\jenkins\workspace\Test_openjdk21_hs_extended.openjdk_x86-64_windows_testList_0\jdkbinary\j2sdk-image\bin\java' \
[2024-11-28T08:54:29.742Z] -Dtest.vm.opts='-ea -esa -Xmx512m -XX:+UseCompressedOops' \
[2024-11-28T08:54:29.742Z] -Dtest.tool.vm.opts='-J-ea -J-esa -J-Xmx512m -J-XX:+UseCompressedOops' \
[2024-11-28T08:54:29.742Z] -Dtest.compiler.opts= \
[2024-11-28T08:54:29.742Z] -Dtest.java.opts= \
[2024-11-28T08:54:29.742Z] -Dtest.jdk='c:\jenkins\workspace\Test_openjdk21_hs_extended.openjdk_x86-64_windows_testList_0\jdkbinary\j2sdk-image' \
[2024-11-28T08:54:29.742Z] -Dcompile.jdk='c:\jenkins\workspace\Test_openjdk21_hs_extended.openjdk_x86-64_windows_testList_0\jdkbinary\j2sdk-image' \
[2024-11-28T08:54:29.742Z] -Dtest.timeout.factor=8.0 \
[2024-11-28T08:54:29.742Z] -Dtest.nativepath='c:\jenkins\workspace\Test_openjdk21_hs_extended.openjdk_x86-64_windows_testList_0\jdkbinary\openjdk-test-image\jdk\jtreg\native' \
[2024-11-28T08:54:29.742Z] -Dtest.root='C:\Jenkins\workspace\Test_openjdk21_hs_extended.openjdk_x86-64_windows_testList_0\aqa-tests\openjdk\openjdk-jdk\test\jdk' \
[2024-11-28T08:54:29.742Z] -Dtest.name=java/beans/PropertyEditor/TestFontClassNull.java \
[2024-11-28T08:54:29.742Z] -Dtest.file='C:\Jenkins\workspace\Test_openjdk21_hs_extended.openjdk_x86-64_windows_testList_0\aqa-tests\openjdk\openjdk-jdk\test\jdk\java\beans\PropertyEditor\TestFontClassNull.java' \
[2024-11-28T08:54:29.742Z] -Dtest.src='C:\Jenkins\workspace\Test_openjdk21_hs_extended.openjdk_x86-64_windows_testList_0\aqa-tests\openjdk\openjdk-jdk\test\jdk\java\beans\PropertyEditor' \
[2024-11-28T08:54:29.742Z] -Dtest.src.path='C:\Jenkins\workspace\Test_openjdk21_hs_extended.openjdk_x86-64_windows_testList_0\aqa-tests\openjdk\openjdk-jdk\test\jdk\java\beans\PropertyEditor' \
[2024-11-28T08:54:29.742Z] -Dtest.classes='C:\Jenkins\workspace\Test_openjdk21_hs_extended.openjdk_x86-64_windows_testList_0\aqa-tests\TKG\output_17327770449218\jdk_beans_0\work\classes\2\java\beans\PropertyEditor\TestFontClassNull.d' \
[2024-11-28T08:54:29.742Z] -Dtest.class.path='C:\Jenkins\workspace\Test_openjdk21_hs_extended.openjdk_x86-64_windows_testList_0\aqa-tests\TKG\output_17327770449218\jdk_beans_0\work\classes\2\java\beans\PropertyEditor\TestFontClassNull.d' \
[2024-11-28T08:54:29.742Z] -Dtest.modules='java.compiler java.desktop jdk.compiler' \
[2024-11-28T08:54:29.742Z] --add-modules java.compiler,java.desktop,jdk.compiler \
[2024-11-28T08:54:29.742Z] -ea \
[2024-11-28T08:54:29.742Z] -esa \
[2024-11-28T08:54:29.742Z] -Xmx512m \
[2024-11-28T08:54:29.742Z] -XX:+UseCompressedOops \
[2024-11-28T08:54:29.742Z] '-Djava.library.path=c:\jenkins\workspace\Test_openjdk21_hs_extended.openjdk_x86-64_windows_testList_0\jdkbinary\openjdk-test-image\jdk\jtreg\native' \
[2024-11-28T08:54:29.742Z] com.sun.javatest.regtest.agent.MainWrapper 'C:\Jenkins\workspace\Test_openjdk21_hs_extended.openjdk_x86-64_windows_testList_0\aqa-tests\TKG\output_17327770449218\jdk_beans_0\work\java\beans\PropertyEditor\TestFontClassNull.d\main.0.jta'
[2024-11-28T08:54:29.742Z]
[2024-11-28T08:54:29.742Z] TEST RESULT: Failed. Execution failed: `main' threw exception: java.lang.Error: could not find editor for class java.awt.Font
[2024-11-28T08:54:29.742Z] --------------------------------------------------
[2024-11-28T08:54:33.507Z] TEST: java/beans/PropertyEditor/TestFontClassValue.java
[2024-11-28T08:54:33.507Z] TEST JDK: c:\jenkins\workspace\Test_openjdk21_hs_extended.openjdk_x86-64_windows_testList_0\jdkbinary\j2sdk-image
[2024-11-28T08:54:33.507Z]
[2024-11-28T08:54:33.507Z] ACTION: build -- Passed. Build successful
[2024-11-28T08:54:33.507Z] REASON: Named class compiled on demand
[2024-11-28T08:54:33.507Z] TIME: 2.943 seconds
[2024-11-28T08:54:33.507Z] messages:
[2024-11-28T08:54:33.507Z] command: build TestFontClassValue
[2024-11-28T08:54:33.507Z] reason: Named class compiled on demand
[2024-11-28T08:54:33.507Z] started: Thu Nov 28 08:54:29 UTC 2024
[2024-11-28T08:54:33.507Z] Test directory:
[2024-11-28T08:54:33.507Z] compile: TestFontClassValue
[2024-11-28T08:54:33.507Z] finished: Thu Nov 28 08:54:32 UTC 2024
[2024-11-28T08:54:33.507Z] elapsed time (seconds): 2.943
[2024-11-28T08:54:33.507Z]
[2024-11-28T08:54:33.507Z] ACTION: compile -- Passed. Compilation successful
[2024-11-28T08:54:33.507Z] REASON: .class file out of date or does not exist
[2024-11-28T08:54:33.507Z] TIME: 2.942 seconds
[2024-11-28T08:54:33.507Z] messages:
[2024-11-28T08:54:33.507Z] command: compile C:\Jenkins\workspace\Test_openjdk21_hs_extended.openjdk_x86-64_windows_testList_0\aqa-tests\openjdk\openjdk-jdk\test\jdk\java\beans\PropertyEditor\TestFontClassValue.java
[2024-11-28T08:54:33.507Z] reason: .class file out of date or does not exist
[2024-11-28T08:54:33.507Z] started: Thu Nov 28 08:54:29 UTC 2024
[2024-11-28T08:54:33.507Z] Additional options from @modules: --add-modules java.compiler,java.desktop,jdk.compiler
[2024-11-28T08:54:33.507Z] Mode: othervm
[2024-11-28T08:54:33.507Z] finished: Thu Nov 28 08:54:32 UTC 2024
[2024-11-28T08:54:33.507Z] elapsed time (seconds): 2.942
[2024-11-28T08:54:33.507Z] configuration:
[2024-11-28T08:54:33.507Z] javac compilation environment
[2024-11-28T08:54:33.507Z] add modules: java.compiler java.desktop jdk.compiler
[2024-11-28T08:54:33.507Z] source path: C:\Jenkins\workspace\Test_openjdk21_hs_extended.openjdk_x86-64_windows_testList_0\aqa-tests\openjdk\openjdk-jdk\test\jdk\java\beans\PropertyEditor
[2024-11-28T08:54:33.507Z] class path: C:\Jenkins\workspace\Test_openjdk21_hs_extended.openjdk_x86-64_windows_testList_0\aqa-tests\openjdk\openjdk-jdk\test\jdk\java\beans\PropertyEditor
[2024-11-28T08:54:33.507Z] C:\Jenkins\workspace\Test_openjdk21_hs_extended.openjdk_x86-64_windows_testList_0\aqa-tests\TKG\output_17327770449218\jdk_beans_0\work\classes\0\java\beans\PropertyEditor\TestFontClassValue.d
[2024-11-28T08:54:33.507Z]
[2024-11-28T08:54:33.507Z] rerun:
[2024-11-28T08:54:33.507Z] cd 'C:\Jenkins\workspace\Test_openjdk21_hs_extended.openjdk_x86-64_windows_testList_0\aqa-tests\TKG\output_17327770449218\jdk_beans_0\work\java\beans\PropertyEditor\TestFontClassValue' && \
[2024-11-28T08:54:33.507Z] PATH='C:\Program Files\Java\jdk-17.0.8.1+1\bin;C:\cygwin64\bin;C:\Windows\system32;C:\Windows;C:\Windows\System32\Wbem;C:\Windows\System32\WindowsPowerShell\v1.0;C:\Windows\System32\OpenSSH;C:\Program Files\dotnet;C:\Users\adoptopenjdk\AppData\Local\Microsoft\WindowsApps;C:\Strawberry\perl\bin;C:\Program Files\Git\cmd;C:\openjdk\jdk-8\bin;C:\apache-ant\apache-ant-1.10.15\bin;C:\Program Files (x86)\IncrediBuild;C:\Program Files (x86)\Windows Kits\10\Windows Performance Toolkit;C:\rust\bin;C:\Program Files\IcedTeaWEB\bin;C:\Program Files\Microsoft SQL Server\110\Tools\Binn;C:\Program Files (x86)\Microsoft SDKs\TypeScript\1.0;C:\Program Files\Microsoft SQL Server\120\Tools\Binn;C:\Users\jenkins\AppData\Local\Microsoft\WindowsApps' \
[2024-11-28T08:54:33.507Z] SystemDrive=C: \
[2024-11-28T08:54:33.507Z] SystemRoot='C:\Windows' \
[2024-11-28T08:54:33.507Z] TEMP='C:\Users\jenkins\AppData\Local\Temp\3' \
[2024-11-28T08:54:33.507Z] TMP='C:\Users\jenkins\AppData\Local\Temp\3' \
[2024-11-28T08:54:33.507Z] windir='C:\Windows' \
[2024-11-28T08:54:33.507Z] 'c:\jenkins\workspace\Test_openjdk21_hs_extended.openjdk_x86-64_windows_testList_0\jdkbinary\j2sdk-image\bin\javac' \
[2024-11-28T08:54:33.507Z] -J-ea \
[2024-11-28T08:54:33.507Z] -J-esa \
[2024-11-28T08:54:33.507Z] -J-Xmx512m \
[2024-11-28T08:54:33.507Z] -J-XX:+UseCompressedOops \
[2024-11-28T08:54:33.507Z] -J-Dtest.vm.opts='-ea -esa -Xmx512m -XX:+UseCompressedOops' \
[2024-11-28T08:54:33.507Z] -J-Dtest.tool.vm.opts='-J-ea -J-esa -J-Xmx512m -J-XX:+UseCompressedOops' \
[2024-11-28T08:54:33.507Z] -J-Dtest.compiler.opts= \
[2024-11-28T08:54:33.507Z] -J-Dtest.java.opts= \
[2024-11-28T08:54:33.507Z] -J-Dtest.jdk='c:\jenkins\workspace\Test_openjdk21_hs_extended.openjdk_x86-64_windows_testList_0\jdkbinary\j2sdk-image' \
[2024-11-28T08:54:33.507Z] -J-Dcompile.jdk='c:\jenkins\workspace\Test_openjdk21_hs_extended.openjdk_x86-64_windows_testList_0\jdkbinary\j2sdk-image' \
[2024-11-28T08:54:33.507Z] -J-Dtest.timeout.factor=8.0 \
[2024-11-28T08:54:33.507Z] -J-Dtest.nativepath='c:\jenkins\workspace\Test_openjdk21_hs_extended.openjdk_x86-64_windows_testList_0\jdkbinary\openjdk-test-image\jdk\jtreg\native' \
[2024-11-28T08:54:33.507Z] -J-Dtest.root='C:\Jenkins\workspace\Test_openjdk21_hs_extended.openjdk_x86-64_windows_testList_0\aqa-tests\openjdk\openjdk-jdk\test\jdk' \
[2024-11-28T08:54:33.507Z] -J-Dtest.name=java/beans/PropertyEditor/TestFontClassValue.java \
[2024-11-28T08:54:33.507Z] -J-Dtest.file='C:\Jenkins\workspace\Test_openjdk21_hs_extended.openjdk_x86-64_windows_testList_0\aqa-tests\openjdk\openjdk-jdk\test\jdk\java\beans\PropertyEditor\TestFontClassValue.java' \
[2024-11-28T08:54:33.507Z] -J-Dtest.src='C:\Jenkins\workspace\Test_openjdk21_hs_extended.openjdk_x86-64_windows_testList_0\aqa-tests\openjdk\openjdk-jdk\test\jdk\java\beans\PropertyEditor' \
[2024-11-28T08:54:33.507Z] -J-Dtest.src.path='C:\Jenkins\workspace\Test_openjdk21_hs_extended.openjdk_x86-64_windows_testList_0\aqa-tests\openjdk\openjdk-jdk\test\jdk\java\beans\PropertyEditor' \
[2024-11-28T08:54:33.507Z] -J-Dtest.classes='C:\Jenkins\workspace\Test_openjdk21_hs_extended.openjdk_x86-64_windows_testList_0\aqa-tests\TKG\output_17327770449218\jdk_beans_0\work\classes\0\java\beans\PropertyEditor\TestFontClassValue.d' \
[2024-11-28T08:54:33.508Z] -J-Dtest.class.path='C:\Jenkins\workspace\Test_openjdk21_hs_extended.openjdk_x86-64_windows_testList_0\aqa-tests\TKG\output_17327770449218\jdk_beans_0\work\classes\0\java\beans\PropertyEditor\TestFontClassValue.d' \
[2024-11-28T08:54:33.508Z] -J-Dtest.modules='java.compiler java.desktop jdk.compiler' \
[2024-11-28T08:54:33.508Z] --add-modules java.compiler,java.desktop,jdk.compiler \
[2024-11-28T08:54:33.508Z] -d 'C:\Jenkins\workspace\Test_openjdk21_hs_extended.openjdk_x86-64_windows_testList_0\aqa-tests\TKG\output_17327770449218\jdk_beans_0\work\classes\0\java\beans\PropertyEditor\TestFontClassValue.d' \
[2024-11-28T08:54:33.508Z] -sourcepath 'C:\Jenkins\workspace\Test_openjdk21_hs_extended.openjdk_x86-64_windows_testList_0\aqa-tests\openjdk\openjdk-jdk\test\jdk\java\beans\PropertyEditor' \
[2024-11-28T08:54:33.508Z] -classpath 'C:\Jenkins\workspace\Test_openjdk21_hs_extended.openjdk_x86-64_windows_testList_0\aqa-tests\openjdk\openjdk-jdk\test\jdk\java\beans\PropertyEditor;C:\Jenkins\workspace\Test_openjdk21_hs_extended.openjdk_x86-64_windows_testList_0\aqa-tests\TKG\output_17327770449218\jdk_beans_0\work\classes\0\java\beans\PropertyEditor\TestFontClassValue.d' 'C:\Jenkins\workspace\Test_openjdk21_hs_extended.openjdk_x86-64_windows_testList_0\aqa-tests\openjdk\openjdk-jdk\test\jdk\java\beans\PropertyEditor\TestFontClassValue.java'
[2024-11-28T08:54:33.508Z] STDOUT:
[2024-11-28T08:54:33.508Z] STDERR:
[2024-11-28T08:54:33.508Z] Note: C:\Jenkins\workspace\Test_openjdk21_hs_extended.openjdk_x86-64_windows_testList_0\aqa-tests\openjdk\openjdk-jdk\test\jdk\java\beans\PropertyEditor\TestEditor.java uses unchecked or unsafe operations.
[2024-11-28T08:54:33.508Z] Note: Recompile with -Xlint:unchecked for details.
[2024-11-28T08:54:33.508Z]
[2024-11-28T08:54:33.508Z] ACTION: main -- Failed. Execution failed: `main' threw exception: java.lang.Error: could not find editor for class java.awt.Font
[2024-11-28T08:54:33.508Z] REASON: Assumed action based on file name: run main TestFontClassValue
[2024-11-28T08:54:33.508Z] TIME: 0.61 seconds
[2024-11-28T08:54:33.508Z] messages:
[2024-11-28T08:54:33.508Z] command: main TestFontClassValue
[2024-11-28T08:54:33.508Z] reason: Assumed action based on file name: run main TestFontClassValue
[2024-11-28T08:54:33.508Z] started: Thu Nov 28 08:54:32 UTC 2024
[2024-11-28T08:54:33.508Z] Mode: othervm
[2024-11-28T08:54:33.508Z] Additional options from @modules: --add-modules java.compiler,java.desktop,jdk.compiler
[2024-11-28T08:54:33.508Z] finished: Thu Nov 28 08:54:32 UTC 2024
[2024-11-28T08:54:33.508Z] elapsed time (seconds): 0.61
[2024-11-28T08:54:33.508Z] configuration:
[2024-11-28T08:54:33.508Z] Boot Layer
[2024-11-28T08:54:33.508Z] add modules: java.compiler java.desktop jdk.compiler
[2024-11-28T08:54:33.508Z]
[2024-11-28T08:54:33.508Z] STDOUT:
[2024-11-28T08:54:33.508Z] Property class: class java.awt.Font
[2024-11-28T08:54:33.508Z] STDERR:
[2024-11-28T08:54:33.508Z] java.lang.Error: could not find editor for class java.awt.Font
[2024-11-28T08:54:33.508Z] at TestEditor.<init>(TestEditor.java:35)
[2024-11-28T08:54:33.508Z] at TestFontClassValue.main(TestFontClassValue.java:39)
[2024-11-28T08:54:33.508Z] at java.base/jdk.internal.reflect.DirectMethodHandleAccessor.invoke(DirectMethodHandleAccessor.java:103)
[2024-11-28T08:54:33.508Z] at java.base/java.lang.reflect.Method.invoke(Method.java:580)
[2024-11-28T08:54:33.508Z] at com.sun.javatest.regtest.agent.MainWrapper$MainTask.run(MainWrapper.java:138)
[2024-11-28T08:54:33.508Z] at java.base/java.lang.Thread.run(Thread.java:1583)
[2024-11-28T08:54:33.508Z]
[2024-11-28T08:54:33.508Z] JavaTest Message: Test threw exception: java.lang.Error: could not find editor for class java.awt.Font
[2024-11-28T08:54:33.508Z] JavaTest Message: shutting down test
[2024-11-28T08:54:33.508Z]
[2024-11-28T08:54:33.508Z] STATUS:Failed.`main' threw exception: java.lang.Error: could not find editor for class java.awt.Font
[2024-11-28T08:54:33.508Z] rerun:
[2024-11-28T08:54:33.508Z] cd 'C:\Jenkins\workspace\Test_openjdk21_hs_extended.openjdk_x86-64_windows_testList_0\aqa-tests\TKG\output_17327770449218\jdk_beans_0\work\java\beans\PropertyEditor\TestFontClassValue' && \
[2024-11-28T08:54:33.508Z] PATH='C:\Program Files\Java\jdk-17.0.8.1+1\bin;C:\cygwin64\bin;C:\Windows\system32;C:\Windows;C:\Windows\System32\Wbem;C:\Windows\System32\WindowsPowerShell\v1.0;C:\Windows\System32\OpenSSH;C:\Program Files\dotnet;C:\Users\adoptopenjdk\AppData\Local\Microsoft\WindowsApps;C:\Strawberry\perl\bin;C:\Program Files\Git\cmd;C:\openjdk\jdk-8\bin;C:\apache-ant\apache-ant-1.10.15\bin;C:\Program Files (x86)\IncrediBuild;C:\Program Files (x86)\Windows Kits\10\Windows Performance Toolkit;C:\rust\bin;C:\Program Files\IcedTeaWEB\bin;C:\Program Files\Microsoft SQL Server\110\Tools\Binn;C:\Program Files (x86)\Microsoft SDKs\TypeScript\1.0;C:\Program Files\Microsoft SQL Server\120\Tools\Binn;C:\Users\jenkins\AppData\Local\Microsoft\WindowsApps' \
[2024-11-28T08:54:33.508Z] SystemDrive=C: \
[2024-11-28T08:54:33.508Z] SystemRoot='C:\Windows' \
[2024-11-28T08:54:33.508Z] TEMP='C:\Users\jenkins\AppData\Local\Temp\3' \
[2024-11-28T08:54:33.508Z] TMP='C:\Users\jenkins\AppData\Local\Temp\3' \
[2024-11-28T08:54:33.508Z] windir='C:\Windows' \
[2024-11-28T08:54:33.508Z] CLASSPATH='C:\Jenkins\workspace\Test_openjdk21_hs_extended.openjdk_x86-64_windows_testList_0\aqa-tests\TKG\output_17327770449218\jdk_beans_0\work\classes\0\java\beans\PropertyEditor\TestFontClassValue.d;C:\Jenkins\workspace\Test_openjdk21_hs_extended.openjdk_x86-64_windows_testList_0\aqa-tests\openjdk\openjdk-jdk\test\jdk\java\beans\PropertyEditor;C:\Jenkins\workspace\Test_openjdk21_hs_extended.openjdk_x86-64_windows_testList_0\jvmtest\openjdk\jtreg\lib\javatest.jar;C:\Jenkins\workspace\Test_openjdk21_hs_extended.openjdk_x86-64_windows_testList_0\jvmtest\openjdk\jtreg\lib\jtreg.jar' \
[2024-11-28T08:54:33.508Z] 'c:\jenkins\workspace\Test_openjdk21_hs_extended.openjdk_x86-64_windows_testList_0\jdkbinary\j2sdk-image\bin\java' \
[2024-11-28T08:54:33.508Z] -Dtest.vm.opts='-ea -esa -Xmx512m -XX:+UseCompressedOops' \
[2024-11-28T08:54:33.508Z] -Dtest.tool.vm.opts='-J-ea -J-esa -J-Xmx512m -J-XX:+UseCompressedOops' \
[2024-11-28T08:54:33.508Z] -Dtest.compiler.opts= \
[2024-11-28T08:54:33.508Z] -Dtest.java.opts= \
[2024-11-28T08:54:33.508Z] -Dtest.jdk='c:\jenkins\workspace\Test_openjdk21_hs_extended.openjdk_x86-64_windows_testList_0\jdkbinary\j2sdk-image' \
[2024-11-28T08:54:33.508Z] -Dcompile.jdk='c:\jenkins\workspace\Test_openjdk21_hs_extended.openjdk_x86-64_windows_testList_0\jdkbinary\j2sdk-image' \
[2024-11-28T08:54:33.508Z] -Dtest.timeout.factor=8.0 \
[2024-11-28T08:54:33.508Z] -Dtest.nativepath='c:\jenkins\workspace\Test_openjdk21_hs_extended.openjdk_x86-64_windows_testList_0\jdkbinary\openjdk-test-image\jdk\jtreg\native' \
[2024-11-28T08:54:33.508Z] -Dtest.root='C:\Jenkins\workspace\Test_openjdk21_hs_extended.openjdk_x86-64_windows_testList_0\aqa-tests\openjdk\openjdk-jdk\test\jdk' \
[2024-11-28T08:54:33.508Z] -Dtest.name=java/beans/PropertyEditor/TestFontClassValue.java \
[2024-11-28T08:54:33.508Z] -Dtest.file='C:\Jenkins\workspace\Test_openjdk21_hs_extended.openjdk_x86-64_windows_testList_0\aqa-tests\openjdk\openjdk-jdk\test\jdk\java\beans\PropertyEditor\TestFontClassValue.java' \
[2024-11-28T08:54:33.508Z] -Dtest.src='C:\Jenkins\workspace\Test_openjdk21_hs_extended.openjdk_x86-64_windows_testList_0\aqa-tests\openjdk\openjdk-jdk\test\jdk\java\beans\PropertyEditor' \
[2024-11-28T08:54:33.508Z] -Dtest.src.path='C:\Jenkins\workspace\Test_openjdk21_hs_extended.openjdk_x86-64_windows_testList_0\aqa-tests\openjdk\openjdk-jdk\test\jdk\java\beans\PropertyEditor' \
[2024-11-28T08:54:33.508Z] -Dtest.classes='C:\Jenkins\workspace\Test_openjdk21_hs_extended.openjdk_x86-64_windows_testList_0\aqa-tests\TKG\output_17327770449218\jdk_beans_0\work\classes\0\java\beans\PropertyEditor\TestFontClassValue.d' \
[2024-11-28T08:54:33.508Z] -Dtest.class.path='C:\Jenkins\workspace\Test_openjdk21_hs_extended.openjdk_x86-64_windows_testList_0\aqa-tests\TKG\output_17327770449218\jdk_beans_0\work\classes\0\java\beans\PropertyEditor\TestFontClassValue.d' \
[2024-11-28T08:54:33.508Z] -Dtest.modules='java.compiler java.desktop jdk.compiler' \
[2024-11-28T08:54:33.508Z] --add-modules java.compiler,java.desktop,jdk.compiler \
[2024-11-28T08:54:33.508Z] -ea \
[2024-11-28T08:54:33.508Z] -esa \
[2024-11-28T08:54:33.508Z] -Xmx512m \
[2024-11-28T08:54:33.508Z] -XX:+UseCompressedOops \
[2024-11-28T08:54:33.508Z] '-Djava.library.path=c:\jenkins\workspace\Test_openjdk21_hs_extended.openjdk_x86-64_windows_testList_0\jdkbinary\openjdk-test-image\jdk\jtreg\native' \
[2024-11-28T08:54:33.508Z] com.sun.javatest.regtest.agent.MainWrapper 'C:\Jenkins\workspace\Test_openjdk21_hs_extended.openjdk_x86-64_windows_testList_0\aqa-tests\TKG\output_17327770449218\jdk_beans_0\work\java\beans\PropertyEditor\TestFontClassValue.d\main.0.jta'
[2024-11-28T08:54:33.508Z]
[2024-11-28T08:54:33.508Z] TEST RESULT: Failed. Execution failed: `main' threw exception: java.lang.Error: could not find editor for class java.awt.Font
[2024-11-28T08:54:33.508Z] --------------------------------------------------
[2024-11-28T08:56:57.144Z] TEST: java/beans/XMLEncoder/java_awt_ScrollPane.java
[2024-11-28T08:56:57.144Z] TEST JDK: c:\jenkins\workspace\Test_openjdk21_hs_extended.openjdk_x86-64_windows_testList_0\jdkbinary\j2sdk-image
[2024-11-28T08:56:57.144Z]
[2024-11-28T08:56:57.144Z] ACTION: build -- Passed. Build successful
[2024-11-28T08:56:57.144Z] REASON: Named class compiled on demand
[2024-11-28T08:56:57.144Z] TIME: 2.909 seconds
[2024-11-28T08:56:57.144Z] messages:
[2024-11-28T08:56:57.144Z] command: build java_awt_ScrollPane
[2024-11-28T08:56:57.145Z] reason: Named class compiled on demand
[2024-11-28T08:56:57.145Z] started: Thu Nov 28 08:56:42 UTC 2024
[2024-11-28T08:56:57.145Z] Test directory:
[2024-11-28T08:56:57.145Z] compile: java_awt_ScrollPane
[2024-11-28T08:56:57.145Z] finished: Thu Nov 28 08:56:44 UTC 2024
[2024-11-28T08:56:57.145Z] elapsed time (seconds): 2.909
[2024-11-28T08:56:57.145Z]
[2024-11-28T08:56:57.145Z] ACTION: compile -- Passed. Compilation successful
[2024-11-28T08:56:57.145Z] REASON: .class file out of date or does not exist
[2024-11-28T08:56:57.145Z] TIME: 2.908 seconds
[2024-11-28T08:56:57.145Z] messages:
[2024-11-28T08:56:57.145Z] command: compile C:\Jenkins\workspace\Test_openjdk21_hs_extended.openjdk_x86-64_windows_testList_0\aqa-tests\openjdk\openjdk-jdk\test\jdk\java\beans\XMLEncoder\java_awt_ScrollPane.java
[2024-11-28T08:56:57.145Z] reason: .class file out of date or does not exist
[2024-11-28T08:56:57.145Z] started: Thu Nov 28 08:56:42 UTC 2024
[2024-11-28T08:56:57.145Z] Additional options from @modules: --add-modules java.desktop
[2024-11-28T08:56:57.145Z] Mode: othervm
[2024-11-28T08:56:57.145Z] finished: Thu Nov 28 08:56:44 UTC 2024
[2024-11-28T08:56:57.145Z] elapsed time (seconds): 2.908
[2024-11-28T08:56:57.145Z] configuration:
[2024-11-28T08:56:57.145Z] javac compilation environment
[2024-11-28T08:56:57.145Z] add modules: java.desktop
[2024-11-28T08:56:57.145Z] source path: C:\Jenkins\workspace\Test_openjdk21_hs_extended.openjdk_x86-64_windows_testList_0\aqa-tests\openjdk\openjdk-jdk\test\jdk\java\beans\XMLEncoder
[2024-11-28T08:56:57.145Z] class path: C:\Jenkins\workspace\Test_openjdk21_hs_extended.openjdk_x86-64_windows_testList_0\aqa-tests\openjdk\openjdk-jdk\test\jdk\java\beans\XMLEncoder
[2024-11-28T08:56:57.145Z] C:\Jenkins\workspace\Test_openjdk21_hs_extended.openjdk_x86-64_windows_testList_0\aqa-tests\TKG\output_17327770449218\jdk_beans_0\work\classes\0\java\beans\XMLEncoder\java_awt_ScrollPane.d
[2024-11-28T08:56:57.145Z]
[2024-11-28T08:56:57.145Z] rerun:
[2024-11-28T08:56:57.145Z] cd 'C:\Jenkins\workspace\Test_openjdk21_hs_extended.openjdk_x86-64_windows_testList_0\aqa-tests\TKG\output_17327770449218\jdk_beans_0\work\java\beans\XMLEncoder\java_awt_ScrollPane' && \
[2024-11-28T08:56:57.145Z] PATH='C:\Program Files\Java\jdk-17.0.8.1+1\bin;C:\cygwin64\bin;C:\Windows\system32;C:\Windows;C:\Windows\System32\Wbem;C:\Windows\System32\WindowsPowerShell\v1.0;C:\Windows\System32\OpenSSH;C:\Program Files\dotnet;C:\Users\adoptopenjdk\AppData\Local\Microsoft\WindowsApps;C:\Strawberry\perl\bin;C:\Program Files\Git\cmd;C:\openjdk\jdk-8\bin;C:\apache-ant\apache-ant-1.10.15\bin;C:\Program Files (x86)\IncrediBuild;C:\Program Files (x86)\Windows Kits\10\Windows Performance Toolkit;C:\rust\bin;C:\Program Files\IcedTeaWEB\bin;C:\Program Files\Microsoft SQL Server\110\Tools\Binn;C:\Program Files (x86)\Microsoft SDKs\TypeScript\1.0;C:\Program Files\Microsoft SQL Server\120\Tools\Binn;C:\Users\jenkins\AppData\Local\Microsoft\WindowsApps' \
[2024-11-28T08:56:57.145Z] SystemDrive=C: \
[2024-11-28T08:56:57.145Z] SystemRoot='C:\Windows' \
[2024-11-28T08:56:57.145Z] TEMP='C:\Users\jenkins\AppData\Local\Temp\3' \
[2024-11-28T08:56:57.145Z] TMP='C:\Users\jenkins\AppData\Local\Temp\3' \
[2024-11-28T08:56:57.145Z] windir='C:\Windows' \
[2024-11-28T08:56:57.145Z] 'c:\jenkins\workspace\Test_openjdk21_hs_extended.openjdk_x86-64_windows_testList_0\jdkbinary\j2sdk-image\bin\javac' \
[2024-11-28T08:56:57.145Z] -J-ea \
[2024-11-28T08:56:57.145Z] -J-esa \
[2024-11-28T08:56:57.145Z] -J-Xmx512m \
[2024-11-28T08:56:57.145Z] -J-XX:+UseCompressedOops \
[2024-11-28T08:56:57.145Z] -J-Dtest.vm.opts='-ea -esa -Xmx512m -XX:+UseCompressedOops' \
[2024-11-28T08:56:57.145Z] -J-Dtest.tool.vm.opts='-J-ea -J-esa -J-Xmx512m -J-XX:+UseCompressedOops' \
[2024-11-28T08:56:57.145Z] -J-Dtest.compiler.opts= \
[2024-11-28T08:56:57.145Z] -J-Dtest.java.opts= \
[2024-11-28T08:56:57.145Z] -J-Dtest.jdk='c:\jenkins\workspace\Test_openjdk21_hs_extended.openjdk_x86-64_windows_testList_0\jdkbinary\j2sdk-image' \
[2024-11-28T08:56:57.145Z] -J-Dcompile.jdk='c:\jenkins\workspace\Test_openjdk21_hs_extended.openjdk_x86-64_windows_testList_0\jdkbinary\j2sdk-image' \
[2024-11-28T08:56:57.145Z] -J-Dtest.timeout.factor=8.0 \
[2024-11-28T08:56:57.145Z] -J-Dtest.nativepath='c:\jenkins\workspace\Test_openjdk21_hs_extended.openjdk_x86-64_windows_testList_0\jdkbinary\openjdk-test-image\jdk\jtreg\native' \
[2024-11-28T08:56:57.145Z] -J-Dtest.root='C:\Jenkins\workspace\Test_openjdk21_hs_extended.openjdk_x86-64_windows_testList_0\aqa-tests\openjdk\openjdk-jdk\test\jdk' \
[2024-11-28T08:56:57.145Z] -J-Dtest.name=java/beans/XMLEncoder/java_awt_ScrollPane.java \
[2024-11-28T08:56:57.145Z] -J-Dtest.file='C:\Jenkins\workspace\Test_openjdk21_hs_extended.openjdk_x86-64_windows_testList_0\aqa-tests\openjdk\openjdk-jdk\test\jdk\java\beans\XMLEncoder\java_awt_ScrollPane.java' \
[2024-11-28T08:56:57.145Z] -J-Dtest.src='C:\Jenkins\workspace\Test_openjdk21_hs_extended.openjdk_x86-64_windows_testList_0\aqa-tests\openjdk\openjdk-jdk\test\jdk\java\beans\XMLEncoder' \
[2024-11-28T08:56:57.145Z] -J-Dtest.src.path='C:\Jenkins\workspace\Test_openjdk21_hs_extended.openjdk_x86-64_windows_testList_0\aqa-tests\openjdk\openjdk-jdk\test\jdk\java\beans\XMLEncoder' \
[2024-11-28T08:56:57.145Z] -J-Dtest.classes='C:\Jenkins\workspace\Test_openjdk21_hs_extended.openjdk_x86-64_windows_testList_0\aqa-tests\TKG\output_17327770449218\jdk_beans_0\work\classes\0\java\beans\XMLEncoder\java_awt_ScrollPane.d' \
[2024-11-28T08:56:57.145Z] -J-Dtest.class.path='C:\Jenkins\workspace\Test_openjdk21_hs_extended.openjdk_x86-64_windows_testList_0\aqa-tests\TKG\output_17327770449218\jdk_beans_0\work\classes\0\java\beans\XMLEncoder\java_awt_ScrollPane.d' \
[2024-11-28T08:56:57.145Z] -J-Dtest.modules=java.desktop \
[2024-11-28T08:56:57.145Z] --add-modules java.desktop \
[2024-11-28T08:56:57.145Z] -d 'C:\Jenkins\workspace\Test_openjdk21_hs_extended.openjdk_x86-64_windows_testList_0\aqa-tests\TKG\output_17327770449218\jdk_beans_0\work\classes\0\java\beans\XMLEncoder\java_awt_ScrollPane.d' \
[2024-11-28T08:56:57.145Z] -sourcepath 'C:\Jenkins\workspace\Test_openjdk21_hs_extended.openjdk_x86-64_windows_testList_0\aqa-tests\openjdk\openjdk-jdk\test\jdk\java\beans\XMLEncoder' \
[2024-11-28T08:56:57.145Z] -classpath 'C:\Jenkins\workspace\Test_openjdk21_hs_extended.openjdk_x86-64_windows_testList_0\aqa-tests\openjdk\openjdk-jdk\test\jdk\java\beans\XMLEncoder;C:\Jenkins\workspace\Test_openjdk21_hs_extended.openjdk_x86-64_windows_testList_0\aqa-tests\TKG\output_17327770449218\jdk_beans_0\work\classes\0\java\beans\XMLEncoder\java_awt_ScrollPane.d' 'C:\Jenkins\workspace\Test_openjdk21_hs_extended.openjdk_x86-64_windows_testList_0\aqa-tests\openjdk\openjdk-jdk\test\jdk\java\beans\XMLEncoder\java_awt_ScrollPane.java'
[2024-11-28T08:56:57.145Z] STDOUT:
[2024-11-28T08:56:57.145Z] STDERR:
[2024-11-28T08:56:57.145Z] C:\Jenkins\workspace\Test_openjdk21_hs_extended.openjdk_x86-64_windows_testList_0\aqa-tests\openjdk\openjdk-jdk\test\jdk\java\beans\XMLEncoder\AbstractTest.java:118: warning: [removal] SecurityManager in java.lang has been deprecated and marked for removal
[2024-11-28T08:56:57.145Z] System.setSecurityManager(new SecurityManager());
[2024-11-28T08:56:57.145Z] ^
[2024-11-28T08:56:57.145Z] C:\Jenkins\workspace\Test_openjdk21_hs_extended.openjdk_x86-64_windows_testList_0\aqa-tests\openjdk\openjdk-jdk\test\jdk\java\beans\XMLEncoder\AbstractTest.java:118: warning: [removal] setSecurityManager(SecurityManager) in System has been deprecated and marked for removal
[2024-11-28T08:56:57.145Z] System.setSecurityManager(new SecurityManager());
[2024-11-28T08:56:57.145Z] ^
[2024-11-28T08:56:57.145Z] Note: Some input files use unchecked or unsafe operations.
[2024-11-28T08:56:57.145Z] Note: Recompile with -Xlint:unchecked for details.
[2024-11-28T08:56:57.145Z] 2 warnings
[2024-11-28T08:56:57.145Z]
[2024-11-28T08:56:57.145Z] ACTION: main -- Failed. Execution failed: `main' threw exception: java.awt.HeadlessException: The application does not have desktop access, but this program performed an operation which requires it.
[2024-11-28T08:56:57.145Z] REASON: User specified action: run main/othervm -Djava.security.manager=allow java_awt_ScrollPane
[2024-11-28T08:56:57.145Z] TIME: 0.551 seconds
[2024-11-28T08:56:57.145Z] messages:
[2024-11-28T08:56:57.145Z] command: main -Djava.security.manager=allow java_awt_ScrollPane
[2024-11-28T08:56:57.145Z] reason: User specified action: run main/othervm -Djava.security.manager=allow java_awt_ScrollPane
[2024-11-28T08:56:57.145Z] started: Thu Nov 28 08:56:44 UTC 2024
[2024-11-28T08:56:57.145Z] Mode: othervm [/othervm specified]
[2024-11-28T08:56:57.145Z] Additional options from @modules: --add-modules java.desktop
[2024-11-28T08:56:57.145Z] finished: Thu Nov 28 08:56:45 UTC 2024
[2024-11-28T08:56:57.145Z] elapsed time (seconds): 0.551
[2024-11-28T08:56:57.145Z] configuration:
[2024-11-28T08:56:57.145Z] Boot Layer
[2024-11-28T08:56:57.145Z] add modules: java.desktop
[2024-11-28T08:56:57.145Z]
[2024-11-28T08:56:57.145Z] STDOUT:
[2024-11-28T08:56:57.145Z] STDERR:
[2024-11-28T08:56:57.145Z] java.awt.HeadlessException:
[2024-11-28T08:56:57.145Z] The application does not have desktop access,
[2024-11-28T08:56:57.145Z] but this program performed an operation which requires it.
[2024-11-28T08:56:57.145Z] at java.desktop/java.awt.GraphicsEnvironment.checkHeadless(GraphicsEnvironment.java:164)
[2024-11-28T08:56:57.145Z] at java.desktop/java.awt.ScrollPane.<init>(ScrollPane.java:210)
[2024-11-28T08:56:57.145Z] at java_awt_ScrollPane.getObject(java_awt_ScrollPane.java:41)
[2024-11-28T08:56:57.145Z] at java_awt_ScrollPane.getObject(java_awt_ScrollPane.java:35)
[2024-11-28T08:56:57.145Z] at AbstractTest.test(AbstractTest.java:100)
[2024-11-28T08:56:57.145Z] at java_awt_ScrollPane.main(java_awt_ScrollPane.java:37)
[2024-11-28T08:56:57.145Z] at java.base/jdk.internal.reflect.DirectMethodHandleAccessor.invoke(DirectMethodHandleAccessor.java:103)
[2024-11-28T08:56:57.145Z] at java.base/java.lang.reflect.Method.invoke(Method.java:580)
[2024-11-28T08:56:57.145Z] at com.sun.javatest.regtest.agent.MainWrapper$MainTask.run(MainWrapper.java:138)
[2024-11-28T08:56:57.145Z] at java.base/java.lang.Thread.run(Thread.java:1583)
[2024-11-28T08:56:57.145Z]
[2024-11-28T08:56:57.145Z] JavaTest Message: Test threw exception: java.awt.HeadlessException:
[2024-11-28T08:56:57.146Z] The application does not have desktop access,
[2024-11-28T08:56:57.146Z] but this program performed an operation which requires it.
[2024-11-28T08:56:57.146Z] JavaTest Message: shutting down test
[2024-11-28T08:56:57.146Z]
[2024-11-28T08:56:57.146Z] STATUS:Failed.`main' threw exception: java.awt.HeadlessException: The application does not have desktop access, but this program performed an operation which requires it.
[2024-11-28T08:56:57.146Z] rerun:
[2024-11-28T08:56:57.146Z] cd 'C:\Jenkins\workspace\Test_openjdk21_hs_extended.openjdk_x86-64_windows_testList_0\aqa-tests\TKG\output_17327770449218\jdk_beans_0\work\java\beans\XMLEncoder\java_awt_ScrollPane' && \
[2024-11-28T08:56:57.146Z] PATH='C:\Program Files\Java\jdk-17.0.8.1+1\bin;C:\cygwin64\bin;C:\Windows\system32;C:\Windows;C:\Windows\System32\Wbem;C:\Windows\System32\WindowsPowerShell\v1.0;C:\Windows\System32\OpenSSH;C:\Program Files\dotnet;C:\Users\adoptopenjdk\AppData\Local\Microsoft\WindowsApps;C:\Strawberry\perl\bin;C:\Program Files\Git\cmd;C:\openjdk\jdk-8\bin;C:\apache-ant\apache-ant-1.10.15\bin;C:\Program Files (x86)\IncrediBuild;C:\Program Files (x86)\Windows Kits\10\Windows Performance Toolkit;C:\rust\bin;C:\Program Files\IcedTeaWEB\bin;C:\Program Files\Microsoft SQL Server\110\Tools\Binn;C:\Program Files (x86)\Microsoft SDKs\TypeScript\1.0;C:\Program Files\Microsoft SQL Server\120\Tools\Binn;C:\Users\jenkins\AppData\Local\Microsoft\WindowsApps' \
[2024-11-28T08:56:57.146Z] SystemDrive=C: \
[2024-11-28T08:56:57.146Z] SystemRoot='C:\Windows' \
[2024-11-28T08:56:57.146Z] TEMP='C:\Users\jenkins\AppData\Local\Temp\3' \
[2024-11-28T08:56:57.146Z] TMP='C:\Users\jenkins\AppData\Local\Temp\3' \
[2024-11-28T08:56:57.146Z] windir='C:\Windows' \
[2024-11-28T08:56:57.146Z] CLASSPATH='C:\Jenkins\workspace\Test_openjdk21_hs_extended.openjdk_x86-64_windows_testList_0\aqa-tests\TKG\output_17327770449218\jdk_beans_0\work\classes\0\java\beans\XMLEncoder\java_awt_ScrollPane.d;C:\Jenkins\workspace\Test_openjdk21_hs_extended.openjdk_x86-64_windows_testList_0\aqa-tests\openjdk\openjdk-jdk\test\jdk\java\beans\XMLEncoder;C:\Jenkins\workspace\Test_openjdk21_hs_extended.openjdk_x86-64_windows_testList_0\jvmtest\openjdk\jtreg\lib\javatest.jar;C:\Jenkins\workspace\Test_openjdk21_hs_extended.openjdk_x86-64_windows_testList_0\jvmtest\openjdk\jtreg\lib\jtreg.jar' \
[2024-11-28T08:56:57.146Z] 'c:\jenkins\workspace\Test_openjdk21_hs_extended.openjdk_x86-64_windows_testList_0\jdkbinary\j2sdk-image\bin\java' \
[2024-11-28T08:56:57.146Z] -Dtest.vm.opts='-ea -esa -Xmx512m -XX:+UseCompressedOops' \
[2024-11-28T08:56:57.146Z] -Dtest.tool.vm.opts='-J-ea -J-esa -J-Xmx512m -J-XX:+UseCompressedOops' \
[2024-11-28T08:56:57.146Z] -Dtest.compiler.opts= \
[2024-11-28T08:56:57.146Z] -Dtest.java.opts= \
[2024-11-28T08:56:57.146Z] -Dtest.jdk='c:\jenkins\workspace\Test_openjdk21_hs_extended.openjdk_x86-64_windows_testList_0\jdkbinary\j2sdk-image' \
[2024-11-28T08:56:57.146Z] -Dcompile.jdk='c:\jenkins\workspace\Test_openjdk21_hs_extended.openjdk_x86-64_windows_testList_0\jdkbinary\j2sdk-image' \
[2024-11-28T08:56:57.146Z] -Dtest.timeout.factor=8.0 \
[2024-11-28T08:56:57.146Z] -Dtest.nativepath='c:\jenkins\workspace\Test_openjdk21_hs_extended.openjdk_x86-64_windows_testList_0\jdkbinary\openjdk-test-image\jdk\jtreg\native' \
[2024-11-28T08:56:57.146Z] -Dtest.root='C:\Jenkins\workspace\Test_openjdk21_hs_extended.openjdk_x86-64_windows_testList_0\aqa-tests\openjdk\openjdk-jdk\test\jdk' \
[2024-11-28T08:56:57.146Z] -Dtest.name=java/beans/XMLEncoder/java_awt_ScrollPane.java \
[2024-11-28T08:56:57.146Z] -Dtest.file='C:\Jenkins\workspace\Test_openjdk21_hs_extended.openjdk_x86-64_windows_testList_0\aqa-tests\openjdk\openjdk-jdk\test\jdk\java\beans\XMLEncoder\java_awt_ScrollPane.java' \
[2024-11-28T08:56:57.146Z] -Dtest.src='C:\Jenkins\workspace\Test_openjdk21_hs_extended.openjdk_x86-64_windows_testList_0\aqa-tests\openjdk\openjdk-jdk\test\jdk\java\beans\XMLEncoder' \
[2024-11-28T08:56:57.146Z] -Dtest.src.path='C:\Jenkins\workspace\Test_openjdk21_hs_extended.openjdk_x86-64_windows_testList_0\aqa-tests\openjdk\openjdk-jdk\test\jdk\java\beans\XMLEncoder' \
[2024-11-28T08:56:57.146Z] -Dtest.classes='C:\Jenkins\workspace\Test_openjdk21_hs_extended.openjdk_x86-64_windows_testList_0\aqa-tests\TKG\output_17327770449218\jdk_beans_0\work\classes\0\java\beans\XMLEncoder\java_awt_ScrollPane.d' \
[2024-11-28T08:56:57.146Z] -Dtest.class.path='C:\Jenkins\workspace\Test_openjdk21_hs_extended.openjdk_x86-64_windows_testList_0\aqa-tests\TKG\output_17327770449218\jdk_beans_0\work\classes\0\java\beans\XMLEncoder\java_awt_ScrollPane.d' \
[2024-11-28T08:56:57.146Z] -Dtest.modules=java.desktop \
[2024-11-28T08:56:57.146Z] --add-modules java.desktop \
[2024-11-28T08:56:57.146Z] -ea \
[2024-11-28T08:56:57.146Z] -esa \
[2024-11-28T08:56:57.146Z] -Xmx512m \
[2024-11-28T08:56:57.146Z] -XX:+UseCompressedOops \
[2024-11-28T08:56:57.146Z] '-Djava.library.path=c:\jenkins\workspace\Test_openjdk21_hs_extended.openjdk_x86-64_windows_testList_0\jdkbinary\openjdk-test-image\jdk\jtreg\native' \
[2024-11-28T08:56:57.146Z] -Djava.security.manager=allow \
[2024-11-28T08:56:57.146Z] com.sun.javatest.regtest.agent.MainWrapper 'C:\Jenkins\workspace\Test_openjdk21_hs_extended.openjdk_x86-64_windows_testList_0\aqa-tests\TKG\output_17327770449218\jdk_beans_0\work\java\beans\XMLEncoder\java_awt_ScrollPane.d\main.0.jta'
[2024-11-28T08:56:57.146Z]
[2024-11-28T08:56:57.146Z] TEST RESULT: Failed. Execution failed: `main' threw exception: java.awt.HeadlessException: The application does not have desktop access, but this program performed an operation which requires it.
[2024-11-28T08:56:57.146Z] --------------------------------------------------
[2024-11-28T08:59:37.387Z] Test results: passed: 357; failed: 10
[2024-11-28T09:03:30.659Z] Report written to C:\Jenkins\workspace\Test_openjdk21_hs_extended.openjdk_x86-64_windows_testList_0\aqa-tests\TKG\output_17327770449218\jdk_beans_0\report\html\report.html
[2024-11-28T09:03:30.659Z] Results written to C:\Jenkins\workspace\Test_openjdk21_hs_extended.openjdk_x86-64_windows_testList_0\aqa-tests\TKG\output_17327770449218\jdk_beans_0\work
[2024-11-28T09:03:30.659Z] Error: Some tests failed or other problems occurred.
[2024-11-28T09:03:30.659Z] -----------------------------------
[2024-11-28T09:03:30.659Z] jdk_beans_0_FAILED
[2024-11-28T09:03:30.659Z] -----------------------------------
[2024-11-28T09:03:30.659Z]
[2024-11-28T09:03:30.659Z] TEST TEARDOWN:
[2024-11-28T09:03:30.659Z] Nothing to be done for teardown.
[2024-11-28T09:03:30.659Z] jdk_beans_0 Finish Time: Thu Nov 28 09:03:23 2024 Epoch Time (ms): 1732784603692