Post Test
[2024-11-21T00:02:57.651Z] gmake[4]: Leaving directory '/home/jenkins/workspace/Test_openjdk21_hs_extended.openjdk_ppc64_aix_testList_2/aqa-tests/openjdk'
[2024-11-21T00:02:57.651Z] gmake[3]: Leaving directory '/home/jenkins/workspace/Test_openjdk21_hs_extended.openjdk_ppc64_aix_testList_2/aqa-tests'
[2024-11-21T00:02:57.651Z]
[2024-11-21T00:02:57.651Z]
[2024-11-21T00:02:57.651Z] All tests finished, run result summary:
[2024-11-21T00:02:57.651Z] cd "/home/jenkins/workspace/Test_openjdk21_hs_extended.openjdk_ppc64_aix_testList_2/aqa-tests/TKG/../TKG/scripts"; \
[2024-11-21T00:02:57.652Z] perl "resultsSum.pl" --failuremk="/home/jenkins/workspace/Test_openjdk21_hs_extended.openjdk_ppc64_aix_testList_2/aqa-tests/TKG/../TKG/failedtargets.mk" --resultFile="/home/jenkins/workspace/Test_openjdk21_hs_extended.openjdk_ppc64_aix_testList_2/aqa-tests/TKG/../TKG/output_17321380427368/TestTargetResult" --platFile="/home/jenkins/workspace/Test_openjdk21_hs_extended.openjdk_ppc64_aix_testList_2/aqa-tests/TKG/../TKG/resources/buildPlatformMap.properties" --diagnostic=failure --jdkVersion=21 --jdkImpl=hotspot --jdkVendor="eclipse" --spec=aix_ppc-64 --buildList=openjdk --customTarget="" --testTarget=testList --tapPath=/home/jenkins/workspace/Test_openjdk21_hs_extended.openjdk_ppc64_aix_testList_2/aqa-tests/TKG/../TKG/output_17321380427368/ --tapName=Test_openjdk21_hs_extended.openjdk_ppc64_aix_testList_2.tap --comment=""
[2024-11-21T00:02:57.652Z]
[2024-11-21T00:02:57.652Z]
[2024-11-21T00:02:57.652Z] TEST TARGETS SUMMARY
[2024-11-21T00:02:57.652Z] ++++++++++++++++++++++++++++++++++++++++++++++++++++++++++++++++++++++++++
[2024-11-21T00:02:57.652Z] DISABLED test targets:
[2024-11-21T00:02:57.652Z] jdk_awt_0
[2024-11-21T00:02:57.652Z] jdk_awt_2
[2024-11-21T00:02:57.652Z] jdk_sound_0
[2024-11-21T00:02:57.652Z] jdk_sound_2
[2024-11-21T00:02:57.652Z] jdk_swing_1
[2024-11-21T00:02:57.652Z] jdk_jfr_0
[2024-11-21T00:02:57.652Z] jdk_jfr_2
[2024-11-21T00:02:57.652Z] jdk_client_sanity_0
[2024-11-21T00:02:57.652Z] jdk_client_sanity_2
[2024-11-21T00:02:57.652Z] jdk_security_infra_0
[2024-11-21T00:02:57.652Z] jdk_security_infra_1
[2024-11-21T00:02:57.652Z] jdk_2d_1
[2024-11-21T00:02:57.652Z] jdk_jfc_demo_1
[2024-11-21T00:02:57.652Z]
[2024-11-21T00:02:57.652Z] PASSED test targets:
[2024-11-21T00:02:57.652Z] jdk_other_1 - Test results: passed: 278
[2024-11-21T00:02:57.652Z] jdk_time_1 - Test results: passed: 188
[2024-11-21T00:02:57.652Z] jdk_tools_1 - Test results: passed: 212
[2024-11-21T00:02:57.652Z] jdk_jdi_1 - Test results: passed: 177
[2024-11-21T00:02:57.652Z] jdk_build_0 - Test results: passed: 1
[2024-11-21T00:02:57.652Z] jdk_native_sanity_1 - Test results: passed: 3
[2024-11-21T00:02:57.652Z]
[2024-11-21T00:02:57.652Z] FAILED test targets:
[2024-11-21T00:02:57.652Z] jdk_security3_1 - Test results: passed: 939; failed: 1
[2024-11-21T00:02:57.652Z] Failed test cases:
[2024-11-21T00:02:57.652Z] TEST: sun/security/ssl/X509TrustManagerImpl/distrust/Symantec.java
[2024-11-21T00:02:57.652Z]
[2024-11-21T00:02:57.652Z]
[2024-11-21T00:02:57.652Z] TOTAL: 31 EXECUTED: 7 PASSED: 6 FAILED: 1 DISABLED: 13 SKIPPED: 11
[2024-11-21T00:02:57.652Z] ++++++++++++++++++++++++++++++++++++++++++++++++++++++++++++++++++++++++++
[2024-11-21T00:02:57.652Z]
[2024-11-21T00:02:57.652Z] TESTCASES RESULTS SUMMARY: passed: 1,798; failed: 1; error: 0; skipped: 0
[2024-11-21T00:02:57.652Z] ++++++++++++++++++++++++++++++++++++++++++++++++++++++++++++++++++++++++++
[2024-11-21T00:02:57.652Z] gmake[2]: *** [settings.mk:450: resultsSummary] Error 2
[2024-11-21T00:02:57.652Z] gmake[2]: Leaving directory '/home/jenkins/workspace/Test_openjdk21_hs_extended.openjdk_ppc64_aix_testList_2/aqa-tests/TKG'
[2024-11-21T00:02:57.652Z] gmake[1]: *** [makefile:70: _testList] Error 2
[2024-11-21T00:02:57.652Z] gmake[1]: Leaving directory '/home/jenkins/workspace/Test_openjdk21_hs_extended.openjdk_ppc64_aix_testList_2/aqa-tests/TKG'
[2024-11-21T00:02:57.652Z] gmake: *** [parallelList.mk:14: testList_2] Error 2
[Pipeline] sh
[2024-11-21T00:02:59.543Z] + uname
[2024-11-21T00:02:59.543Z] + [ AIX = AIX ]
[2024-11-21T00:02:59.543Z] + MAKE=gmake
[2024-11-21T00:02:59.543Z] + gmake -f ./aqa-tests/TKG/testEnv.mk testEnvTeardown
[2024-11-21T00:02:59.543Z] gmake: Nothing to be done for 'testEnvTeardown'.
[Pipeline] echo
[2024-11-21T00:02:59.929Z] There were test failures, set build result to UNSTABLE.
[Pipeline] }
[Pipeline] // stage
[Pipeline] stage
[Pipeline] { (Post)
[Pipeline] step
[2024-11-21T00:03:00.211Z] TAP Reports Processing: START
[2024-11-21T00:03:00.211Z] Looking for TAP results report in workspace using pattern: aqa-tests/TKG/**/*.tap
[2024-11-21T00:03:01.902Z] Saving reports...
[2024-11-21T00:03:02.084Z] Processing '/home/jenkins/.jenkins/jobs/Test_openjdk21_hs_extended.openjdk_ppc64_aix_testList_2/builds/28/tap-master-files/aqa-tests/TKG/output_17321380427368/Test_openjdk21_hs_extended.openjdk_ppc64_aix_testList_2.tap'
[2024-11-21T00:03:02.084Z] Parsing TAP test result [/home/jenkins/.jenkins/jobs/Test_openjdk21_hs_extended.openjdk_ppc64_aix_testList_2/builds/28/tap-master-files/aqa-tests/TKG/output_17321380427368/Test_openjdk21_hs_extended.openjdk_ppc64_aix_testList_2.tap].
[2024-11-21T00:03:02.087Z] There are failed test cases. Marking build as UNSTABLE
[2024-11-21T00:03:02.087Z] TAP Reports Processing: FINISH
[Pipeline] echo
[2024-11-21T00:03:02.095Z] Saving aqa-tests/testenv/testenv.properties file on jenkins.
[Pipeline] archiveArtifacts
[2024-11-21T00:03:02.280Z] Archiving artifacts
[2024-11-21T00:03:02.639Z] Recording fingerprints
[Pipeline] echo
[2024-11-21T00:03:02.835Z] Saving aqa-tests/TKG/**/*.tap file on jenkins.
[Pipeline] archiveArtifacts
[2024-11-21T00:03:03.023Z] Archiving artifacts
[2024-11-21T00:03:05.277Z] Recording fingerprints
[Pipeline] sh
[2024-11-21T00:03:09.826Z] + tar -cf - ./aqa-tests/TKG/output_17321380427368
[2024-11-21T00:03:09.826Z] + 1> openjdk_test_output.tar.gz
[2024-11-21T00:03:09.826Z] + pigz -9
[2024-11-21T00:03:09.826Z] + 2> /dev/null
[2024-11-21T00:03:09.826Z] + gzip -9
[Pipeline] echo
[2024-11-21T00:03:18.604Z] ARTIFACTORY_SERVER is not set. Saving artifacts on jenkins.
[Pipeline] archiveArtifacts
[2024-11-21T00:03:18.798Z] Archiving artifacts
[2024-11-21T00:03:45.304Z] Recording fingerprints
[Pipeline] findFiles
[Pipeline] echo
[2024-11-21T00:03:52.573Z] Tap file found: aqa-tests/TKG/output_17321380427368/Test_openjdk21_hs_extended.openjdk_ppc64_aix_testList_2.tap...
[Pipeline] readFile
[Pipeline] echo
[2024-11-21T00:03:52.843Z] Rerun in Grinder with failed test targets: https://ci.adoptium.net/job/Grinder/parambuild/?SDK_RESOURCE=upstream&TARGET=testList+TESTLIST=jdk_security3_1&BASE_DOCKER_REGISTRY_CREDENTIAL_ID=&TEST_FLAG=&UPSTREAM_TEST_JOB_NAME=Test_openjdk21_hs_extended.openjdk_ppc64_aix&DOCKER_REQUIRED=false&ACTIVE_NODE_TIMEOUT=5&VENDOR_TEST_DIRS=&EXTRA_DOCKER_ARGS=&TKG_OWNER_BRANCH=adoptium%3Amaster&OPENJ9_SYSTEMTEST_OWNER_BRANCH=eclipse%3Amaster&PLATFORM=ppc64_aix&GENERATE_JOBS=true&KEEP_REPORTDIR=true&PERSONAL_BUILD=false&DOCKER_REGISTRY_DIR=&RERUN_ITERATIONS=1&ADOPTOPENJDK_REPO=https%3A%2F%2Fgithub.com%2Fadoptium%2Faqa-tests.git&SETUP_JCK_RUN=false&DOCKER_REGISTRY_URL_CREDENTIAL_ID=&LABEL=&EXTRA_OPTIONS=&CUSTOMIZED_SDK_URL=&BUILD_IDENTIFIER=&JENKINS_KEY=&ADOPTOPENJDK_BRANCH=master&LIGHT_WEIGHT_CHECKOUT=false&USE_JRE=false&ARTIFACTORY_SERVER=&KEEP_WORKSPACE=false&USER_CREDENTIALS_ID=&JDK_VERSION=21&DOCKER_REGISTRY_URL=&ITERATIONS=1&VENDOR_TEST_REPOS=&JDK_REPO=https%3A%2F%2Fgithub.com%2Fadoptium%2Fjdk21u&JCK_GIT_BRANCH=master&OPENJ9_BRANCH=master&OPENJ9_SHA=&JCK_GIT_REPO=&VENDOR_TEST_BRANCHES=&UPSTREAM_JOB_NAME=build-scripts%2Fjobs%2Fjdk21u%2Fjdk21u-aix-ppc64-temurin&OPENJ9_REPO=https%3A%2F%2Fgithub.com%2Feclipse-openj9%2Fopenj9.git&CLOUD_PROVIDER=&CUSTOM_TARGET=&VENDOR_TEST_SHAS=&JDK_BRANCH=jdk-21.0.6%2B4_adopt&LABEL_ADDITION=sw.os.aix.7_2&ARTIFACTORY_REPO=&ARTIFACTORY_ROOT_DIR=&UPSTREAM_TEST_JOB_NUMBER=64&DOCKERIMAGE_TAG=&TEST_TIME=&JDK_IMPL=hotspot&SSH_AGENT_CREDENTIAL=&AUTO_DETECT=true&SLACK_CHANNEL=aqavit-bot&DYNAMIC_COMPILE=false&RELATED_NODES=&ADOPTOPENJDK_SYSTEMTEST_OWNER_BRANCH=adoptium%3Amaster&APPLICATION_OPTIONS=&CUSTOMIZED_SDK_URL_CREDENTIAL_ID=eclipse_temurin_bot_email_and_token&ARCHIVE_TEST_RESULTS=false&NUM_MACHINES=&OPENJDK_SHA=&TRSS_URL=&USE_TESTENV_PROPERTIES=false&BUILD_LIST=openjdk&ADDITIONAL_ARTIFACTS_REQUIRED=&UPSTREAM_JOB_NUMBER=79&STF_OWNER_BRANCH=adoptium%3Amaster&TIME_LIMIT=25&JVM_OPTIONS=&PARALLEL=None
[Pipeline] echo
[2024-11-21T00:03:52.911Z] Rerun failed jdk test cases in Grinder with jdk_custom target: https://ci.adoptium.net/job/Grinder/parambuild/?SDK_RESOURCE=upstream&TARGET=jdk_custom&BASE_DOCKER_REGISTRY_CREDENTIAL_ID=&TEST_FLAG=&UPSTREAM_TEST_JOB_NAME=Test_openjdk21_hs_extended.openjdk_ppc64_aix&DOCKER_REQUIRED=false&ACTIVE_NODE_TIMEOUT=5&VENDOR_TEST_DIRS=&EXTRA_DOCKER_ARGS=&TKG_OWNER_BRANCH=adoptium%3Amaster&OPENJ9_SYSTEMTEST_OWNER_BRANCH=eclipse%3Amaster&PLATFORM=ppc64_aix&GENERATE_JOBS=true&KEEP_REPORTDIR=true&PERSONAL_BUILD=false&DOCKER_REGISTRY_DIR=&RERUN_ITERATIONS=1&ADOPTOPENJDK_REPO=https%3A%2F%2Fgithub.com%2Fadoptium%2Faqa-tests.git&SETUP_JCK_RUN=false&DOCKER_REGISTRY_URL_CREDENTIAL_ID=&LABEL=&EXTRA_OPTIONS=&CUSTOMIZED_SDK_URL=&BUILD_IDENTIFIER=&JENKINS_KEY=&ADOPTOPENJDK_BRANCH=master&LIGHT_WEIGHT_CHECKOUT=false&USE_JRE=false&ARTIFACTORY_SERVER=&KEEP_WORKSPACE=false&USER_CREDENTIALS_ID=&JDK_VERSION=21&DOCKER_REGISTRY_URL=&ITERATIONS=1&VENDOR_TEST_REPOS=&JDK_REPO=https%3A%2F%2Fgithub.com%2Fadoptium%2Fjdk21u&JCK_GIT_BRANCH=master&OPENJ9_BRANCH=master&OPENJ9_SHA=&JCK_GIT_REPO=&VENDOR_TEST_BRANCHES=&UPSTREAM_JOB_NAME=build-scripts%2Fjobs%2Fjdk21u%2Fjdk21u-aix-ppc64-temurin&OPENJ9_REPO=https%3A%2F%2Fgithub.com%2Feclipse-openj9%2Fopenj9.git&CLOUD_PROVIDER=&CUSTOM_TARGET=sun%2Fsecurity%2Fssl%2FX509TrustManagerImpl%2Fdistrust%2FSymantec.java&VENDOR_TEST_SHAS=&JDK_BRANCH=jdk-21.0.6%2B4_adopt&LABEL_ADDITION=sw.os.aix.7_2&ARTIFACTORY_REPO=&ARTIFACTORY_ROOT_DIR=&UPSTREAM_TEST_JOB_NUMBER=64&DOCKERIMAGE_TAG=&TEST_TIME=&JDK_IMPL=hotspot&SSH_AGENT_CREDENTIAL=&AUTO_DETECT=true&SLACK_CHANNEL=aqavit-bot&DYNAMIC_COMPILE=false&RELATED_NODES=&ADOPTOPENJDK_SYSTEMTEST_OWNER_BRANCH=adoptium%3Amaster&APPLICATION_OPTIONS=&CUSTOMIZED_SDK_URL_CREDENTIAL_ID=eclipse_temurin_bot_email_and_token&ARCHIVE_TEST_RESULTS=false&NUM_MACHINES=&OPENJDK_SHA=&TRSS_URL=&USE_TESTENV_PROPERTIES=false&BUILD_LIST=openjdk&ADDITIONAL_ARTIFACTS_REQUIRED=&UPSTREAM_JOB_NUMBER=79&STF_OWNER_BRANCH=adoptium%3Amaster&TIME_LIMIT=25&JVM_OPTIONS=&PARALLEL=None
[Pipeline] junit
[2024-11-21T00:03:53.104Z] Recording test results
[2024-11-21T00:04:11.692Z] [Checks API] No suitable checks publisher found.
[Pipeline] }
[Pipeline] // stage
[Pipeline] echo
[2024-11-21T00:04:11.725Z] PROCESSCATCH: Terminating any hung/left over test processes:
[Pipeline] sh
[2024-11-21T00:04:13.786Z] + aqa-tests/terminateTestProcesses.sh jenkins
[2024-11-21T00:04:13.786Z] + 2>& 1
[2024-11-21T00:04:13.786Z] Unix type machine..
[2024-11-21T00:04:13.786Z] jenkins 25231684 1 0 21:27:11 - 0:00 /usr/bin/X11/X -force -vfb -x abx -x dbe -x GLX -secIP 000 :0
[2024-11-21T00:04:13.786Z] Boooo - there are rogue processes kicking about
[2024-11-21T00:04:13.786Z] Issuing a kill to all processes shown above
[2024-11-21T00:04:13.786Z] Sleeping for 10 seconds...
[2024-11-21T00:04:23.825Z] Processes stopped successfully
[Pipeline] cleanWs
[2024-11-21T00:04:24.551Z] [WS-CLEANUP] Deleting project workspace...
[2024-11-21T00:04:24.551Z] [WS-CLEANUP] Deferred wipeout is disabled by the job configuration...
[2024-11-21T00:04:45.613Z] [WS-CLEANUP] done
[Pipeline] sh
[2024-11-21T00:04:47.712Z] + find /tmp -name *core* -print -exec rm -f {} ;
[2024-11-21T00:04:47.712Z] + 2> /dev/null
[2024-11-21T00:04:47.712Z] + true
[Pipeline] }
[Pipeline] // timeout
[Pipeline] timeout
[2024-11-21T00:04:48.104Z] Timeout set to expire in 5 min 0 sec
[Pipeline] {
[Pipeline] }
[Pipeline] // timeout
[Pipeline] }
[Pipeline] // node
[Pipeline] }
[Pipeline] // stage
[Pipeline] echo
[2024-11-21T00:04:48.248Z] SETUP_LABEL: ci.role.test
[Pipeline] }
[Pipeline] // timestamps
[Pipeline] End of Pipeline
Also: org.jenkinsci.plugins.workflow.actions.ErrorAction$ErrorId: df67b642-68d0-497b-9565-3044dce844de
java.lang.NoSuchMethodError: No such DSL method 'run_parallel_tests' found among steps [addBadge, addEmbeddableBadgeConfiguration, addErrorBadge, addHtmlBadge, addInfoBadge, addShortText, addWarningBadge, ansiColor, ansibleTower, ansibleTowerProjectRevision, ansibleTowerProjectSync, archive, awsCodeBuild, bat, build, catchError, checkout, compareVersions, createSummary, deleteDir, dir, dockerFingerprintFrom, dockerFingerprintRun, ec2, echo, ecsTaskTemplate, emailext, emailextrecipients, envVarsForTool, error, fileExists, findBuildScans, findFiles, getContext, git, input, isUnix, jiraComment, jiraIssueSelector, jiraSearch, junit, library, libraryResource, load, lock, mail, milestone, node, nodesByLabel, nvm, openstackMachine, parallel, powershell, prependToFile, properties, publishChecks, publishHTML, pwd, pwsh, readCSV, readFile, readJSON, readManifest, readMavenPom, readProperties, readTrusted, readYaml, removeBadges, removeHtmlBadges, removeSummaries, resolveScm, retry, script, sh, sha1, sha256, slackSend, slackUploadFile, slackUserIdFromEmail, slackUserIdsFromCommitters, sleep, sshagent, stage, stash, step, svn, tar, tee, timeout, timestamps, tm, tool, touch, triggerRemoteJob, unarchive, unstable, unstash, untar, unzip, validateDeclarativePipeline, verifySha1, verifySha256, waitForBuild, waitUntil, warnError, withChecks, withContext, withCredentials, withDockerContainer, withDockerRegistry, withDockerServer, withEnv, withGradle, wrap, writeCSV, writeFile, writeJSON, writeMavenPom, writeYaml, ws, zip] or symbols [BearerTokenAuth, CredentialsAuth, FileParameters, GitUsernamePassword, MapParameter, MapParameters, NoneAuth, NullAuth, StringParameters, TokenAuth, agent, all, allBranchesSame, allOf, always, ant, antFromApache, antOutcome, antTarget, any, anyOf, apiToken, apiTokenProperty, architecture, archiveArtifacts, artifactManager, assembla, audit-trail, authorInChangelog, authorizationMatrix, aws, azureServicePrincipal, azureVMCloudRetentionStrategy, batchFile, bitbucket, bitbucketBranchDiscovery, bitbucketBuildStatusNotifications, bitbucketForkDiscovery, bitbucketPublicRepoPullRequestFilter, bitbucketPullRequestDiscovery, bitbucketServer, bitbucketSshCheckout, bitbucketTagDiscovery, bitbucketTrustEveryone, bitbucketTrustNobody, bitbucketTrustProject, bitbucketTrustTeam, bitbucketWebhookConfiguration, bitbucketWebhookRegistration, booleanParam, branch, brokenBuildSuspects, brokenTestsSuspects, browser, buildButton, buildDescription, buildDiscarder, buildDiscarders, buildName, buildParameter, buildRetention, buildSelector, buildSingleRevisionOnly, buildUser, buildUserVars, buildingTag, builtInNode, caseInsensitive, caseSensitive, certificate, cgit, changeRequest, changelog, changelogBase, changelogToBranch, changeset, checkoutOption, checkoutToSubdirectory, choice, choiceParam, cleanAfterCheckout, cleanBeforeCheckout, cleanWs, clock, cloneOption, command, configFile, configFileProvider, consoleUrlProvider, contributor, copyArtifactPermission, copyArtifacts, copyartifact, cps, credentials, cron, crumb, cssText, cssUrl, culprits, default, defaultDisplayUrlProvider, defaultFolderConfiguration, defaultView, demand, developers, disableConcurrentBuilds, disableRestartFromStage, disableResume, discoverOtherRefs, discoverOtherRefsTrait, diskSpace, diskSpaceMonitor, docker, dockerCert, dockerHubApiTokens, dockerImageNames, dockerServer, dockerTool, dockerTriggers, dockerfile, downstream, dumb, durabilityHint, ecs, email-ext, envVars, envVarsFilter, environment, equals, experimentalFlags, expression, extendedEmailPublisher, faviconUrl, file, fileCopyOperation, fileCreateOperation, fileDeleteOperation, fileDownloadOperation, fileJoinOperation, fileOperations, fileParam, filePath, filePropertiesToJsonOperation, fileRenameOperation, fileTransformOperation, fileUnTarOperation, fileUnZipOperation, fileZipOperation, fingerprint, fingerprints, firstBuildChangelog, fisheye, folderConfigFiles, folderCopyOperation, folderCreateOperation, folderDeleteOperation, folderRenameOperation, frameOptions, freeStyle, freeStyleJob, fromDocker, fromScm, fromSource, git, gitBranchDiscovery, gitHooks, gitHubBranchDiscovery, gitHubBranchHeadAuthority, gitHubExcludeArchivedRepositories, gitHubExcludeForkedRepositories, gitHubExcludePrivateRepositories, gitHubExcludePublicRepositories, gitHubForkDiscovery, gitHubIgnoreDraftPullRequestFilter, gitHubPullRequestDiscovery, gitHubSshCheckout, gitHubTagDiscovery, gitHubTopicsFilter, gitHubTrustContributors, gitHubTrustEveryone, gitHubTrustNobody, gitHubTrustPermissions, gitLab, gitList, gitSCM, gitTagDiscovery, gitTool, gitUsernamePassword, gitWeb, gitblit, github, githubAccessToken, githubProjectProperty, githubPush, gitiles, globalConfigFiles, gogs, gradle, group, headRegexFilter, headWildcardFilter, hyperlink, hyperlinkToModels, ignoreOnPush, image, inbound, inheriting, inheritingGlobal, installSource, instances, isRestartedRun, javadoc, jcloudsOneOffAgent, jcloudsTakeOffline, jdk, jdkInstaller, jf, jfrog, jgit, jgitapache, jnlp, jobBuildDiscarder, jobConfigHistory, jobDsl, jobName, jsUrl, junitTestResultStorage, jvmVersion, kiln, label, lastCompleted, lastDuration, lastFailure, lastGrantedAuthorities, lastStable, lastSuccess, lastSuccessful, lastWithArtifacts, latestSavedBuild, legacy, legacySCM, lfs, list, local, localBranch, localBranchTrait, location, logRotator, loggedInUsersCanDoAnything, mailer, masterBuild, maven, maven3Mojos, mavenErrors, mavenGlobalConfig, mavenMojos, mavenWarnings, modernSCM, multiBranchProjectDisplayNaming, multibranch, myView, namedBranchesDifferent, newContainerPerStage, node, nodeProperties, nonInheriting, none, nonresumable, not, openstack, openstackUserData, openstackV2, openstackV3, organizationFolder, overrideIndexTriggers, paneStatus, parallelsAlwaysFailFast, parameters, password, pattern, perBuildTag, permalink, permanent, phabricator, pipeline, pipeline-model, pipeline-model-docker, pipelineTriggers, plainText, plugin, pollSCM, preserveStashes, previous, projectNamingStrategy, proxy, pruneStaleBranch, pruneStaleTag, pruneTags, queueItemAuthenticator, quietPeriod, rateLimit, rateLimitBuilds, recipients, redmine, refSpecs, remoteName, remotingVersion, requestor, resourceRoot, responseTime, retainOnlyVariables, rhodeCode, run, runParam, sSHLauncher, schedule, scmGit, scmRetryCount, script, scriptApproval, scriptApprovalLink, search, security, separator, shell, simpleBuildDiscarder, simpleTheme, skipDefaultCheckout, skipStagesAfterUnstable, slackNotifier, slave, sourceRegexFilter, sourceWildcardFilter, sparseCheckout, sparseCheckoutPaths, specific, ssh, sshPublicKey, sshUserPrivateKey, standard, status, string, stringParam, submodule, submoduleOption, suppressAutomaticTriggering, suppressFolderAutomaticTriggering, svnPhabricator, swapSpace, tag, teamFoundation, teamSlugFilter, testNG, text, textParam, thinBackup, timestamper, timestamperConfig, timezone, tmpSpace, toolLocation, triggeredBy, unsecured, untrusted, upstream, upstreamDevelopers, url, user, userIdentity, userOrGroup, userSeed, usernameColonPassword, usernamePassword, viewgit, viewsTabBar, volumeFromImage, volumeSnapshot, weather, withAnt, withJclouds, workspace, x509ClientCert, xvfb, zip] or globals [currentBuild, docker, env, manager, params, pipeline, scm]
at PluginClassLoader for workflow-cps//org.jenkinsci.plugins.workflow.cps.DSL.invokeMethod(DSL.java:219)
at PluginClassLoader for workflow-cps//org.jenkinsci.plugins.workflow.cps.CpsScript.invokeMethod(CpsScript.java:124)
at jdk.internal.reflect.GeneratedMethodAccessor259.invoke(Unknown Source)
at java.base/jdk.internal.reflect.DelegatingMethodAccessorImpl.invoke(DelegatingMethodAccessorImpl.java:43)
at java.base/java.lang.reflect.Method.invoke(Method.java:569)
at org.codehaus.groovy.reflection.CachedMethod.invoke(CachedMethod.java:98)
at groovy.lang.MetaMethod.doMethodInvoke(MetaMethod.java:325)
at groovy.lang.MetaClassImpl.invokeMethod(MetaClassImpl.java:1225)
at groovy.lang.MetaClassImpl.invokeMethod(MetaClassImpl.java:1034)
at org.codehaus.groovy.runtime.callsite.PogoMetaClassSite.call(PogoMetaClassSite.java:41)
at org.codehaus.groovy.runtime.callsite.CallSiteArray.defaultCall(CallSiteArray.java:47)
at org.codehaus.groovy.runtime.callsite.AbstractCallSite.call(AbstractCallSite.java:116)
at PluginClassLoader for script-security//org.kohsuke.groovy.sandbox.impl.Checker$1.call(Checker.java:180)
at PluginClassLoader for script-security//org.kohsuke.groovy.sandbox.GroovyInterceptor.onMethodCall(GroovyInterceptor.java:23)
at PluginClassLoader for script-security//org.jenkinsci.plugins.scriptsecurity.sandbox.groovy.SandboxInterceptor.onMethodCall(SandboxInterceptor.java:163)
at PluginClassLoader for script-security//org.jenkinsci.plugins.scriptsecurity.sandbox.groovy.SandboxInterceptor.onMethodCall(SandboxInterceptor.java:148)
at PluginClassLoader for script-security//org.kohsuke.groovy.sandbox.impl.Checker$1.call(Checker.java:178)
at PluginClassLoader for script-security//org.kohsuke.groovy.sandbox.impl.Checker.checkedCall(Checker.java:182)
at PluginClassLoader for workflow-cps//com.cloudbees.groovy.cps.sandbox.SandboxInvoker.methodCall(SandboxInvoker.java:17)
at PluginClassLoader for workflow-cps//org.jenkinsci.plugins.workflow.cps.LoggingInvoker.methodCall(LoggingInvoker.java:117)
at WorkflowScript.run(WorkflowScript:407)
at ___cps.transform___(Native Method)
at PluginClassLoader for workflow-cps//com.cloudbees.groovy.cps.impl.ContinuationGroup.methodCall(ContinuationGroup.java:90)
at PluginClassLoader for workflow-cps//com.cloudbees.groovy.cps.impl.FunctionCallBlock$ContinuationImpl.dispatchOrArg(FunctionCallBlock.java:116)
at PluginClassLoader for workflow-cps//com.cloudbees.groovy.cps.impl.FunctionCallBlock$ContinuationImpl.fixName(FunctionCallBlock.java:80)
at jdk.internal.reflect.GeneratedMethodAccessor174.invoke(Unknown Source)
at java.base/jdk.internal.reflect.DelegatingMethodAccessorImpl.invoke(DelegatingMethodAccessorImpl.java:43)
at java.base/java.lang.reflect.Method.invoke(Method.java:569)
at PluginClassLoader for workflow-cps//com.cloudbees.groovy.cps.impl.ContinuationPtr$ContinuationImpl.receive(ContinuationPtr.java:72)
at PluginClassLoader for workflow-cps//com.cloudbees.groovy.cps.impl.ConstantBlock.eval(ConstantBlock.java:21)
at PluginClassLoader for workflow-cps//com.cloudbees.groovy.cps.Next.step(Next.java:83)
at PluginClassLoader for workflow-cps//com.cloudbees.groovy.cps.Continuable.run0(Continuable.java:147)
at PluginClassLoader for workflow-cps//org.jenkinsci.plugins.workflow.cps.SandboxContinuable.access$001(SandboxContinuable.java:17)
at PluginClassLoader for workflow-cps//org.jenkinsci.plugins.workflow.cps.SandboxContinuable.run0(SandboxContinuable.java:49)
at PluginClassLoader for workflow-cps//org.jenkinsci.plugins.workflow.cps.CpsThread.runNextChunk(CpsThread.java:180)
at PluginClassLoader for workflow-cps//org.jenkinsci.plugins.workflow.cps.CpsThreadGroup.run(CpsThreadGroup.java:423)
at PluginClassLoader for workflow-cps//org.jenkinsci.plugins.workflow.cps.CpsThreadGroup$2.call(CpsThreadGroup.java:331)
at PluginClassLoader for workflow-cps//org.jenkinsci.plugins.workflow.cps.CpsThreadGroup$2.call(CpsThreadGroup.java:295)
at PluginClassLoader for workflow-cps//org.jenkinsci.plugins.workflow.cps.CpsVmExecutorService.lambda$wrap$4(CpsVmExecutorService.java:140)
at java.base/java.util.concurrent.FutureTask.run(FutureTask.java:264)
at hudson.remoting.SingleLaneExecutorService$1.run(SingleLaneExecutorService.java:139)
at jenkins.util.ContextResettingExecutorService$1.run(ContextResettingExecutorService.java:28)
at jenkins.security.ImpersonatingExecutorService$1.run(ImpersonatingExecutorService.java:68)
at jenkins.util.ErrorLoggingExecutorService.lambda$wrap$0(ErrorLoggingExecutorService.java:51)
at java.base/java.util.concurrent.Executors$RunnableAdapter.call(Executors.java:539)
at java.base/java.util.concurrent.FutureTask.run(FutureTask.java:264)
at java.base/java.util.concurrent.ThreadPoolExecutor.runWorker(ThreadPoolExecutor.java:1136)
at java.base/java.util.concurrent.ThreadPoolExecutor$Worker.run(ThreadPoolExecutor.java:635)
at PluginClassLoader for workflow-cps//org.jenkinsci.plugins.workflow.cps.CpsVmExecutorService$1.call(CpsVmExecutorService.java:53)
at PluginClassLoader for workflow-cps//org.jenkinsci.plugins.workflow.cps.CpsVmExecutorService$1.call(CpsVmExecutorService.java:50)
at org.codehaus.groovy.runtime.GroovyCategorySupport$ThreadCategoryInfo.use(GroovyCategorySupport.java:136)
at org.codehaus.groovy.runtime.GroovyCategorySupport.use(GroovyCategorySupport.java:275)
at PluginClassLoader for workflow-cps//org.jenkinsci.plugins.workflow.cps.CpsVmExecutorService.lambda$categoryThreadFactory$0(CpsVmExecutorService.java:50)
at java.base/java.lang.Thread.run(Thread.java:840)
/home/jenkins/.jenkins/workspace/Test_openjdk21_hs_extended.openjdk_ppc64_aix_testList_2@tmp/jfrog/28/.jfrog deleted
Finished: FAILURE