DBBLoadTest_5m_0
[2024-08-21T20:54:40.755Z] Running test DBBLoadTest_5m_0 ...
[2024-08-21T20:54:40.755Z] ===============================================
[2024-08-21T20:54:40.755Z] DBBLoadTest_5m_0 Start Time: Wed Aug 21 20:54:39 2024 Epoch Time (ms): 1724273679950
[2024-08-21T20:54:40.755Z] variation: Mode150
[2024-08-21T20:54:40.755Z] JVM_OPTIONS: -XX:+UseCompressedOops
[2024-08-21T20:54:40.755Z] { \
[2024-08-21T20:54:40.755Z] echo ""; echo "TEST SETUP:"; \
[2024-08-21T20:54:40.755Z] echo "Nothing to be done for setup."; \
[2024-08-21T20:54:40.755Z] mkdir -p "/home/jenkins/workspace/Test_openjdk21_hs_extended.system_s390x_linux/aqa-tests/TKG/../TKG/output_17242728099468/DBBLoadTest_5m_0"; \
[2024-08-21T20:54:40.755Z] cd "/home/jenkins/workspace/Test_openjdk21_hs_extended.system_s390x_linux/aqa-tests/TKG/../TKG/output_17242728099468/DBBLoadTest_5m_0"; \
[2024-08-21T20:54:40.755Z] echo ""; echo "TESTING:"; \
[2024-08-21T20:54:40.755Z] perl /home/jenkins/workspace/Test_openjdk21_hs_extended.system_s390x_linux/aqa-tests/TKG/../../jvmtest/system/otherLoadTest/..//STF/stf.core/scripts/stf.pl -test-root="/home/jenkins/workspace/Test_openjdk21_hs_extended.system_s390x_linux/aqa-tests/TKG/../../jvmtest/system/otherLoadTest/..//STF;/home/jenkins/workspace/Test_openjdk21_hs_extended.system_s390x_linux/aqa-tests/TKG/../../jvmtest/system/otherLoadTest/..//aqa-systemtest""" -systemtest-prereqs="/home/jenkins/workspace/Test_openjdk21_hs_extended.system_s390x_linux/../../testDependency/system_lib/" -java-args=' -XX:+UseCompressedOops ' -results-root="/home/jenkins/workspace/Test_openjdk21_hs_extended.system_s390x_linux/aqa-tests/TKG/../TKG/output_17242728099468/DBBLoadTest_5m_0" -test=DirectByteBufferLoadTest -test-args="timeLimit=5m"; \
[2024-08-21T20:54:40.755Z] if [ $? -eq 0 ]; then echo "-----------------------------------"; echo "DBBLoadTest_5m_0""_PASSED"; echo "-----------------------------------"; cd /home/jenkins/workspace/Test_openjdk21_hs_extended.system_s390x_linux/aqa-tests/TKG/..; rm -f -r "/home/jenkins/workspace/Test_openjdk21_hs_extended.system_s390x_linux/aqa-tests/TKG/../TKG/output_17242728099468/DBBLoadTest_5m_0"; else echo "-----------------------------------"; echo "DBBLoadTest_5m_0""_FAILED"; echo "-----------------------------------"; fi; \
[2024-08-21T20:54:40.755Z] echo ""; echo "TEST TEARDOWN:"; \
[2024-08-21T20:54:40.755Z] echo "Nothing to be done for teardown."; \
[2024-08-21T20:54:40.755Z] } 2>&1 | tee -a "/home/jenkins/workspace/Test_openjdk21_hs_extended.system_s390x_linux/aqa-tests/TKG/../TKG/output_17242728099468/TestTargetResult";
[2024-08-21T20:54:40.755Z]
[2024-08-21T20:54:40.755Z] TEST SETUP:
[2024-08-21T20:54:40.755Z] Nothing to be done for setup.
[2024-08-21T20:54:40.755Z]
[2024-08-21T20:54:40.755Z] TESTING:
[2024-08-21T20:54:40.755Z] STF 20:54:40.053 - ========================= S T F =========================
[2024-08-21T20:54:40.755Z] systemtest-prereqs has been processed, and set to: /home/jenkins/testDependency/system_libRetrieving amount of free space on drive containing /home/jenkins/workspace/Test_openjdk21_hs_extended.system_s390x_linux/aqa-tests/TKG/../TKG/output_17242728099468/DBBLoadTest_5m_0
[2024-08-21T20:54:40.755Z] There is 20142 Mb free
[2024-08-21T20:54:40.755Z] STF 20:54:40.059 - ================== G E N E R A T I O N ==================
[2024-08-21T20:54:40.755Z] STF 20:54:40.060 - Checking JVM: /home/jenkins/workspace/Test_openjdk21_hs_extended.system_s390x_linux/jdkbinary/j2sdk-image
[2024-08-21T20:54:40.755Z] STF 20:54:40.060 - Starting process to generate scripts: /home/jenkins/workspace/Test_openjdk21_hs_extended.system_s390x_linux/jdkbinary/j2sdk-image/bin/java -Dlog4j.skipJansi=true -Djava.system.class.loader=net.adoptopenjdk.stf.runner.StfClassLoader -classpath /home/jenkins/workspace/Test_openjdk21_hs_extended.system_s390x_linux/../../testDependency/system_lib//log4j/log4j-api.jar:/home/jenkins/workspace/Test_openjdk21_hs_extended.system_s390x_linux/../../testDependency/system_lib//log4j/log4j-core.jar:/home/jenkins/workspace/Test_openjdk21_hs_extended.system_s390x_linux/jvmtest/system/STF/stf.core/scripts/../bin net.adoptopenjdk.stf.runner.StfRunner -properties "/home/jenkins/workspace/Test_openjdk21_hs_extended.system_s390x_linux/aqa-tests/TKG/../TKG/output_17242728099468/DBBLoadTest_5m_0/20240821-205440-DirectByteBufferLoadTest/stf_parameters.properties, , /home/jenkins/workspace/Test_openjdk21_hs_extended.system_s390x_linux/jvmtest/system/STF/stf.core/config/stf.properties" -testDir "/home/jenkins/workspace/Test_openjdk21_hs_extended.system_s390x_linux/aqa-tests/TKG/../TKG/output_17242728099468/DBBLoadTest_5m_0/20240821-205440-DirectByteBufferLoadTest"
[2024-08-21T20:54:40.755Z] GEN [0.004s][warning][cds] Archived non-system classes are disabled because the java.system.class.loader property is specified (value = "net.adoptopenjdk.stf.runner.StfClassLoader"). To use archived non-system classes, this property must not be set
[2024-08-21T20:54:40.755Z] GEN stderr Picked up JAVA_TOOL_OPTIONS: -Djava.security.manager=allow
[2024-08-21T20:54:45.017Z] GEN 20:54:44.597 - Found test. Project: 'openjdk.test.load' class: 'DirectByteBufferLoadTest.class' Dir: '/home/jenkins/workspace/Test_openjdk21_hs_extended.system_s390x_linux/jvmtest/system/aqa-systemtest/openjdk.test.load/bin'
[2024-08-21T20:54:45.017Z] GEN 20:54:44.608 - Found test. Project: 'openjdk.test.load' class: 'net.adoptopenjdk.stf.DirectByteBufferLoadTest'
[2024-08-21T20:54:45.017Z] GEN Classpath directories used by project 'openjdk.test.load':
[2024-08-21T20:54:45.017Z] GEN /home/jenkins/workspace/Test_openjdk21_hs_extended.system_s390x_linux/jvmtest/system/aqa-systemtest/openjdk.test.load/bin
[2024-08-21T20:54:45.017Z] GEN /home/jenkins/workspace/Test_openjdk21_hs_extended.system_s390x_linux/jvmtest/system/STF/stf.core/bin
[2024-08-21T20:54:45.017Z] GEN /home/jenkins/workspace/Test_openjdk21_hs_extended.system_s390x_linux/jvmtest/system/STF/stf.load/bin
[2024-08-21T20:54:45.017Z] GEN /home/jenkins/testDependency/system_lib/log4j/log4j-api.jar
[2024-08-21T20:54:45.017Z] GEN /home/jenkins/testDependency/system_lib/log4j/log4j-core.jar
[2024-08-21T20:54:45.017Z] GEN /home/jenkins/testDependency/system_lib/junit/junit.jar
[2024-08-21T20:54:45.017Z] GEN /home/jenkins/testDependency/system_lib/junit/hamcrest-core.jar
[2024-08-21T20:54:45.017Z] GEN 20:54:44.853 - Using Mode NoOptions. Values = ''
[2024-08-21T20:54:45.659Z] GEN 20:54:44.990 -
[2024-08-21T20:54:45.659Z] GEN 20:54:44.991 - Test command summary:
[2024-08-21T20:54:45.659Z] GEN 20:54:44.996 - Step Stage Command Description
[2024-08-21T20:54:45.659Z] GEN 20:54:44.997 - -----+--------+-----------------+------------
[2024-08-21T20:54:45.659Z] GEN 20:54:44.997 - 1 execute Run java Run DirectByteBuffer load test
[2024-08-21T20:54:45.659Z] STF 20:54:45.038 -
[2024-08-21T20:54:45.659Z] STF 20:54:45.038 - Script generation completed
[2024-08-21T20:54:45.659Z] STF 20:54:45.038 -
[2024-08-21T20:54:45.659Z] STF 20:54:45.038 -
[2024-08-21T20:54:45.659Z] STF 20:54:45.038 - ======================= S E T U P =======================
[2024-08-21T20:54:45.659Z] STF 20:54:45.038 - Running setup: perl /home/jenkins/workspace/Test_openjdk21_hs_extended.system_s390x_linux/aqa-tests/TKG/../TKG/output_17242728099468/DBBLoadTest_5m_0/20240821-205440-DirectByteBufferLoadTest/setUp.pl
[2024-08-21T20:54:45.659Z] STF 20:54:45.126 - SETUP stage completed
[2024-08-21T20:54:45.659Z] STF 20:54:45.131 -
[2024-08-21T20:54:45.659Z] STF 20:54:45.131 - ==================== E X E C U T E - ====================
[2024-08-21T20:54:45.659Z] STF 20:54:45.131 - Running execute: perl /home/jenkins/workspace/Test_openjdk21_hs_extended.system_s390x_linux/aqa-tests/TKG/../TKG/output_17242728099468/DBBLoadTest_5m_0/20240821-205440-DirectByteBufferLoadTest/execute.pl
[2024-08-21T20:54:45.659Z] STF 20:54:45.178 -
[2024-08-21T20:54:45.659Z] STF 20:54:45.178 - Java version
[2024-08-21T20:54:45.659Z] STF 20:54:45.178 - Running: /home/jenkins/workspace/Test_openjdk21_hs_extended.system_s390x_linux/jdkbinary/j2sdk-image/bin/java -version
[2024-08-21T20:54:45.659Z] Picked up JAVA_TOOL_OPTIONS: -Djava.security.manager=allow
[2024-08-21T20:54:45.659Z] openjdk version "21.0.5-beta" 2024-10-15
[2024-08-21T20:54:45.659Z] OpenJDK Runtime Environment Temurin-21.0.5+4-202408211902 (build 21.0.5-beta+4-ea)
[2024-08-21T20:54:45.659Z] OpenJDK 64-Bit Server VM Temurin-21.0.5+4-202408211902 (build 21.0.5-beta+4-ea, mixed mode, sharing)
[2024-08-21T20:54:45.659Z] STF 20:54:45.233 -
[2024-08-21T20:54:45.659Z] STF 20:54:45.233 - +------ Step 1 - Run DirectByteBuffer load test
[2024-08-21T20:54:45.659Z] STF 20:54:45.233 - | Run foreground process
[2024-08-21T20:54:45.659Z] STF 20:54:45.233 - | Program: /home/jenkins/workspace/Test_openjdk21_hs_extended.system_s390x_linux/jdkbinary/j2sdk-image/bin/java
[2024-08-21T20:54:45.659Z] STF 20:54:45.233 - | Mnemonic: DBLT
[2024-08-21T20:54:45.659Z] STF 20:54:45.233 - | Echo: ECHO_ON
[2024-08-21T20:54:45.659Z] STF 20:54:45.233 - | Expectation: CLEAN_RUN within 1h5m
[2024-08-21T20:54:45.659Z] STF 20:54:45.233 - |
[2024-08-21T20:54:45.659Z] STF 20:54:45.234 - Running command: /home/jenkins/workspace/Test_openjdk21_hs_extended.system_s390x_linux/jdkbinary/j2sdk-image/bin/java -Xmx512m -XX:+UseCompressedOops -classpath /home/jenkins/workspace/Test_openjdk21_hs_extended.system_s390x_linux/jvmtest/system/STF/stf.load/bin:/home/jenkins/workspace/Test_openjdk21_hs_extended.system_s390x_linux/jvmtest/system/STF/stf.core/bin:/home/jenkins/testDependency/system_lib/log4j/log4j-api.jar:/home/jenkins/testDependency/system_lib/log4j/log4j-core.jar:/home/jenkins/testDependency/system_lib/junit/junit.jar:/home/jenkins/testDependency/system_lib/junit/hamcrest-core.jar:/home/jenkins/workspace/Test_openjdk21_hs_extended.system_s390x_linux/jvmtest/system/aqa-systemtest/openjdk.test.nio/bin/lib/filesystem.jar:/home/jenkins/workspace/Test_openjdk21_hs_extended.system_s390x_linux/jvmtest/system/aqa-systemtest/openjdk.test.gc/bin:/home/jenkins/workspace/Test_openjdk21_hs_extended.system_s390x_linux/jvmtest/system/aqa-systemtest/openjdk.test.nio/bin net.adoptopenjdk.loadTest.LoadTest -resultsDir /home/jenkins/workspace/Test_openjdk21_hs_extended.system_s390x_linux/aqa-tests/TKG/output_17242728099468/DBBLoadTest_5m_0/20240821-205440-DirectByteBufferLoadTest/results -resultsPrefix 1.DBLT. -timeLimit 5m -reportFailureLimit 1 -abortAtFailureLimit 10 -maxTotalLogFileSpace 200M -maxSingleLogSize 1/25 -suite.DirectByteBuffer.thinkingTime 1ms..1ms -suite.DirectByteBuffer.threadCount 2 -suite.DirectByteBuffer.inventoryFile /home/jenkins/workspace/Test_openjdk21_hs_extended.system_s390x_linux/aqa-tests/TKG/output_17242728099468/DBBLoadTest_5m_0/20240821-205440-DirectByteBufferLoadTest/results/1.DBLT.inventory/openjdk.test.load/config/inventories/gc/directByteBuffer.xml -suite.DirectByteBuffer.inventoryExcludeFile none -suite.DirectByteBuffer.selection random -suite.DirectByteBuffer.seed -1 -suite.DirectByteBuffer.repeatCount 1
[2024-08-21T20:54:45.659Z] STF 20:54:45.234 - Redirecting stderr to /home/jenkins/workspace/Test_openjdk21_hs_extended.system_s390x_linux/aqa-tests/TKG/output_17242728099468/DBBLoadTest_5m_0/20240821-205440-DirectByteBufferLoadTest/results/1.DBLT.stderr
[2024-08-21T20:54:45.659Z] STF 20:54:45.234 - Redirecting stdout to /home/jenkins/workspace/Test_openjdk21_hs_extended.system_s390x_linux/aqa-tests/TKG/output_17242728099468/DBBLoadTest_5m_0/20240821-205440-DirectByteBufferLoadTest/results/1.DBLT.stdout
[2024-08-21T20:54:45.659Z] STF 20:54:45.241 - Monitoring processes: DBLT
[2024-08-21T20:54:45.659Z] DBLT stderr Picked up JAVA_TOOL_OPTIONS: -Djava.security.manager=allow
[2024-08-21T20:54:46.987Z] DBLT 20:54:46.619 - Load test parameters
[2024-08-21T20:54:46.987Z] DBLT 20:54:46.621 - Time limited = true
[2024-08-21T20:54:46.987Z] DBLT 20:54:46.621 - Time limit = 5m
[2024-08-21T20:54:46.987Z] DBLT 20:54:46.621 - abortIfOutOfMemory = true
[2024-08-21T20:54:46.987Z] DBLT 20:54:46.621 - reportFailureLimit = 1
[2024-08-21T20:54:46.987Z] DBLT 20:54:46.624 - abortAtFailureLimit = 10
[2024-08-21T20:54:46.987Z] DBLT 20:54:46.626 - maxTotalLogFileSpace = 209715200
[2024-08-21T20:54:46.987Z] DBLT 20:54:46.626 - maxSingleLogSize = 8388608
[2024-08-21T20:54:46.987Z] DBLT 20:54:46.626 - Parameters for suite 0
[2024-08-21T20:54:46.987Z] DBLT 20:54:46.626 - Suite name = DirectByteBuffer
[2024-08-21T20:54:46.987Z] DBLT 20:54:46.627 - Number threads = 2
[2024-08-21T20:54:46.987Z] DBLT 20:54:46.627 - Supplied seed = -1
[2024-08-21T20:54:46.987Z] DBLT 20:54:46.627 - Inventory file = /home/jenkins/workspace/Test_openjdk21_hs_extended.system_s390x_linux/aqa-tests/TKG/output_17242728099468/DBBLoadTest_5m_0/20240821-205440-DirectByteBufferLoadTest/results/1.DBLT.inventory/openjdk.test.load/config/inventories/gc/directByteBuffer.xml
[2024-08-21T20:54:46.987Z] DBLT 20:54:46.627 - Exclude file = none
[2024-08-21T20:54:46.987Z] DBLT 20:54:46.627 - Number tests = -1
[2024-08-21T20:54:46.987Z] DBLT 20:54:46.627 - Repeat count = 1
[2024-08-21T20:54:46.987Z] DBLT 20:54:46.627 - Thinking time = 1ms..1ms
[2024-08-21T20:54:46.987Z] DBLT 20:54:46.627 - Selection mode = random
[2024-08-21T20:54:46.987Z] DBLT 20:54:46.627 - Actual seed = 1723407568200
[2024-08-21T20:54:46.987Z] DBLT 20:54:46.633 - Parsing inventory file. Root=/home/jenkins/workspace/Test_openjdk21_hs_extended.system_s390x_linux/aqa-tests/TKG/output_17242728099468/DBBLoadTest_5m_0/20240821-205440-DirectByteBufferLoadTest/results/1.DBLT.inventory File=openjdk.test.load/config/inventories/gc/directByteBuffer.xml
[2024-08-21T20:54:46.987Z] DBLT 20:54:46.636 - Found included inventory. File=/openjdk.test.load/config/inventories/nio/nio.xml
[2024-08-21T20:54:46.987Z] DBLT 20:54:46.636 - Parsing inventory file. Root=/home/jenkins/workspace/Test_openjdk21_hs_extended.system_s390x_linux/aqa-tests/TKG/output_17242728099468/DBBLoadTest_5m_0/20240821-205440-DirectByteBufferLoadTest/results/1.DBLT.inventory File=/openjdk.test.load/config/inventories/nio/nio.xml
[2024-08-21T20:54:46.987Z] DBLT 20:54:46.640 - Final test list:
[2024-08-21T20:54:46.987Z] DBLT 20:54:46.645 - 0 ArbitraryJava[net.adoptopenjdk.test.nio.WordCount run] Weighting=1
[2024-08-21T20:54:46.987Z] DBLT 20:54:46.645 - 1 ArbitraryJava[net.adoptopenjdk.test.nio.NioApp run] Weighting=1
[2024-08-21T20:54:46.987Z] DBLT 20:54:46.645 - 2 ArbitraryJava[net.adoptopenjdk.test.nio.NioBuffers run] Weighting=1
[2024-08-21T20:54:46.987Z] DBLT 20:54:46.645 - 3 ArbitraryJava[net.adoptopenjdk.test.nio.NioBuffersTest run] Weighting=1
[2024-08-21T20:54:46.987Z] DBLT 20:54:46.645 - 4 JUnit[net.adoptopenjdk.test.nio2.asyncio.client.MultipleConnectFutureTest] Weighting=1
[2024-08-21T20:54:46.987Z] DBLT 20:54:46.645 - 5 JUnit[net.adoptopenjdk.test.nio2.asyncio.client.MultipleConnectAsyncTest] Weighting=1
[2024-08-21T20:54:46.987Z] DBLT 20:54:46.645 - 6 JUnit[net.adoptopenjdk.test.nio2.asyncio.client.MultipleReadWriteAsyncTest] Weighting=1
[2024-08-21T20:54:46.987Z] DBLT 20:54:46.646 - 7 JUnit[net.adoptopenjdk.test.nio2.asyncio.client.MultipleReadWriteFutureTest] Weighting=1
[2024-08-21T20:54:46.987Z] DBLT 20:54:46.646 - 8 JUnit[net.adoptopenjdk.test.nio2.asyncio.file.AsynchronousFileChannelTest] Weighting=1
[2024-08-21T20:54:46.987Z] DBLT 20:54:46.646 - 9 JUnit[net.adoptopenjdk.test.nio2.mxbean.ByteBufferMXBeanTest] Weighting=1
[2024-08-21T20:54:46.987Z] DBLT 20:54:46.646 - 10 JUnit[net.adoptopenjdk.test.nio2.filesystem.FileSystemsTest] Weighting=1
[2024-08-21T20:54:46.987Z] DBLT 20:54:46.646 - 11 JUnit[net.adoptopenjdk.test.nio2.path.PathDeleteDirectoryTest] Weighting=1
[2024-08-21T20:54:46.987Z] DBLT 20:54:46.646 - 12 JUnit[net.adoptopenjdk.test.nio2.path.PathDirectoryStreamTest] Weighting=1
[2024-08-21T20:54:46.987Z] DBLT 20:54:46.646 - 13 JUnit[net.adoptopenjdk.test.nio2.path.ScannerTest] Weighting=1
[2024-08-21T20:54:46.987Z] DBLT 20:54:46.646 - 14 JUnit[net.adoptopenjdk.test.nio2.path.WalkFileTreeTest] Weighting=1
[2024-08-21T20:54:46.987Z] DBLT 20:54:46.646 - 15 JUnit[net.adoptopenjdk.test.gc.directbytebuffer.DirectMemoryTest] Weighting=1
[2024-08-21T20:54:46.987Z] DBLT stderr WARNING: A terminally deprecated method in java.lang.System has been called
[2024-08-21T20:54:46.987Z] DBLT stderr WARNING: System::setSecurityManager has been called by net.adoptopenjdk.loadTest.LoadTest (file:/home/jenkins/workspace/Test_openjdk21_hs_extended.system_s390x_linux/jvmtest/system/STF/stf.load/bin/)
[2024-08-21T20:54:46.987Z] DBLT stderr WARNING: Please consider reporting this to the maintainers of net.adoptopenjdk.loadTest.LoadTest
[2024-08-21T20:54:46.987Z] DBLT stderr WARNING: System::setSecurityManager will be removed in a future release
[2024-08-21T20:54:46.987Z] DBLT 20:54:46.673 - Starting thread. Suite=0 thread=0
[2024-08-21T20:54:46.987Z] DBLT 20:54:46.674 - Starting thread. Suite=0 thread=1
[2024-08-21T20:54:51.874Z] DBLT 20:54:51.491 - First failure detected by thread: load-0. Not creating dumps as no dump generation is requested for this load test
[2024-08-21T20:54:52.939Z] DBLT 20:54:52.573 - suite.getInventory().getInventoryFileRef(): openjdk.test.load/config/inventories/gc/directByteBuffer.xml
[2024-08-21T20:54:52.939Z] DBLT 20:54:52.574 - suite.isCreateDump() : false
[2024-08-21T20:54:52.939Z] DBLT 20:54:52.579 - Test failed
[2024-08-21T20:54:52.939Z] DBLT Failure num. = 1
[2024-08-21T20:54:52.939Z] DBLT Test number = 5
[2024-08-21T20:54:52.939Z] DBLT Test details = 'JUnit[net.adoptopenjdk.test.nio2.asyncio.client.MultipleConnectAsyncTest]'
[2024-08-21T20:54:52.939Z] DBLT Suite number = 0
[2024-08-21T20:54:52.939Z] DBLT Thread number = 0
[2024-08-21T20:54:52.939Z] DBLT >>> Captured test output >>>
[2024-08-21T20:54:52.939Z] DBLT Starting up Asynchronous Echo Server instance.
[2024-08-21T20:54:52.939Z] DBLT Echo Server log available at EchoServer.log
[2024-08-21T20:54:52.939Z] DBLT EchoServer Using channel group - sun.nio.ch.EPollPort@2e424a8c
[2024-08-21T20:54:52.939Z] DBLT Completed Asynchronous Echo Server startup - available at /148.100.74.154:40229
[2024-08-21T20:54:52.939Z] DBLT testStarted : testMultipleSequentialConnect(net.adoptopenjdk.test.nio2.asyncio.client.MultipleConnectAsyncTest)
[2024-08-21T20:54:52.939Z] DBLT MultipleConnectAsyncTest.testMultipleSequentialConnect() creating 5 connections
[2024-08-21T20:54:52.939Z] DBLT testFailure: testMultipleSequentialConnect(net.adoptopenjdk.test.nio2.asyncio.client.MultipleConnectAsyncTest): [Failed Assertion Exceptions:
[2024-08-21T20:54:52.939Z] DBLT net.adoptopenjdk.test.nio2.util.AssertionFailedException: java.net.NoRouteToHostException: No route to host
[2024-08-21T20:54:52.939Z] DBLT at net.adoptopenjdk.test.nio2.asyncio.client.MultipleConnectAsyncTest$1.failed(MultipleConnectAsyncTest.java:124)
[2024-08-21T20:54:52.939Z] DBLT at net.adoptopenjdk.test.nio2.asyncio.client.MultipleConnectAsyncTest$1.failed(MultipleConnectAsyncTest.java:84)
[2024-08-21T20:54:52.939Z] DBLT at java.base/sun.nio.ch.Invoker.invokeUnchecked(Invoker.java:131)
[2024-08-21T20:54:52.939Z] DBLT at java.base/sun.nio.ch.Invoker$2.run(Invoker.java:221)
[2024-08-21T20:54:52.939Z] DBLT at java.base/sun.nio.ch.AsynchronousChannelGroupImpl$1.run(AsynchronousChannelGroupImpl.java:113)
[2024-08-21T20:54:52.939Z] DBLT at java.base/java.util.concurrent.ThreadPoolExecutor.runWorker(ThreadPoolExecutor.java:1144)
[2024-08-21T20:54:52.939Z] DBLT at java.base/java.util.concurrent.ThreadPoolExecutor$Worker.run(ThreadPoolExecutor.java:642)
[2024-08-21T20:54:52.939Z] DBLT at java.base/java.lang.Thread.run(Thread.java:1583)
[2024-08-21T20:54:52.939Z] DBLT at java.base/jdk.internal.misc.InnocuousThread.run(InnocuousThread.java:186)
[2024-08-21T20:54:52.939Z] DBLT Caused by: java.net.NoRouteToHostException: No route to host
[2024-08-21T20:54:52.939Z] DBLT at java.base/sun.nio.ch.UnixAsynchronousSocketChannelImpl.checkConnect(Native Method)
[2024-08-21T20:54:52.939Z] DBLT at java.base/sun.nio.ch.UnixAsynchronousSocketChannelImpl.finishConnect(UnixAsynchronousSocketChannelImpl.java:256)
[2024-08-21T20:54:52.939Z] DBLT at java.base/sun.nio.ch.UnixAsynchronousSocketChannelImpl.finish(UnixAsynchronousSocketChannelImpl.java:202)
[2024-08-21T20:54:52.939Z] DBLT at java.base/sun.nio.ch.UnixAsynchronousSocketChannelImpl.onEvent(UnixAsynchronousSocketChannelImpl.java:217)
[2024-08-21T20:54:52.939Z] DBLT at java.base/sun.nio.ch.EPollPort$EventHandlerTask.run(EPollPort.java:305)
[2024-08-21T20:54:52.939Z] DBLT ... 2 more
[2024-08-21T20:54:52.939Z] DBLT ---
[2024-08-21T20:54:52.939Z] DBLT , Failed Assertion Exceptions:
[2024-08-21T20:54:52.939Z] DBLT net.adoptopenjdk.test.nio2.util.AssertionFailedException: java.net.NoRouteToHostException: No route to host
[2024-08-21T20:54:52.939Z] DBLT at net.adoptopenjdk.test.nio2.asyncio.client.MultipleConnectAsyncTest$1.failed(MultipleConnectAsyncTest.java:124)
[2024-08-21T20:54:52.939Z] DBLT at net.adoptopenjdk.test.nio2.asyncio.client.MultipleConnectAsyncTest$1.failed(MultipleConnectAsyncTest.java:84)
[2024-08-21T20:54:52.939Z] DBLT at java.base/sun.nio.ch.Invoker.invokeUnchecked(Invoker.java:131)
[2024-08-21T20:54:52.939Z] DBLT at java.base/sun.nio.ch.UnixAsynchronousSocketChannelImpl.finishConnect(UnixAsynchronousSocketChannelImpl.java:287)
[2024-08-21T20:54:52.939Z] DBLT at java.base/sun.nio.ch.UnixAsynchronousSocketChannelImpl.finish(UnixAsynchronousSocketChannelImpl.java:202)
[2024-08-21T20:54:52.939Z] DBLT at java.base/sun.nio.ch.UnixAsynchronousSocketChannelImpl.onEvent(UnixAsynchronousSocketChannelImpl.java:217)
[2024-08-21T20:54:52.939Z] DBLT at java.base/sun.nio.ch.EPollPort$EventHandlerTask.run(EPollPort.java:305)
[2024-08-21T20:54:52.939Z] DBLT at java.base/sun.nio.ch.AsynchronousChannelGroupImpl$1.run(AsynchronousChannelGroupImpl.java:113)
[2024-08-21T20:54:52.939Z] DBLT at java.base/java.util.concurrent.ThreadPoolExecutor.runWorker(ThreadPoolExecutor.java:1144)
[2024-08-21T20:54:52.939Z] DBLT at java.base/java.util.concurrent.ThreadPoolExecutor$Worker.run(ThreadPoolExecutor.java:642)
[2024-08-21T20:54:52.939Z] DBLT at java.base/java.lang.Thread.run(Thread.java:1583)
[2024-08-21T20:54:52.939Z] DBLT at java.base/jdk.internal.misc.InnocuousThread.run(InnocuousThread.java:186)
[2024-08-21T20:54:52.939Z] DBLT Caused by: java.net.NoRouteToHostException: No route to host
[2024-08-21T20:54:52.939Z] DBLT at java.base/sun.nio.ch.UnixAsynchronousSocketChannelImpl.checkConnect(Native Method)
[2024-08-21T20:54:52.939Z] DBLT at java.base/sun.nio.ch.UnixAsynchronousSocketChannelImpl.finishConnect(UnixAsynchronousSocketChannelImpl.java:256)
[2024-08-21T20:54:52.939Z] DBLT ... 8 more
[2024-08-21T20:54:52.939Z] DBLT ---
[2024-08-21T20:54:52.939Z] DBLT , Failed Assertion Exceptions:
[2024-08-21T20:54:52.939Z] DBLT net.adoptopenjdk.test.nio2.util.AssertionFailedException: java.net.NoRouteToHostException: No route to host
[2024-08-21T20:54:52.939Z] DBLT at net.adoptopenjdk.test.nio2.asyncio.client.MultipleConnectAsyncTest$1.failed(MultipleConnectAsyncTest.java:124)
[2024-08-21T20:54:52.939Z] DBLT at net.adoptopenjdk.test.nio2.asyncio.client.MultipleConnectAsyncTest$1.failed(MultipleConnectAsyncTest.java:84)
[2024-08-21T20:54:52.939Z] DBLT at java.base/sun.nio.ch.Invoker.invokeUnchecked(Invoker.java:131)
[2024-08-21T20:54:52.939Z] DBLT at java.base/sun.nio.ch.UnixAsynchronousSocketChannelImpl.finishConnect(UnixAsynchronousSocketChannelImpl.java:287)
[2024-08-21T20:54:52.939Z] DBLT at java.base/sun.nio.ch.UnixAsynchronousSocketChannelImpl.finish(UnixAsynchronousSocketChannelImpl.java:202)
[2024-08-21T20:54:52.939Z] DBLT at java.base/sun.nio.ch.UnixAsynchronousSocketChannelImpl.onEvent(UnixAsynchronousSocketChannelImpl.java:217)
[2024-08-21T20:54:52.939Z] DBLT at java.base/sun.nio.ch.EPollPort$EventHandlerTask.run(EPollPort.java:305)
[2024-08-21T20:54:52.939Z] DBLT at java.base/sun.nio.ch.AsynchronousChannelGroupImpl$1.run(AsynchronousChannelGroupImpl.java:113)
[2024-08-21T20:54:52.939Z] DBLT at java.base/java.util.concurrent.ThreadPoolExecutor.runWorker(ThreadPoolExecutor.java:1144)
[2024-08-21T20:54:52.939Z] DBLT at java.base/java.util.concurrent.ThreadPoolExecutor$Worker.run(ThreadPoolExecutor.java:642)
[2024-08-21T20:54:52.939Z] DBLT at java.base/java.lang.Thread.run(Thread.java:1583)
[2024-08-21T20:54:52.939Z] DBLT at java.base/jdk.internal.misc.InnocuousThread.run(InnocuousThread.java:186)
[2024-08-21T20:54:52.939Z] DBLT Caused by: java.net.NoRouteToHostException: No route to host
[2024-08-21T20:54:52.939Z] DBLT at java.base/sun.nio.ch.UnixAsynchronousSocketChannelImpl.checkConnect(Native Method)
[2024-08-21T20:54:52.939Z] DBLT at java.base/sun.nio.ch.UnixAsynchronousSocketChannelImpl.finishConnect(UnixAsynchronousSocketChannelImpl.java:256)
[2024-08-21T20:54:52.939Z] DBLT ... 8 more
[2024-08-21T20:54:52.939Z] DBLT ---
[2024-08-21T20:54:52.939Z] DBLT , Failed Assertion Exceptions:
[2024-08-21T20:54:52.939Z] DBLT net.adoptopenjdk.test.nio2.util.AssertionFailedException: java.net.NoRouteToHostException: No route to host
[2024-08-21T20:54:52.939Z] DBLT at net.adoptopenjdk.test.nio2.asyncio.client.MultipleConnectAsyncTest$1.failed(MultipleConnectAsyncTest.java:124)
[2024-08-21T20:54:52.939Z] DBLT at net.adoptopenjdk.test.nio2.asyncio.client.MultipleConnectAsyncTest$1.failed(MultipleConnectAsyncTest.java:84)
[2024-08-21T20:54:52.939Z] DBLT at java.base/sun.nio.ch.Invoker.invokeUnchecked(Invoker.java:131)
[2024-08-21T20:54:52.939Z] DBLT at java.base/sun.nio.ch.UnixAsynchronousSocketChannelImpl.finishConnect(UnixAsynchronousSocketChannelImpl.java:287)
[2024-08-21T20:54:52.939Z] DBLT at java.base/sun.nio.ch.UnixAsynchronousSocketChannelImpl.finish(UnixAsynchronousSocketChannelImpl.java:202)
[2024-08-21T20:54:52.939Z] DBLT at java.base/sun.nio.ch.UnixAsynchronousSocketChannelImpl.onEvent(UnixAsynchronousSocketChannelImpl.java:217)
[2024-08-21T20:54:52.939Z] DBLT at java.base/sun.nio.ch.EPollPort$EventHandlerTask.run(EPollPort.java:305)
[2024-08-21T20:54:52.939Z] DBLT at java.base/sun.nio.ch.AsynchronousChannelGroupImpl$1.run(AsynchronousChannelGroupImpl.java:113)
[2024-08-21T20:54:52.939Z] DBLT at java.base/java.util.concurrent.ThreadPoolExecutor.runWorker(ThreadPoolExecutor.java:1144)
[2024-08-21T20:54:52.940Z] DBLT at java.base/java.util.concurrent.ThreadPoolExecutor$Worker.run(ThreadPoolExecutor.java:642)
[2024-08-21T20:54:52.940Z] DBLT at java.base/java.lang.Thread.run(Thread.java:1583)
[2024-08-21T20:54:52.940Z] DBLT at java.base/jdk.internal.misc.InnocuousThread.run(InnocuousThread.java:186)
[2024-08-21T20:54:52.940Z] DBLT Caused by: java.net.NoRouteToHostException: No route to host
[2024-08-21T20:54:52.940Z] DBLT at java.base/sun.nio.ch.UnixAsynchronousSocketChannelImpl.checkConnect(Native Method)
[2024-08-21T20:54:52.940Z] DBLT at java.base/sun.nio.ch.UnixAsynchronousSocketChannelImpl.finishConnect(UnixAsynchronousSocketChannelImpl.java:256)
[2024-08-21T20:54:52.940Z] DBLT ... 8 more
[2024-08-21T20:54:52.940Z] DBLT ---
[2024-08-21T20:54:52.940Z] DBLT , Failed Assertion Exceptions:
[2024-08-21T20:54:52.940Z] DBLT net.adoptopenjdk.test.nio2.util.AssertionFailedException: java.net.NoRouteToHostException: No route to host
[2024-08-21T20:54:52.940Z] DBLT at net.adoptopenjdk.test.nio2.asyncio.client.MultipleConnectAsyncTest$1.failed(MultipleConnectAsyncTest.java:124)
[2024-08-21T20:54:52.940Z] DBLT at net.adoptopenjdk.test.nio2.asyncio.client.MultipleConnectAsyncTest$1.failed(MultipleConnectAsyncTest.java:84)
[2024-08-21T20:54:52.940Z] DBLT at java.base/sun.nio.ch.Invoker.invokeUnchecked(Invoker.java:131)
[2024-08-21T20:54:52.940Z] DBLT at java.base/sun.nio.ch.UnixAsynchronousSocketChannelImpl.finishConnect(UnixAsynchronousSocketChannelImpl.java:287)
[2024-08-21T20:54:52.940Z] DBLT at java.base/sun.nio.ch.UnixAsynchronousSocketChannelImpl.finish(UnixAsynchronousSocketChannelImpl.java:202)
[2024-08-21T20:54:52.940Z] DBLT at java.base/sun.nio.ch.UnixAsynchronousSocketChannelImpl.onEvent(UnixAsynchronousSocketChannelImpl.java:217)
[2024-08-21T20:54:52.940Z] DBLT at java.base/sun.nio.ch.EPollPort$EventHandlerTask.run(EPollPort.java:305)
[2024-08-21T20:54:52.940Z] DBLT at java.base/sun.nio.ch.AsynchronousChannelGroupImpl$1.run(AsynchronousChannelGroupImpl.java:113)
[2024-08-21T20:54:52.940Z] DBLT at java.base/java.util.concurrent.ThreadPoolExecutor.runWorker(ThreadPoolExecutor.java:1144)
[2024-08-21T20:54:52.940Z] DBLT at java.base/java.util.concurrent.ThreadPoolExecutor$Worker.run(ThreadPoolExecutor.java:642)
[2024-08-21T20:54:52.940Z] DBLT at java.base/java.lang.Thread.run(Thread.java:1583)
[2024-08-21T20:54:52.940Z] DBLT at java.base/jdk.internal.misc.InnocuousThread.run(InnocuousThread.java:186)
[2024-08-21T20:54:52.940Z] DBLT Caused by: java.net.NoRouteToHostException: No route to host
[2024-08-21T20:54:52.940Z] DBLT at java.base/sun.nio.ch.UnixAsynchronousSocketChannelImpl.checkConnect(Native Method)
[2024-08-21T20:54:52.940Z] DBLT at java.base/sun.nio.ch.UnixAsynchronousSocketChannelImpl.finishConnect(UnixAsynchronousSocketChannelImpl.java:256)
[2024-08-21T20:54:52.940Z] DBLT ... 8 more
[2024-08-21T20:54:52.940Z] DBLT ---
[2024-08-21T20:54:52.940Z] DBLT ]
[2024-08-21T20:54:52.940Z] DBLT junit.framework.AssertionFailedError: [Failed Assertion Exceptions:
[2024-08-21T20:54:52.940Z] DBLT net.adoptopenjdk.test.nio2.util.AssertionFailedException: java.net.NoRouteToHostException: No route to host
[2024-08-21T20:54:52.940Z] DBLT at net.adoptopenjdk.test.nio2.asyncio.client.MultipleConnectAsyncTest$1.failed(MultipleConnectAsyncTest.java:124)
[2024-08-21T20:54:52.940Z] DBLT at net.adoptopenjdk.test.nio2.asyncio.client.MultipleConnectAsyncTest$1.failed(MultipleConnectAsyncTest.java:84)
[2024-08-21T20:54:52.940Z] DBLT at java.base/sun.nio.ch.Invoker.invokeUnchecked(Invoker.java:131)
[2024-08-21T20:54:52.940Z] DBLT at java.base/sun.nio.ch.Invoker$2.run(Invoker.java:221)
[2024-08-21T20:54:52.940Z] DBLT at java.base/sun.nio.ch.AsynchronousChannelGroupImpl$1.run(AsynchronousChannelGroupImpl.java:113)
[2024-08-21T20:54:52.940Z] DBLT at java.base/java.util.concurrent.ThreadPoolExecutor.runWorker(ThreadPoolExecutor.java:1144)
[2024-08-21T20:54:52.940Z] DBLT at java.base/java.util.concurrent.ThreadPoolExecutor$Worker.run(ThreadPoolExecutor.java:642)
[2024-08-21T20:54:52.940Z] DBLT at java.base/java.lang.Thread.run(Thread.java:1583)
[2024-08-21T20:54:52.940Z] DBLT at java.base/jdk.internal.misc.InnocuousThread.run(InnocuousThread.java:186)
[2024-08-21T20:54:52.940Z] DBLT Caused by: java.net.NoRouteToHostException: No route to host
[2024-08-21T20:54:52.940Z] DBLT at java.base/sun.nio.ch.UnixAsynchronousSocketChannelImpl.checkConnect(Native Method)
[2024-08-21T20:54:52.940Z] DBLT at java.base/sun.nio.ch.UnixAsynchronousSocketChannelImpl.finishConnect(UnixAsynchronousSocketChannelImpl.java:256)
[2024-08-21T20:54:52.940Z] DBLT at java.base/sun.nio.ch.UnixAsynchronousSocketChannelImpl.finish(UnixAsynchronousSocketChannelImpl.java:202)
[2024-08-21T20:54:52.940Z] DBLT at java.base/sun.nio.ch.UnixAsynchronousSocketChannelImpl.onEvent(UnixAsynchronousSocketChannelImpl.java:217)
[2024-08-21T20:54:52.940Z] DBLT at java.base/sun.nio.ch.EPollPort$EventHandlerTask.run(EPollPort.java:305)
[2024-08-21T20:54:52.940Z] DBLT ... 2 more
[2024-08-21T20:54:52.940Z] DBLT ---
[2024-08-21T20:54:52.940Z] DBLT , Failed Assertion Exceptions:
[2024-08-21T20:54:52.940Z] DBLT net.adoptopenjdk.test.nio2.util.AssertionFailedException: java.net.NoRouteToHostException: No route to host
[2024-08-21T20:54:52.940Z] DBLT at net.adoptopenjdk.test.nio2.asyncio.client.MultipleConnectAsyncTest$1.failed(MultipleConnectAsyncTest.java:124)
[2024-08-21T20:54:52.940Z] DBLT at net.adoptopenjdk.test.nio2.asyncio.client.MultipleConnectAsyncTest$1.failed(MultipleConnectAsyncTest.java:84)
[2024-08-21T20:54:52.940Z] DBLT at java.base/sun.nio.ch.Invoker.invokeUnchecked(Invoker.java:131)
[2024-08-21T20:54:52.940Z] DBLT at java.base/sun.nio.ch.UnixAsynchronousSocketChannelImpl.finishConnect(UnixAsynchronousSocketChannelImpl.java:287)
[2024-08-21T20:54:52.940Z] DBLT at java.base/sun.nio.ch.UnixAsynchronousSocketChannelImpl.finish(UnixAsynchronousSocketChannelImpl.java:202)
[2024-08-21T20:54:52.940Z] DBLT at java.base/sun.nio.ch.UnixAsynchronousSocketChannelImpl.onEvent(UnixAsynchronousSocketChannelImpl.java:217)
[2024-08-21T20:54:52.940Z] DBLT at java.base/sun.nio.ch.EPollPort$EventHandlerTask.run(EPollPort.java:305)
[2024-08-21T20:54:52.940Z] DBLT at java.base/sun.nio.ch.AsynchronousChannelGroupImpl$1.run(AsynchronousChannelGroupImpl.java:113)
[2024-08-21T20:54:52.940Z] DBLT at java.base/java.util.concurrent.ThreadPoolExecutor.runWorker(ThreadPoolExecutor.java:1144)
[2024-08-21T20:54:52.940Z] DBLT at java.base/java.util.concurrent.ThreadPoolExecutor$Worker.run(ThreadPoolExecutor.java:642)
[2024-08-21T20:54:52.940Z] DBLT at java.base/java.lang.Thread.run(Thread.java:1583)
[2024-08-21T20:54:52.940Z] DBLT at java.base/jdk.internal.misc.InnocuousThread.run(InnocuousThread.java:186)
[2024-08-21T20:54:52.940Z] DBLT Caused by: java.net.NoRouteToHostException: No route to host
[2024-08-21T20:54:52.940Z] DBLT at java.base/sun.nio.ch.UnixAsynchronousSocketChannelImpl.checkConnect(Native Method)
[2024-08-21T20:54:52.940Z] DBLT at java.base/sun.nio.ch.UnixAsynchronousSocketChannelImpl.finishConnect(UnixAsynchronousSocketChannelImpl.java:256)
[2024-08-21T20:54:52.940Z] DBLT ... 8 more
[2024-08-21T20:54:52.940Z] DBLT ---
[2024-08-21T20:54:52.940Z] DBLT , Failed Assertion Exceptions:
[2024-08-21T20:54:52.940Z] DBLT net.adoptopenjdk.test.nio2.util.AssertionFailedException: java.net.NoRouteToHostException: No route to host
[2024-08-21T20:54:52.940Z] DBLT at net.adoptopenjdk.test.nio2.asyncio.client.MultipleConnectAsyncTest$1.failed(MultipleConnectAsyncTest.java:124)
[2024-08-21T20:54:52.941Z] DBLT at net.adoptopenjdk.test.nio2.asyncio.client.MultipleConnectAsyncTest$1.failed(MultipleConnectAsyncTest.java:84)
[2024-08-21T20:54:52.941Z] DBLT at java.base/sun.nio.ch.Invoker.invokeUnchecked(Invoker.java:131)
[2024-08-21T20:54:52.941Z] DBLT at java.base/sun.nio.ch.UnixAsynchronousSocketChannelImpl.finishConnect(UnixAsynchronousSocketChannelImpl.java:287)
[2024-08-21T20:54:52.941Z] DBLT at java.base/sun.nio.ch.UnixAsynchronousSocketChannelImpl.finish(UnixAsynchronousSocketChannelImpl.java:202)
[2024-08-21T20:54:52.941Z] DBLT at java.base/sun.nio.ch.UnixAsynchronousSocketChannelImpl.onEvent(UnixAsynchronousSocketChannelImpl.java:217)
[2024-08-21T20:54:52.941Z] DBLT at java.base/sun.nio.ch.EPollPort$EventHandlerTask.run(EPollPort.java:305)
[2024-08-21T20:54:52.941Z] DBLT at java.base/sun.nio.ch.AsynchronousChannelGroupImpl$1.run(AsynchronousChannelGroupImpl.java:113)
[2024-08-21T20:54:52.941Z] DBLT at java.base/java.util.concurrent.ThreadPoolExecutor.runWorker(ThreadPoolExecutor.java:1144)
[2024-08-21T20:54:52.941Z] DBLT at java.base/java.util.concurrent.ThreadPoolExecutor$Worker.run(ThreadPoolExecutor.java:642)
[2024-08-21T20:54:52.941Z] DBLT at java.base/java.lang.Thread.run(Thread.java:1583)
[2024-08-21T20:54:52.941Z] DBLT at java.base/jdk.internal.misc.InnocuousThread.run(InnocuousThread.java:186)
[2024-08-21T20:54:52.941Z] DBLT Caused by: java.net.NoRouteToHostException: No route to host
[2024-08-21T20:54:52.941Z] DBLT at java.base/sun.nio.ch.UnixAsynchronousSocketChannelImpl.checkConnect(Native Method)
[2024-08-21T20:54:52.941Z] DBLT at java.base/sun.nio.ch.UnixAsynchronousSocketChannelImpl.finishConnect(UnixAsynchronousSocketChannelImpl.java:256)
[2024-08-21T20:54:52.941Z] DBLT ... 8 more
[2024-08-21T20:54:52.941Z] DBLT ---
[2024-08-21T20:54:52.941Z] DBLT , Failed Assertion Exceptions:
[2024-08-21T20:54:52.941Z] DBLT net.adoptopenjdk.test.nio2.util.AssertionFailedException: java.net.NoRouteToHostException: No route to host
[2024-08-21T20:54:52.941Z] DBLT at net.adoptopenjdk.test.nio2.asyncio.client.MultipleConnectAsyncTest$1.failed(MultipleConnectAsyncTest.java:124)
[2024-08-21T20:54:52.941Z] DBLT at net.adoptopenjdk.test.nio2.asyncio.client.MultipleConnectAsyncTest$1.failed(MultipleConnectAsyncTest.java:84)
[2024-08-21T20:54:52.941Z] DBLT at java.base/sun.nio.ch.Invoker.invokeUnchecked(Invoker.java:131)
[2024-08-21T20:54:52.941Z] DBLT at java.base/sun.nio.ch.UnixAsynchronousSocketChannelImpl.finishConnect(UnixAsynchronousSocketChannelImpl.java:287)
[2024-08-21T20:54:52.941Z] DBLT at java.base/sun.nio.ch.UnixAsynchronousSocketChannelImpl.finish(UnixAsynchronousSocketChannelImpl.java:202)
[2024-08-21T20:54:52.941Z] DBLT at java.base/sun.nio.ch.UnixAsynchronousSocketChannelImpl.onEvent(UnixAsynchronousSocketChannelImpl.java:217)
[2024-08-21T20:54:52.941Z] DBLT at java.base/sun.nio.ch.EPollPort$EventHandlerTask.run(EPollPort.java:305)
[2024-08-21T20:54:52.941Z] DBLT at java.base/sun.nio.ch.AsynchronousChannelGroupImpl$1.run(AsynchronousChannelGroupImpl.java:113)
[2024-08-21T20:54:52.941Z] DBLT at java.base/java.util.concurrent.ThreadPoolExecutor.runWorker(ThreadPoolExecutor.java:1144)
[2024-08-21T20:54:52.941Z] DBLT at java.base/java.util.concurrent.ThreadPoolExecutor$Worker.run(ThreadPoolExecutor.java:642)
[2024-08-21T20:54:52.941Z] DBLT at java.base/java.lang.Thread.run(Thread.java:1583)
[2024-08-21T20:54:52.941Z] DBLT at java.base/jdk.internal.misc.InnocuousThread.run(InnocuousThread.java:186)
[2024-08-21T20:54:52.941Z] DBLT Caused by: java.net.NoRouteToHostException: No route to host
[2024-08-21T20:54:52.941Z] DBLT at java.base/sun.nio.ch.UnixAsynchronousSocketChannelImpl.checkConnect(Native Method)
[2024-08-21T20:54:52.941Z] DBLT at java.base/sun.nio.ch.UnixAsynchronousSocketChannelImpl.finishConnect(UnixAsynchronousSocketChannelImpl.java:256)
[2024-08-21T20:54:52.941Z] DBLT ... 8 more
[2024-08-21T20:54:52.941Z] DBLT ---
[2024-08-21T20:54:52.941Z] DBLT , Failed Assertion Exceptions:
[2024-08-21T20:54:52.941Z] DBLT net.adoptopenjdk.test.nio2.util.AssertionFailedException: java.net.NoRouteToHostException: No route to host
[2024-08-21T20:54:52.941Z] DBLT at net.adoptopenjdk.test.nio2.asyncio.client.MultipleConnectAsyncTest$1.failed(MultipleConnectAsyncTest.java:124)
[2024-08-21T20:54:52.941Z] DBLT at net.adoptopenjdk.test.nio2.asyncio.client.MultipleConnectAsyncTest$1.failed(MultipleConnectAsyncTest.java:84)
[2024-08-21T20:54:52.941Z] DBLT at java.base/sun.nio.ch.Invoker.invokeUnchecked(Invoker.java:131)
[2024-08-21T20:54:52.941Z] DBLT at java.base/sun.nio.ch.UnixAsynchronousSocketChannelImpl.finishConnect(UnixAsynchronousSocketChannelImpl.java:287)
[2024-08-21T20:54:52.941Z] DBLT at java.base/sun.nio.ch.UnixAsynchronousSocketChannelImpl.finish(UnixAsynchronousSocketChannelImpl.java:202)
[2024-08-21T20:54:52.941Z] DBLT at java.base/sun.nio.ch.UnixAsynchronousSocketChannelImpl.onEvent(UnixAsynchronousSocketChannelImpl.java:217)
[2024-08-21T20:54:52.941Z] DBLT at java.base/sun.nio.ch.EPollPort$EventHandlerTask.run(EPollPort.java:305)
[2024-08-21T20:54:52.941Z] DBLT at java.base/sun.nio.ch.AsynchronousChannelGroupImpl$1.run(AsynchronousChannelGroupImpl.java:113)
[2024-08-21T20:54:52.941Z] DBLT at java.base/java.util.concurrent.ThreadPoolExecutor.runWorker(ThreadPoolExecutor.java:1144)
[2024-08-21T20:54:52.941Z] DBLT at java.base/java.util.concurrent.ThreadPoolExecutor$Worker.run(ThreadPoolExecutor.java:642)
[2024-08-21T20:54:52.941Z] DBLT at java.base/java.lang.Thread.run(Thread.java:1583)
[2024-08-21T20:54:52.941Z] DBLT at java.base/jdk.internal.misc.InnocuousThread.run(InnocuousThread.java:186)
[2024-08-21T20:54:52.941Z] DBLT Caused by: java.net.NoRouteToHostException: No route to host
[2024-08-21T20:54:52.941Z] DBLT at java.base/sun.nio.ch.UnixAsynchronousSocketChannelImpl.checkConnect(Native Method)
[2024-08-21T20:54:52.941Z] DBLT at java.base/sun.nio.ch.UnixAsynchronousSocketChannelImpl.finishConnect(UnixAsynchronousSocketChannelImpl.java:256)
[2024-08-21T20:54:52.941Z] DBLT ... 8 more
[2024-08-21T20:54:52.941Z] DBLT ---
[2024-08-21T20:54:52.941Z] DBLT ]
[2024-08-21T20:54:52.941Z] DBLT at junit.framework.Assert.fail(Assert.java:57)
[2024-08-21T20:54:52.941Z] DBLT at junit.framework.TestCase.fail(TestCase.java:227)
[2024-08-21T20:54:52.941Z] DBLT at net.adoptopenjdk.test.nio2.asyncio.client.MultipleConnectAsyncTest.testMultipleSequentialConnect(MultipleConnectAsyncTest.java:191)
[2024-08-21T20:54:52.941Z] DBLT at java.base/jdk.internal.reflect.DirectMethodHandleAccessor.invoke(DirectMethodHandleAccessor.java:103)
[2024-08-21T20:54:52.941Z] DBLT at java.base/java.lang.reflect.Method.invoke(Method.java:580)
[2024-08-21T20:54:52.941Z] DBLT at junit.framework.TestCase.runTest(TestCase.java:176)
[2024-08-21T20:54:52.941Z] DBLT at junit.framework.TestCase.runBare(TestCase.java:141)
[2024-08-21T20:54:52.941Z] DBLT at junit.framework.TestResult$1.protect(TestResult.java:122)
[2024-08-21T20:54:52.941Z] DBLT at junit.framework.TestResult.runProtected(TestResult.java:142)
[2024-08-21T20:54:52.941Z] DBLT at junit.framework.TestResult.run(TestResult.java:125)
[2024-08-21T20:54:52.941Z] DBLT at junit.framework.TestCase.run(TestCase.java:129)
[2024-08-21T20:54:52.941Z] DBLT at junit.framework.TestSuite.runTest(TestSuite.java:252)
[2024-08-21T20:54:52.941Z] DBLT at junit.framework.TestSuite.run(TestSuite.java:247)
[2024-08-21T20:54:52.941Z] DBLT at org.junit.internal.runners.JUnit38ClassRunner.run(JUnit38ClassRunner.java:86)
[2024-08-21T20:54:52.941Z] DBLT at org.junit.runners.Suite.runChild(Suite.java:128)
[2024-08-21T20:54:52.941Z] DBLT at org.junit.runners.Suite.runChild(Suite.java:27)
[2024-08-21T20:54:52.941Z] DBLT at org.junit.runners.ParentRunner$3.run(ParentRunner.java:290)
[2024-08-21T20:54:52.941Z] DBLT at org.junit.runners.ParentRunner$1.schedule(ParentRunner.java:71)
[2024-08-21T20:54:52.941Z] DBLT at org.junit.runners.ParentRunner.runChildren(ParentRunner.java:288)
[2024-08-21T20:54:52.941Z] DBLT at org.junit.runners.ParentRunner.access$000(ParentRunner.java:58)
[2024-08-21T20:54:52.941Z] DBLT at org.junit.runners.ParentRunner$2.evaluate(ParentRunner.java:268)
[2024-08-21T20:54:52.941Z] DBLT at org.junit.runners.ParentRunner.run(ParentRunner.java:363)
[2024-08-21T20:54:52.941Z] DBLT at org.junit.runner.JUnitCore.run(JUnitCore.java:137)
[2024-08-21T20:54:52.941Z] DBLT at org.junit.runner.JUnitCore.run(JUnitCore.java:115)
[2024-08-21T20:54:52.941Z] DBLT at net.adoptopenjdk.loadTest.adaptors.JUnitAdaptor.executeTest(JUnitAdaptor.java:130)
[2024-08-21T20:54:52.941Z] DBLT at net.adoptopenjdk.loadTest.LoadTestRunner$2.run(LoadTestRunner.java:182)
[2024-08-21T20:54:52.941Z] DBLT at java.base/java.util.concurrent.ThreadPoolExecutor.runWorker(ThreadPoolExecutor.java:1144)
[2024-08-21T20:54:52.941Z] DBLT at java.base/java.util.concurrent.ThreadPoolExecutor$Worker.run(ThreadPoolExecutor.java:642)
[2024-08-21T20:54:52.941Z] DBLT at java.base/java.lang.Thread.run(Thread.java:1583)
[2024-08-21T20:54:52.941Z] DBLT testFinished: testMultipleSequentialConnect(net.adoptopenjdk.test.nio2.asyncio.client.MultipleConnectAsyncTest)
[2024-08-21T20:54:52.941Z] DBLT testStarted : testSingleConnect(net.adoptopenjdk.test.nio2.asyncio.client.MultipleConnectAsyncTest)
[2024-08-21T20:54:52.941Z] DBLT testFailure: testSingleConnect(net.adoptopenjdk.test.nio2.asyncio.client.MultipleConnectAsyncTest): Failed Assertion Exceptions:
[2024-08-21T20:54:52.941Z] DBLT net.adoptopenjdk.test.nio2.util.AssertionFailedException: java.net.NoRouteToHostException: No route to host
[2024-08-21T20:54:52.941Z] DBLT at net.adoptopenjdk.test.nio2.asyncio.client.MultipleConnectAsyncTest$2.failed(MultipleConnectAsyncTest.java:248)
[2024-08-21T20:54:52.941Z] DBLT at net.adoptopenjdk.test.nio2.asyncio.client.MultipleConnectAsyncTest$2.failed(MultipleConnectAsyncTest.java:206)
[2024-08-21T20:54:52.941Z] DBLT at java.base/sun.nio.ch.Invoker.invokeUnchecked(Invoker.java:131)
[2024-08-21T20:54:52.941Z] DBLT at java.base/sun.nio.ch.UnixAsynchronousSocketChannelImpl.finishConnect(UnixAsynchronousSocketChannelImpl.java:287)
[2024-08-21T20:54:52.941Z] DBLT at java.base/sun.nio.ch.UnixAsynchronousSocketChannelImpl.finish(UnixAsynchronousSocketChannelImpl.java:202)
[2024-08-21T20:54:52.941Z] DBLT at java.base/sun.nio.ch.UnixAsynchronousSocketChannelImpl.onEvent(UnixAsynchronousSocketChannelImpl.java:217)
[2024-08-21T20:54:52.941Z] DBLT at java.base/sun.nio.ch.EPollPort$EventHandlerTask.run(EPollPort.java:305)
[2024-08-21T20:54:52.941Z] DBLT at java.base/sun.nio.ch.AsynchronousChannelGroupImpl$1.run(AsynchronousChannelGroupImpl.java:113)
[2024-08-21T20:54:52.941Z] DBLT at java.base/java.util.concurrent.ThreadPoolExecutor.runWorker(ThreadPoolExecutor.java:1144)
[2024-08-21T20:54:52.942Z] DBLT at java.base/java.util.concurrent.ThreadPoolExecutor$Worker.run(ThreadPoolExecutor.java:642)
[2024-08-21T20:54:52.942Z] DBLT at java.base/java.lang.Thread.run(Thread.java:1583)
[2024-08-21T20:54:52.942Z] DBLT at java.base/jdk.internal.misc.InnocuousThread.run(InnocuousThread.java:186)
[2024-08-21T20:54:52.942Z] DBLT Caused by: java.net.NoRouteToHostException: No route to host
[2024-08-21T20:54:52.942Z] DBLT at java.base/sun.nio.ch.UnixAsynchronousSocketChannelImpl.checkConnect(Native Method)
[2024-08-21T20:54:52.942Z] DBLT at java.base/sun.nio.ch.UnixAsynchronousSocketChannelImpl.finishConnect(UnixAsynchronousSocketChannelImpl.java:256)
[2024-08-21T20:54:52.942Z] DBLT ... 8 more
[2024-08-21T20:54:52.942Z] DBLT ---
[2024-08-21T20:54:52.942Z] DBLT
[2024-08-21T20:54:52.942Z] DBLT junit.framework.AssertionFailedError: Failed Assertion Exceptions:
[2024-08-21T20:54:52.942Z] DBLT net.adoptopenjdk.test.nio2.util.AssertionFailedException: java.net.NoRouteToHostException: No route to host
[2024-08-21T20:54:52.942Z] DBLT at net.adoptopenjdk.test.nio2.asyncio.client.MultipleConnectAsyncTest$2.failed(MultipleConnectAsyncTest.java:248)
[2024-08-21T20:54:52.942Z] DBLT at net.adoptopenjdk.test.nio2.asyncio.client.MultipleConnectAsyncTest$2.failed(MultipleConnectAsyncTest.java:206)
[2024-08-21T20:54:52.942Z] DBLT at java.base/sun.nio.ch.Invoker.invokeUnchecked(Invoker.java:131)
[2024-08-21T20:54:52.942Z] DBLT at java.base/sun.nio.ch.UnixAsynchronousSocketChannelImpl.finishConnect(UnixAsynchronousSocketChannelImpl.java:287)
[2024-08-21T20:54:52.942Z] DBLT at java.base/sun.nio.ch.UnixAsynchronousSocketChannelImpl.finish(UnixAsynchronousSocketChannelImpl.java:202)
[2024-08-21T20:54:52.942Z] DBLT at java.base/sun.nio.ch.UnixAsynchronousSocketChannelImpl.onEvent(UnixAsynchronousSocketChannelImpl.java:217)
[2024-08-21T20:54:52.942Z] DBLT at java.base/sun.nio.ch.EPollPort$EventHandlerTask.run(EPollPort.java:305)
[2024-08-21T20:54:52.942Z] DBLT at java.base/sun.nio.ch.AsynchronousChannelGroupImpl$1.run(AsynchronousChannelGroupImpl.java:113)
[2024-08-21T20:54:52.942Z] DBLT at java.base/java.util.concurrent.ThreadPoolExecutor.runWorker(ThreadPoolExecutor.java:1144)
[2024-08-21T20:54:52.942Z] DBLT at java.base/java.util.concurrent.ThreadPoolExecutor$Worker.run(ThreadPoolExecutor.java:642)
[2024-08-21T20:54:52.942Z] DBLT at java.base/java.lang.Thread.run(Thread.java:1583)
[2024-08-21T20:54:52.942Z] DBLT at java.base/jdk.internal.misc.InnocuousThread.run(InnocuousThread.java:186)
[2024-08-21T20:54:52.942Z] DBLT Caused by: java.net.NoRouteToHostException: No route to host
[2024-08-21T20:54:52.942Z] DBLT at java.base/sun.nio.ch.UnixAsynchronousSocketChannelImpl.checkConnect(Native Method)
[2024-08-21T20:54:52.942Z] DBLT at java.base/sun.nio.ch.UnixAsynchronousSocketChannelImpl.finishConnect(UnixAsynchronousSocketChannelImpl.java:256)
[2024-08-21T20:54:52.942Z] DBLT ... 8 more
[2024-08-21T20:54:52.942Z] DBLT ---
[2024-08-21T20:54:52.942Z] DBLT
[2024-08-21T20:54:52.942Z] DBLT at junit.framework.Assert.fail(Assert.java:57)
[2024-08-21T20:54:52.942Z] DBLT at junit.framework.TestCase.fail(TestCase.java:227)
[2024-08-21T20:54:52.942Z] DBLT at net.adoptopenjdk.test.nio2.asyncio.client.MultipleConnectAsyncTest.testSingleConnect(MultipleConnectAsyncTest.java:281)
[2024-08-21T20:54:52.942Z] DBLT at java.base/jdk.internal.reflect.DirectMethodHandleAccessor.invoke(DirectMethodHandleAccessor.java:103)
[2024-08-21T20:54:52.942Z] DBLT at java.base/java.lang.reflect.Method.invoke(Method.java:580)
[2024-08-21T20:54:52.942Z] DBLT at junit.framework.TestCase.runTest(TestCase.java:176)
[2024-08-21T20:54:52.942Z] DBLT at junit.framework.TestCase.runBare(TestCase.java:141)
[2024-08-21T20:54:52.942Z] DBLT at junit.framework.TestResult$1.protect(TestResult.java:122)
[2024-08-21T20:54:52.942Z] DBLT at junit.framework.TestResult.runProtected(TestResult.java:142)
[2024-08-21T20:54:52.942Z] DBLT at junit.framework.TestResult.run(TestResult.java:125)
[2024-08-21T20:54:52.942Z] DBLT at junit.framework.TestCase.run(TestCase.java:129)
[2024-08-21T20:54:52.942Z] DBLT at junit.framework.TestSuite.runTest(TestSuite.java:252)
[2024-08-21T20:54:52.942Z] DBLT at junit.framework.TestSuite.run(TestSuite.java:247)
[2024-08-21T20:54:52.942Z] DBLT at org.junit.internal.runners.JUnit38ClassRunner.run(JUnit38ClassRunner.java:86)
[2024-08-21T20:54:52.942Z] DBLT at org.junit.runners.Suite.runChild(Suite.java:128)
[2024-08-21T20:54:52.942Z] DBLT at org.junit.runners.Suite.runChild(Suite.java:27)
[2024-08-21T20:54:52.942Z] DBLT at org.junit.runners.ParentRunner$3.run(ParentRunner.java:290)
[2024-08-21T20:54:52.942Z] DBLT at org.junit.runners.ParentRunner$1.schedule(ParentRunner.java:71)
[2024-08-21T20:54:52.942Z] DBLT at org.junit.runners.ParentRunner.runChildren(ParentRunner.java:288)
[2024-08-21T20:54:52.942Z] DBLT at org.junit.runners.ParentRunner.access$000(ParentRunner.java:58)
[2024-08-21T20:54:52.942Z] DBLT at org.junit.runners.ParentRunner$2.evaluate(ParentRunner.java:268)
[2024-08-21T20:54:52.942Z] DBLT at org.junit.runners.ParentRunner.run(ParentRunner.java:363)
[2024-08-21T20:54:52.942Z] DBLT at org.junit.runner.JUnitCore.run(JUnitCore.java:137)
[2024-08-21T20:54:52.942Z] DBLT at org.junit.runner.JUnitCore.run(JUnitCore.java:115)
[2024-08-21T20:54:52.942Z] DBLT at net.adoptopenjdk.loadTest.adaptors.JUnitAdaptor.executeTest(JUnitAdaptor.java:130)
[2024-08-21T20:54:52.942Z] DBLT at net.adoptopenjdk.loadTest.LoadTestRunner$2.run(LoadTestRunner.java:182)
[2024-08-21T20:54:52.942Z] DBLT at java.base/java.util.concurrent.ThreadPoolExecutor.runWorker(ThreadPoolExecutor.java:1144)
[2024-08-21T20:54:52.942Z] DBLT at java.base/java.util.concurrent.ThreadPoolExecutor$Worker.run(ThreadPoolExecutor.java:642)
[2024-08-21T20:54:52.942Z] DBLT at java.base/java.lang.Thread.run(Thread.java:1583)
[2024-08-21T20:54:52.942Z] DBLT testFinished: testSingleConnect(net.adoptopenjdk.test.nio2.asyncio.client.MultipleConnectAsyncTest)
[2024-08-21T20:54:52.942Z] DBLT
[2024-08-21T20:54:52.942Z] DBLT JUnit Test Results for: net.adoptopenjdk.test.nio2.asyncio.client.MultipleConnectAsyncTest
[2024-08-21T20:54:52.942Z] DBLT Ran : 2
[2024-08-21T20:54:52.942Z] DBLT Passed : 0
[2024-08-21T20:54:52.942Z] DBLT Failed : 2
[2024-08-21T20:54:52.942Z] DBLT Ignored: 0
[2024-08-21T20:54:52.942Z] DBLT Result : FAILED
[2024-08-21T20:54:52.942Z] DBLT <<<
[2024-08-21T20:54:52.942Z] DBLT
[2024-08-21T20:54:54.928Z] DBLT 20:54:54.649 - suite.getInventory().getInventoryFileRef(): openjdk.test.load/config/inventories/gc/directByteBuffer.xml
[2024-08-21T20:54:54.928Z] DBLT 20:54:54.649 - suite.isCreateDump() : false
[2024-08-21T20:54:54.928Z] DBLT 20:54:54.650 - Test failed. Details recorded in execution log.
[2024-08-21T20:54:57.913Z] DBLT 20:54:57.488 - suite.getInventory().getInventoryFileRef(): openjdk.test.load/config/inventories/gc/directByteBuffer.xml
[2024-08-21T20:54:57.913Z] DBLT 20:54:57.489 - suite.isCreateDump() : false
[2024-08-21T20:54:57.913Z] DBLT 20:54:57.489 - Test failed. Details recorded in execution log.
[2024-08-21T20:54:59.204Z] DBLT 20:54:58.422 - suite.getInventory().getInventoryFileRef(): openjdk.test.load/config/inventories/gc/directByteBuffer.xml
[2024-08-21T20:54:59.204Z] DBLT 20:54:58.422 - suite.isCreateDump() : false
[2024-08-21T20:54:59.204Z] DBLT 20:54:58.422 - Test failed. Details recorded in execution log.
[2024-08-21T20:55:00.457Z] DBLT 20:54:59.608 - suite.getInventory().getInventoryFileRef(): openjdk.test.load/config/inventories/gc/directByteBuffer.xml
[2024-08-21T20:55:00.457Z] DBLT 20:54:59.608 - suite.isCreateDump() : false
[2024-08-21T20:55:00.457Z] DBLT 20:54:59.608 - Test failed. Details recorded in execution log.
[2024-08-21T20:55:05.072Z] DBLT 20:55:04.539 - suite.getInventory().getInventoryFileRef(): openjdk.test.load/config/inventories/gc/directByteBuffer.xml
[2024-08-21T20:55:05.072Z] DBLT 20:55:04.540 - suite.isCreateDump() : false
[2024-08-21T20:55:05.072Z] DBLT 20:55:04.540 - Test failed. Details recorded in execution log.
[2024-08-21T20:55:07.093Z] DBLT 20:55:06.696 - Completed 6.7%. Number of tests started=34 (with 6 failure(s))
[2024-08-21T20:55:11.736Z] DBLT 20:55:11.056 - suite.getInventory().getInventoryFileRef(): openjdk.test.load/config/inventories/gc/directByteBuffer.xml
[2024-08-21T20:55:11.736Z] DBLT 20:55:11.056 - suite.isCreateDump() : false
[2024-08-21T20:55:11.736Z] DBLT 20:55:11.056 - Test failed. Details recorded in execution log.
[2024-08-21T20:55:15.415Z] DBLT 20:55:14.733 - suite.getInventory().getInventoryFileRef(): openjdk.test.load/config/inventories/gc/directByteBuffer.xml
[2024-08-21T20:55:15.416Z] DBLT 20:55:14.733 - suite.isCreateDump() : false
[2024-08-21T20:55:15.416Z] DBLT 20:55:14.734 - Test failed. Details recorded in execution log.
[2024-08-21T20:55:23.754Z] DBLT 20:55:22.648 - suite.getInventory().getInventoryFileRef(): openjdk.test.load/config/inventories/gc/directByteBuffer.xml
[2024-08-21T20:55:23.754Z] DBLT 20:55:22.648 - suite.isCreateDump() : false
[2024-08-21T20:55:23.754Z] DBLT 20:55:22.648 - Test failed. Details recorded in execution log.
[2024-08-21T20:55:27.315Z] DBLT 20:55:26.700 - Completed 13.3%. Number of tests started=46 (+12) (with 9 failure(s))
[2024-08-21T20:55:50.585Z] DBLT 20:55:46.743 - Completed 20.0%. Number of tests started=55 (+9) (with 9 failure(s))
[2024-08-21T20:55:50.585Z] DBLT 20:55:49.290 - suite.getInventory().getInventoryFileRef(): openjdk.test.load/config/inventories/gc/directByteBuffer.xml
[2024-08-21T20:55:50.585Z] DBLT 20:55:49.290 - suite.isCreateDump() : false
[2024-08-21T20:55:50.585Z] DBLT 20:55:49.290 - Test failed. Details recorded in execution log.
[2024-08-21T20:55:50.585Z] DBLT 20:55:49.290 - Number of test failures has reached 'AbortAtFailureLimit' (10). Terminating load test
[2024-08-21T20:55:50.585Z] DBLT 20:55:49.292 - Thread completed. Suite=0 thread=1
[2024-08-21T20:55:50.585Z] DBLT 20:55:49.329 - Thread completed. Suite=0 thread=0
[2024-08-21T20:55:50.585Z] DBLT 20:55:49.347 - Load test completed
[2024-08-21T20:55:50.585Z] DBLT 20:55:49.347 - Ran : 55
[2024-08-21T20:55:50.585Z] DBLT 20:55:49.347 - Passed : 45
[2024-08-21T20:55:50.585Z] DBLT 20:55:49.347 - Failed : 10
[2024-08-21T20:55:50.585Z] DBLT 20:55:49.347 - Result : FAILED
[2024-08-21T20:55:50.585Z] DBLT 20:55:49.347 - Note that only the first 1 failures have been reported
[2024-08-21T20:55:50.585Z] STF 20:55:49.749 - **FAILED** Process DBLT ended with exit code (1) and not the expected exit code/s (0)
[2024-08-21T20:55:50.585Z] STF 20:55:49.749 - Monitoring Report Summary:
[2024-08-21T20:55:50.585Z] STF 20:55:49.749 - o Process DBLT ended with exit code (1) and not the expected exit code/s (0)
[2024-08-21T20:55:50.585Z] STF 20:55:49.750 - Killing processes: DBLT
[2024-08-21T20:55:50.585Z] STF 20:55:49.750 - o Process DBLT pid 9561 is not running
[2024-08-21T20:55:50.586Z] **FAILED** at step 1 (Run DirectByteBuffer load test). Expected return value=0 Actual=1 at /home/jenkins/workspace/Test_openjdk21_hs_extended.system_s390x_linux/aqa-tests/TKG/../TKG/output_17242728099468/DBBLoadTest_5m_0/20240821-205440-DirectByteBufferLoadTest/execute.pl line 93.
[2024-08-21T20:55:50.586Z] STF 20:55:50.054 - **FAILED** execute script failed. Expected return value=0 Actual=1
[2024-08-21T20:55:50.586Z] STF 20:55:50.054 -
[2024-08-21T20:55:50.586Z] STF 20:55:50.055 - ==================== T E A R D O W N ====================
[2024-08-21T20:55:50.586Z] STF 20:55:50.055 - Running teardown: perl /home/jenkins/workspace/Test_openjdk21_hs_extended.system_s390x_linux/aqa-tests/TKG/../TKG/output_17242728099468/DBBLoadTest_5m_0/20240821-205440-DirectByteBufferLoadTest/tearDown.pl
[2024-08-21T20:55:50.586Z] STF 20:55:50.115 - TEARDOWN stage completed
[2024-08-21T20:55:50.586Z] STF 20:55:50.124 -
[2024-08-21T20:55:50.586Z] STF 20:55:50.124 - ===================== R E S U L T S =====================
[2024-08-21T20:55:50.586Z] STF 20:55:50.124 - Stage results:
[2024-08-21T20:55:50.586Z] STF 20:55:50.124 - setUp: pass
[2024-08-21T20:55:50.586Z] STF 20:55:50.124 - execute: *fail*
[2024-08-21T20:55:50.586Z] STF 20:55:50.124 - teardown: pass
[2024-08-21T20:55:50.586Z] STF 20:55:50.124 -
[2024-08-21T20:55:50.586Z] STF 20:55:50.124 - Overall result: **FAILED**
[2024-08-21T20:55:50.586Z] -----------------------------------
[2024-08-21T20:55:50.586Z] DBBLoadTest_5m_0_FAILED
[2024-08-21T20:55:50.586Z] -----------------------------------
[2024-08-21T20:55:50.586Z]
[2024-08-21T20:55:50.586Z] TEST TEARDOWN:
[2024-08-21T20:55:50.586Z] Nothing to be done for teardown.
[2024-08-21T20:55:50.586Z] DBBLoadTest_5m_0 Finish Time: Wed Aug 21 20:55:50 2024 Epoch Time (ms): 1724273750137