PatModImg_Adv_0
[2024-08-16T16:59:05.571Z] Running test PatModImg_Adv_0 ...
[2024-08-16T16:59:05.571Z] ===============================================
[2024-08-16T16:59:05.571Z] PatModImg_Adv_0 Start Time: Fri Aug 16 16:59:05 2024 Epoch Time (ms): 1723827545228
[2024-08-16T16:59:05.571Z] variation: Mode150
[2024-08-16T16:59:05.571Z] JVM_OPTIONS: -XX:+UseCompressedOops
[2024-08-16T16:59:05.571Z] { \
[2024-08-16T16:59:05.571Z] echo ""; echo "TEST SETUP:"; \
[2024-08-16T16:59:05.571Z] echo "Nothing to be done for setup."; \
[2024-08-16T16:59:05.571Z] mkdir -p "/home/jenkins/workspace/Test_openjdk11_hs_sanity.system_x86-64_linux_testList_2/aqa-tests/TKG/../TKG/output_17238263044651/PatModImg_Adv_0"; \
[2024-08-16T16:59:05.571Z] cd "/home/jenkins/workspace/Test_openjdk11_hs_sanity.system_x86-64_linux_testList_2/aqa-tests/TKG/../TKG/output_17238263044651/PatModImg_Adv_0"; \
[2024-08-16T16:59:05.571Z] echo ""; echo "TESTING:"; \
[2024-08-16T16:59:05.571Z] perl /home/jenkins/workspace/Test_openjdk11_hs_sanity.system_x86-64_linux_testList_2/aqa-tests/TKG/../../jvmtest/system/modularity/..//STF/stf.core/scripts/stf.pl -test-root="/home/jenkins/workspace/Test_openjdk11_hs_sanity.system_x86-64_linux_testList_2/aqa-tests/TKG/../../jvmtest/system/modularity/..//STF;/home/jenkins/workspace/Test_openjdk11_hs_sanity.system_x86-64_linux_testList_2/aqa-tests/TKG/../../jvmtest/system/modularity/..//aqa-systemtest""" -systemtest-prereqs="/home/jenkins/workspace/Test_openjdk11_hs_sanity.system_x86-64_linux_testList_2/../../testDependency/system_lib/" -java-args=' -XX:+UseCompressedOops ' -results-root="/home/jenkins/workspace/Test_openjdk11_hs_sanity.system_x86-64_linux_testList_2/aqa-tests/TKG/../TKG/output_17238263044651/PatModImg_Adv_0" -test=PatModImgTest -test-args="variant=Adv"; \
[2024-08-16T16:59:05.571Z] if [ $? -eq 0 ]; then echo "-----------------------------------"; echo "PatModImg_Adv_0""_PASSED"; echo "-----------------------------------"; cd /home/jenkins/workspace/Test_openjdk11_hs_sanity.system_x86-64_linux_testList_2/aqa-tests/TKG/..; rm -f -r "/home/jenkins/workspace/Test_openjdk11_hs_sanity.system_x86-64_linux_testList_2/aqa-tests/TKG/../TKG/output_17238263044651/PatModImg_Adv_0"; else echo "-----------------------------------"; echo "PatModImg_Adv_0""_FAILED"; echo "-----------------------------------"; fi; \
[2024-08-16T16:59:05.571Z] echo ""; echo "TEST TEARDOWN:"; \
[2024-08-16T16:59:05.571Z] echo "Nothing to be done for teardown."; \
[2024-08-16T16:59:05.571Z] } 2>&1 | tee -a "/home/jenkins/workspace/Test_openjdk11_hs_sanity.system_x86-64_linux_testList_2/aqa-tests/TKG/../TKG/output_17238263044651/TestTargetResult";
[2024-08-16T16:59:05.571Z]
[2024-08-16T16:59:05.571Z] TEST SETUP:
[2024-08-16T16:59:05.571Z] Nothing to be done for setup.
[2024-08-16T16:59:05.571Z]
[2024-08-16T16:59:05.571Z] TESTING:
[2024-08-16T16:59:06.351Z] STF 16:59:05.794 - ========================= S T F =========================
[2024-08-16T16:59:06.351Z] systemtest-prereqs has been processed, and set to: /home/jenkins/testDependency/system_libRetrieving amount of free space on drive containing /home/jenkins/workspace/Test_openjdk11_hs_sanity.system_x86-64_linux_testList_2/aqa-tests/TKG/../TKG/output_17238263044651/PatModImg_Adv_0
[2024-08-16T16:59:06.351Z] There is 167507 Mb free
[2024-08-16T16:59:06.351Z] STF 16:59:05.839 - ================== G E N E R A T I O N ==================
[2024-08-16T16:59:06.351Z] STF 16:59:05.841 - Checking JVM: /home/jenkins/workspace/Test_openjdk11_hs_sanity.system_x86-64_linux_testList_2/jdkbinary/j2sdk-image/jdk-11.0.25+3/bin/../
[2024-08-16T16:59:06.351Z] STF 16:59:05.841 - Starting process to generate scripts: /home/jenkins/workspace/Test_openjdk11_hs_sanity.system_x86-64_linux_testList_2/jdkbinary/j2sdk-image/jdk-11.0.25+3/bin/..//bin/java -Dlog4j.skipJansi=true -Djava.system.class.loader=net.adoptopenjdk.stf.runner.StfClassLoader -classpath /home/jenkins/workspace/Test_openjdk11_hs_sanity.system_x86-64_linux_testList_2/../../testDependency/system_lib//log4j/log4j-api.jar:/home/jenkins/workspace/Test_openjdk11_hs_sanity.system_x86-64_linux_testList_2/../../testDependency/system_lib//log4j/log4j-core.jar:/home/jenkins/workspace/Test_openjdk11_hs_sanity.system_x86-64_linux_testList_2/jvmtest/system/STF/stf.core/scripts/../bin net.adoptopenjdk.stf.runner.StfRunner -properties "/home/jenkins/workspace/Test_openjdk11_hs_sanity.system_x86-64_linux_testList_2/aqa-tests/TKG/../TKG/output_17238263044651/PatModImg_Adv_0/20240816-165905-PatModImgTest/stf_parameters.properties, , /home/jenkins/workspace/Test_openjdk11_hs_sanity.system_x86-64_linux_testList_2/jvmtest/system/STF/stf.core/config/stf.properties" -testDir "/home/jenkins/workspace/Test_openjdk11_hs_sanity.system_x86-64_linux_testList_2/aqa-tests/TKG/../TKG/output_17238263044651/PatModImg_Adv_0/20240816-165905-PatModImgTest"
[2024-08-16T16:59:18.041Z] GEN 16:59:16.527 - Found test. Project: 'openjdk.test.modularity' class: 'PatModImgTest.class' Dir: '/home/jenkins/workspace/Test_openjdk11_hs_sanity.system_x86-64_linux_testList_2/jvmtest/system/aqa-systemtest/openjdk.test.modularity/bin'
[2024-08-16T16:59:18.041Z] GEN 16:59:16.701 - Found test. Project: 'openjdk.test.modularity' class: 'net.adoptopenjdk.test.modularity.PatModImgTest'
[2024-08-16T16:59:18.827Z] GEN Classpath directories used by project 'openjdk.test.modularity':
[2024-08-16T16:59:18.827Z] GEN /home/jenkins/workspace/Test_openjdk11_hs_sanity.system_x86-64_linux_testList_2/jvmtest/system/aqa-systemtest/openjdk.test.modularity/bin/common-mods/displayService
[2024-08-16T16:59:18.827Z] GEN /home/jenkins/workspace/Test_openjdk11_hs_sanity.system_x86-64_linux_testList_2/jvmtest/system/aqa-systemtest/openjdk.test.modularity/bin/common-mods/com.helper
[2024-08-16T16:59:18.827Z] GEN /home/jenkins/workspace/Test_openjdk11_hs_sanity.system_x86-64_linux_testList_2/jvmtest/system/aqa-systemtest/openjdk.test.modularity/bin/common-mods/displayServiceImpl1
[2024-08-16T16:59:18.827Z] GEN /home/jenkins/workspace/Test_openjdk11_hs_sanity.system_x86-64_linux_testList_2/jvmtest/system/aqa-systemtest/openjdk.test.modularity/bin/common-mods/com.discreet
[2024-08-16T16:59:18.827Z] GEN /home/jenkins/workspace/Test_openjdk11_hs_sanity.system_x86-64_linux_testList_2/jvmtest/system/aqa-systemtest/openjdk.test.modularity/bin/common-mods/com.hello
[2024-08-16T16:59:18.827Z] GEN /home/jenkins/workspace/Test_openjdk11_hs_sanity.system_x86-64_linux_testList_2/jvmtest/system/aqa-systemtest/openjdk.test.modularity/bin/common-mods/com.hola
[2024-08-16T16:59:18.827Z] GEN /home/jenkins/workspace/Test_openjdk11_hs_sanity.system_x86-64_linux_testList_2/jvmtest/system/aqa-systemtest/openjdk.test.modularity/bin/common-mods/displayServiceImpl2
[2024-08-16T16:59:18.827Z] GEN /home/jenkins/workspace/Test_openjdk11_hs_sanity.system_x86-64_linux_testList_2/jvmtest/system/aqa-systemtest/openjdk.test.modularity/bin/common-mods/com.hi
[2024-08-16T16:59:18.827Z] GEN /home/jenkins/workspace/Test_openjdk11_hs_sanity.system_x86-64_linux_testList_2/jvmtest/system/aqa-systemtest/openjdk.test.modularity/bin/common-override
[2024-08-16T16:59:18.827Z] GEN /home/jenkins/workspace/Test_openjdk11_hs_sanity.system_x86-64_linux_testList_2/jvmtest/system/aqa-systemtest/openjdk.test.modularity/bin/common-override-new
[2024-08-16T16:59:18.827Z] GEN /home/jenkins/workspace/Test_openjdk11_hs_sanity.system_x86-64_linux_testList_2/jvmtest/system/aqa-systemtest/openjdk.test.modularity/bin/common/displayServiceImpl3
[2024-08-16T16:59:18.827Z] GEN /home/jenkins/workspace/Test_openjdk11_hs_sanity.system_x86-64_linux_testList_2/jvmtest/system/aqa-systemtest/openjdk.test.modularity/bin/common/displayServiceImpl4
[2024-08-16T16:59:18.827Z] GEN /home/jenkins/workspace/Test_openjdk11_hs_sanity.system_x86-64_linux_testList_2/jvmtest/system/aqa-systemtest/openjdk.test.modularity/bin/common
[2024-08-16T16:59:18.827Z] GEN /home/jenkins/workspace/Test_openjdk11_hs_sanity.system_x86-64_linux_testList_2/jvmtest/system/aqa-systemtest/openjdk.test.modularity/bin/tests
[2024-08-16T16:59:18.827Z] GEN /home/jenkins/workspace/Test_openjdk11_hs_sanity.system_x86-64_linux_testList_2/jvmtest/system/aqa-systemtest/openjdk.test.modularity/bin
[2024-08-16T16:59:18.827Z] GEN /home/jenkins/workspace/Test_openjdk11_hs_sanity.system_x86-64_linux_testList_2/jvmtest/system/STF/stf.core/bin
[2024-08-16T16:59:18.827Z] GEN /home/jenkins/testDependency/system_lib/log4j/log4j-api.jar
[2024-08-16T16:59:18.827Z] GEN /home/jenkins/testDependency/system_lib/log4j/log4j-core.jar
[2024-08-16T16:59:18.827Z] GEN /home/jenkins/testDependency/system_lib/junit/junit.jar
[2024-08-16T16:59:19.607Z] GEN 16:59:19.101 - Using Mode NoOptions. Values = ''
[2024-08-16T16:59:21.407Z] GEN 16:59:20.853 -
[2024-08-16T16:59:21.407Z] GEN 16:59:20.853 - Test command summary:
[2024-08-16T16:59:21.407Z] GEN 16:59:20.869 - Step Stage Command Description
[2024-08-16T16:59:21.407Z] GEN 16:59:20.870 - -----+--------+-----------------+------------
[2024-08-16T16:59:21.407Z] GEN 16:59:20.870 - 1 execute jar Create com.hello jar
[2024-08-16T16:59:21.407Z] GEN 16:59:20.870 - 2 execute jar Create com.hola jar
[2024-08-16T16:59:21.407Z] GEN 16:59:20.870 - 3 execute jar Create com.helper jar
[2024-08-16T16:59:21.407Z] GEN 16:59:20.870 - 4 execute jar Create com.discreet jar
[2024-08-16T16:59:21.407Z] GEN 16:59:20.870 - 5 execute jar Create tests jar
[2024-08-16T16:59:21.407Z] GEN 16:59:20.870 - 6 execute jlink Create runtime image for PatchModule test
[2024-08-16T16:59:21.407Z] GEN 16:59:20.870 - 7 execute jar Create com.hello jar
[2024-08-16T16:59:21.407Z] GEN 16:59:20.870 - 8 execute jar create java.xml.jar
[2024-08-16T16:59:21.407Z] GEN 16:59:20.871 - 9 execute Run java Run application class override test where we specify two exploded module paths in a single --patch-module option
[2024-08-16T16:59:21.407Z] GEN 16:59:20.871 - 10 execute Run java Verify if a module can be specified only once on --patch-module
[2024-08-16T16:59:21.407Z] GEN 16:59:20.871 - 11 execute Run java Combine stderr and stdout files of process OT7
[2024-08-16T16:59:21.407Z] GEN 16:59:20.871 - 12 execute count Check output
[2024-08-16T16:59:21.407Z] GEN 16:59:20.871 - 13 execute Run java (Negative test) Verify if --patch-module allows replacing of module-info.class
[2024-08-16T16:59:21.407Z] GEN 16:59:20.871 - 14 execute count Check output
[2024-08-16T16:59:21.407Z] STF 16:59:21.189 -
[2024-08-16T16:59:21.407Z] STF 16:59:21.191 - Script generation completed
[2024-08-16T16:59:21.407Z] STF 16:59:21.191 -
[2024-08-16T16:59:21.407Z] STF 16:59:21.192 -
[2024-08-16T16:59:21.407Z] STF 16:59:21.192 - ======================= S E T U P =======================
[2024-08-16T16:59:21.407Z] STF 16:59:21.192 - Running setup: perl /home/jenkins/workspace/Test_openjdk11_hs_sanity.system_x86-64_linux_testList_2/aqa-tests/TKG/../TKG/output_17238263044651/PatModImg_Adv_0/20240816-165905-PatModImgTest/setUp.pl
[2024-08-16T16:59:22.178Z] STF 16:59:21.682 - SETUP stage completed
[2024-08-16T16:59:22.178Z] STF 16:59:21.709 -
[2024-08-16T16:59:22.178Z] STF 16:59:21.709 - ==================== E X E C U T E - ====================
[2024-08-16T16:59:22.178Z] STF 16:59:21.709 - Running execute: perl /home/jenkins/workspace/Test_openjdk11_hs_sanity.system_x86-64_linux_testList_2/aqa-tests/TKG/../TKG/output_17238263044651/PatModImg_Adv_0/20240816-165905-PatModImgTest/execute.pl
[2024-08-16T16:59:22.960Z] STF 16:59:22.160 -
[2024-08-16T16:59:22.960Z] STF 16:59:22.160 - Java version
[2024-08-16T16:59:22.960Z] STF 16:59:22.160 - Running: /home/jenkins/workspace/Test_openjdk11_hs_sanity.system_x86-64_linux_testList_2/jdkbinary/j2sdk-image/jdk-11.0.25+3/bin/java -version
[2024-08-16T16:59:22.960Z] openjdk version "11.0.25-beta" 2024-10-15
[2024-08-16T16:59:22.960Z] OpenJDK Runtime Environment Temurin-11.0.25+3-202408161522 (build 11.0.25-beta+3-ea)
[2024-08-16T16:59:22.960Z] OpenJDK 64-Bit Server VM Temurin-11.0.25+3-202408161522 (build 11.0.25-beta+3-ea, mixed mode)
[2024-08-16T16:59:22.960Z] STF 16:59:22.890 -
[2024-08-16T16:59:22.960Z] STF 16:59:22.890 - +------ Step 1 - Create com.hello jar
[2024-08-16T16:59:22.960Z] STF 16:59:22.890 - | Create modular jar
[2024-08-16T16:59:22.960Z] STF 16:59:22.890 - | ModuleSpec: openjdk.test.modularity/bin/common-mods/com.hello
[2024-08-16T16:59:22.960Z] STF 16:59:22.890 - | ModuleVersion: null
[2024-08-16T16:59:22.960Z] STF 16:59:22.890 - | MainClass: null
[2024-08-16T16:59:22.960Z] STF 16:59:22.890 - | HashModules: null
[2024-08-16T16:59:22.960Z] STF 16:59:22.890 - |
[2024-08-16T16:59:22.960Z] STF 16:59:22.891 - Running command: /home/jenkins/workspace/Test_openjdk11_hs_sanity.system_x86-64_linux_testList_2/jdkbinary/j2sdk-image/jdk-11.0.25+3/bin/jar --create --file /home/jenkins/workspace/Test_openjdk11_hs_sanity.system_x86-64_linux_testList_2/aqa-tests/TKG/output_17238263044651/PatModImg_Adv_0/20240816-165905-PatModImgTest/modules/1.com.hello.jar -C /home/jenkins/workspace/Test_openjdk11_hs_sanity.system_x86-64_linux_testList_2/jvmtest/system/aqa-systemtest/openjdk.test.modularity/bin/common-mods/com.hello .
[2024-08-16T16:59:22.960Z] STF 16:59:22.891 - Redirecting stderr to /home/jenkins/workspace/Test_openjdk11_hs_sanity.system_x86-64_linux_testList_2/aqa-tests/TKG/output_17238263044651/PatModImg_Adv_0/20240816-165905-PatModImgTest/results/1.CMJ.stderr
[2024-08-16T16:59:22.960Z] STF 16:59:22.891 - Redirecting stdout to /home/jenkins/workspace/Test_openjdk11_hs_sanity.system_x86-64_linux_testList_2/aqa-tests/TKG/output_17238263044651/PatModImg_Adv_0/20240816-165905-PatModImgTest/results/1.CMJ.stdout
[2024-08-16T16:59:23.732Z] STF 16:59:22.948 - Monitoring processes: CMJ
[2024-08-16T16:59:25.347Z] STF 16:59:24.664 - Monitoring Report Summary:
[2024-08-16T16:59:25.347Z] STF 16:59:24.664 - o Process CMJ ended with the expected exit code (0)
[2024-08-16T16:59:25.347Z] STF 16:59:24.664 - Created modular jar: 1.com.hello.jar
[2024-08-16T16:59:25.347Z] STF 16:59:24.664 -
[2024-08-16T16:59:25.347Z] STF 16:59:24.664 - +------ Step 2 - Create com.hola jar
[2024-08-16T16:59:25.347Z] STF 16:59:24.664 - | Create modular jar
[2024-08-16T16:59:25.347Z] STF 16:59:24.664 - | ModuleSpec: openjdk.test.modularity/bin/common-mods/com.hola
[2024-08-16T16:59:25.347Z] STF 16:59:24.664 - | ModuleVersion: null
[2024-08-16T16:59:25.347Z] STF 16:59:24.664 - | MainClass: null
[2024-08-16T16:59:25.347Z] STF 16:59:24.664 - | HashModules: null
[2024-08-16T16:59:25.347Z] STF 16:59:24.664 - |
[2024-08-16T16:59:25.347Z] STF 16:59:24.664 - Running command: /home/jenkins/workspace/Test_openjdk11_hs_sanity.system_x86-64_linux_testList_2/jdkbinary/j2sdk-image/jdk-11.0.25+3/bin/jar --create --file /home/jenkins/workspace/Test_openjdk11_hs_sanity.system_x86-64_linux_testList_2/aqa-tests/TKG/output_17238263044651/PatModImg_Adv_0/20240816-165905-PatModImgTest/modules/2.com.hola.jar -C /home/jenkins/workspace/Test_openjdk11_hs_sanity.system_x86-64_linux_testList_2/jvmtest/system/aqa-systemtest/openjdk.test.modularity/bin/common-mods/com.hola .
[2024-08-16T16:59:25.347Z] STF 16:59:24.664 - Redirecting stderr to /home/jenkins/workspace/Test_openjdk11_hs_sanity.system_x86-64_linux_testList_2/aqa-tests/TKG/output_17238263044651/PatModImg_Adv_0/20240816-165905-PatModImgTest/results/2.CMJ.stderr
[2024-08-16T16:59:25.347Z] STF 16:59:24.664 - Redirecting stdout to /home/jenkins/workspace/Test_openjdk11_hs_sanity.system_x86-64_linux_testList_2/aqa-tests/TKG/output_17238263044651/PatModImg_Adv_0/20240816-165905-PatModImgTest/results/2.CMJ.stdout
[2024-08-16T16:59:25.347Z] STF 16:59:24.678 - Monitoring processes: CMJ
[2024-08-16T16:59:27.002Z] STF 16:59:26.699 - Monitoring Report Summary:
[2024-08-16T16:59:27.002Z] STF 16:59:26.699 - o Process CMJ ended with the expected exit code (0)
[2024-08-16T16:59:27.002Z] STF 16:59:26.699 - Created modular jar: 2.com.hola.jar
[2024-08-16T16:59:27.002Z] STF 16:59:26.699 -
[2024-08-16T16:59:27.002Z] STF 16:59:26.699 - +------ Step 3 - Create com.helper jar
[2024-08-16T16:59:27.002Z] STF 16:59:26.699 - | Create modular jar
[2024-08-16T16:59:27.002Z] STF 16:59:26.699 - | ModuleSpec: openjdk.test.modularity/bin/common-mods/com.helper
[2024-08-16T16:59:27.002Z] STF 16:59:26.699 - | ModuleVersion: null
[2024-08-16T16:59:27.002Z] STF 16:59:26.699 - | MainClass: null
[2024-08-16T16:59:27.002Z] STF 16:59:26.699 - | HashModules: null
[2024-08-16T16:59:27.002Z] STF 16:59:26.699 - |
[2024-08-16T16:59:27.002Z] STF 16:59:26.700 - Running command: /home/jenkins/workspace/Test_openjdk11_hs_sanity.system_x86-64_linux_testList_2/jdkbinary/j2sdk-image/jdk-11.0.25+3/bin/jar --create --file /home/jenkins/workspace/Test_openjdk11_hs_sanity.system_x86-64_linux_testList_2/aqa-tests/TKG/output_17238263044651/PatModImg_Adv_0/20240816-165905-PatModImgTest/modules/3.com.helper.jar -C /home/jenkins/workspace/Test_openjdk11_hs_sanity.system_x86-64_linux_testList_2/jvmtest/system/aqa-systemtest/openjdk.test.modularity/bin/common-mods/com.helper .
[2024-08-16T16:59:27.002Z] STF 16:59:26.700 - Redirecting stderr to /home/jenkins/workspace/Test_openjdk11_hs_sanity.system_x86-64_linux_testList_2/aqa-tests/TKG/output_17238263044651/PatModImg_Adv_0/20240816-165905-PatModImgTest/results/3.CMJ.stderr
[2024-08-16T16:59:27.002Z] STF 16:59:26.700 - Redirecting stdout to /home/jenkins/workspace/Test_openjdk11_hs_sanity.system_x86-64_linux_testList_2/aqa-tests/TKG/output_17238263044651/PatModImg_Adv_0/20240816-165905-PatModImgTest/results/3.CMJ.stdout
[2024-08-16T16:59:27.002Z] STF 16:59:26.701 - Monitoring processes: CMJ
[2024-08-16T16:59:29.533Z] STF 16:59:28.541 - Monitoring Report Summary:
[2024-08-16T16:59:29.533Z] STF 16:59:28.541 - o Process CMJ ended with the expected exit code (0)
[2024-08-16T16:59:29.533Z] STF 16:59:28.541 - Created modular jar: 3.com.helper.jar
[2024-08-16T16:59:29.533Z] STF 16:59:28.541 -
[2024-08-16T16:59:29.533Z] STF 16:59:28.541 - +------ Step 4 - Create com.discreet jar
[2024-08-16T16:59:29.533Z] STF 16:59:28.541 - | Create modular jar
[2024-08-16T16:59:29.533Z] STF 16:59:28.541 - | ModuleSpec: openjdk.test.modularity/bin/common-mods/com.discreet
[2024-08-16T16:59:29.533Z] STF 16:59:28.541 - | ModuleVersion: null
[2024-08-16T16:59:29.533Z] STF 16:59:28.541 - | MainClass: null
[2024-08-16T16:59:29.533Z] STF 16:59:28.541 - | HashModules: null
[2024-08-16T16:59:29.533Z] STF 16:59:28.541 - |
[2024-08-16T16:59:29.533Z] STF 16:59:28.542 - Running command: /home/jenkins/workspace/Test_openjdk11_hs_sanity.system_x86-64_linux_testList_2/jdkbinary/j2sdk-image/jdk-11.0.25+3/bin/jar --create --file /home/jenkins/workspace/Test_openjdk11_hs_sanity.system_x86-64_linux_testList_2/aqa-tests/TKG/output_17238263044651/PatModImg_Adv_0/20240816-165905-PatModImgTest/modules/4.com.discreet.jar -C /home/jenkins/workspace/Test_openjdk11_hs_sanity.system_x86-64_linux_testList_2/jvmtest/system/aqa-systemtest/openjdk.test.modularity/bin/common-mods/com.discreet .
[2024-08-16T16:59:29.533Z] STF 16:59:28.542 - Redirecting stderr to /home/jenkins/workspace/Test_openjdk11_hs_sanity.system_x86-64_linux_testList_2/aqa-tests/TKG/output_17238263044651/PatModImg_Adv_0/20240816-165905-PatModImgTest/results/4.CMJ.stderr
[2024-08-16T16:59:29.533Z] STF 16:59:28.542 - Redirecting stdout to /home/jenkins/workspace/Test_openjdk11_hs_sanity.system_x86-64_linux_testList_2/aqa-tests/TKG/output_17238263044651/PatModImg_Adv_0/20240816-165905-PatModImgTest/results/4.CMJ.stdout
[2024-08-16T16:59:29.533Z] STF 16:59:28.556 - Monitoring processes: CMJ
[2024-08-16T16:59:31.171Z] STF 16:59:30.289 - Monitoring Report Summary:
[2024-08-16T16:59:31.171Z] STF 16:59:30.293 - o Process CMJ ended with the expected exit code (0)
[2024-08-16T16:59:31.171Z] STF 16:59:30.293 - Created modular jar: 4.com.discreet.jar
[2024-08-16T16:59:31.171Z] STF 16:59:30.293 -
[2024-08-16T16:59:31.171Z] STF 16:59:30.293 - +------ Step 5 - Create tests jar
[2024-08-16T16:59:31.171Z] STF 16:59:30.293 - | Create modular jar
[2024-08-16T16:59:31.171Z] STF 16:59:30.293 - | ModuleSpec: openjdk.test.modularity/bin/tests/com.test
[2024-08-16T16:59:31.171Z] STF 16:59:30.293 - | ModuleVersion: null
[2024-08-16T16:59:31.171Z] STF 16:59:30.293 - | MainClass: null
[2024-08-16T16:59:31.171Z] STF 16:59:30.293 - | HashModules: null
[2024-08-16T16:59:31.171Z] STF 16:59:30.293 - |
[2024-08-16T16:59:31.171Z] STF 16:59:30.293 - Running command: /home/jenkins/workspace/Test_openjdk11_hs_sanity.system_x86-64_linux_testList_2/jdkbinary/j2sdk-image/jdk-11.0.25+3/bin/jar --create --file /home/jenkins/workspace/Test_openjdk11_hs_sanity.system_x86-64_linux_testList_2/aqa-tests/TKG/output_17238263044651/PatModImg_Adv_0/20240816-165905-PatModImgTest/modules/5.com.test.jar -C /home/jenkins/workspace/Test_openjdk11_hs_sanity.system_x86-64_linux_testList_2/jvmtest/system/aqa-systemtest/openjdk.test.modularity/bin/tests/com.test .
[2024-08-16T16:59:31.171Z] STF 16:59:30.293 - Redirecting stderr to /home/jenkins/workspace/Test_openjdk11_hs_sanity.system_x86-64_linux_testList_2/aqa-tests/TKG/output_17238263044651/PatModImg_Adv_0/20240816-165905-PatModImgTest/results/5.CMJ.stderr
[2024-08-16T16:59:31.171Z] STF 16:59:30.293 - Redirecting stdout to /home/jenkins/workspace/Test_openjdk11_hs_sanity.system_x86-64_linux_testList_2/aqa-tests/TKG/output_17238263044651/PatModImg_Adv_0/20240816-165905-PatModImgTest/results/5.CMJ.stdout
[2024-08-16T16:59:31.171Z] STF 16:59:30.295 - Monitoring processes: CMJ
[2024-08-16T16:59:32.784Z] STF 16:59:32.194 - Monitoring Report Summary:
[2024-08-16T16:59:32.784Z] STF 16:59:32.194 - o Process CMJ ended with the expected exit code (0)
[2024-08-16T16:59:32.784Z] STF 16:59:32.194 - Created modular jar: 5.com.test.jar
[2024-08-16T16:59:32.785Z] STF 16:59:32.194 -
[2024-08-16T16:59:32.785Z] STF 16:59:32.194 - +------ Step 6 - Create runtime image for PatchModule test
[2024-08-16T16:59:32.785Z] STF 16:59:32.194 - | Run jlink to create runtime image
[2024-08-16T16:59:32.785Z] STF 16:59:32.194 - | ImageName: XpJVM
[2024-08-16T16:59:32.785Z] STF 16:59:32.194 - |
[2024-08-16T16:59:32.785Z] STF 16:59:32.195 - Running command: /home/jenkins/workspace/Test_openjdk11_hs_sanity.system_x86-64_linux_testList_2/jdkbinary/j2sdk-image/jdk-11.0.25+3/bin/jlink --module-path /home/jenkins/workspace/Test_openjdk11_hs_sanity.system_x86-64_linux_testList_2/jdkbinary/j2sdk-image/jdk-11.0.25+3/jmods:/home/jenkins/workspace/Test_openjdk11_hs_sanity.system_x86-64_linux_testList_2/aqa-tests/TKG/output_17238263044651/PatModImg_Adv_0/20240816-165905-PatModImgTest/modules --add-modules com.hello,com.hola,com.test,com.helper,com.discreet --output /home/jenkins/workspace/Test_openjdk11_hs_sanity.system_x86-64_linux_testList_2/aqa-tests/TKG/output_17238263044651/PatModImg_Adv_0/20240816-165905-PatModImgTest/tmp/6.XpJVM
[2024-08-16T16:59:32.785Z] STF 16:59:32.195 - Redirecting stderr to /home/jenkins/workspace/Test_openjdk11_hs_sanity.system_x86-64_linux_testList_2/aqa-tests/TKG/output_17238263044651/PatModImg_Adv_0/20240816-165905-PatModImgTest/results/6.JLNK.stderr
[2024-08-16T16:59:32.785Z] STF 16:59:32.195 - Redirecting stdout to /home/jenkins/workspace/Test_openjdk11_hs_sanity.system_x86-64_linux_testList_2/aqa-tests/TKG/output_17238263044651/PatModImg_Adv_0/20240816-165905-PatModImgTest/results/6.JLNK.stdout
[2024-08-16T16:59:32.785Z] STF 16:59:32.223 - Monitoring processes: JLNK
[2024-08-16T16:59:59.839Z] STF 16:59:55.929 - Monitoring Report Summary:
[2024-08-16T16:59:59.839Z] STF 16:59:55.929 - o Process JLNK ended with the expected exit code (0)
[2024-08-16T16:59:59.839Z] STF 16:59:55.929 -
[2024-08-16T16:59:59.839Z] STF 16:59:55.929 - +------ Step 7 - Create com.hello jar
[2024-08-16T16:59:59.839Z] STF 16:59:55.929 - | Create modular jar
[2024-08-16T16:59:59.839Z] STF 16:59:55.929 - | ModuleSpec: openjdk.test.modularity/bin/common-override/com.hello
[2024-08-16T16:59:59.839Z] STF 16:59:55.929 - | ModuleVersion: null
[2024-08-16T16:59:59.839Z] STF 16:59:55.929 - | MainClass: null
[2024-08-16T16:59:59.839Z] STF 16:59:55.929 - | HashModules: null
[2024-08-16T16:59:59.839Z] STF 16:59:55.929 - |
[2024-08-16T16:59:59.840Z] STF 16:59:55.930 - Running command: /home/jenkins/workspace/Test_openjdk11_hs_sanity.system_x86-64_linux_testList_2/jdkbinary/j2sdk-image/jdk-11.0.25+3/bin/jar --create --file /home/jenkins/workspace/Test_openjdk11_hs_sanity.system_x86-64_linux_testList_2/aqa-tests/TKG/output_17238263044651/PatModImg_Adv_0/20240816-165905-PatModImgTest/modules/7.com.hello.jar -C /home/jenkins/workspace/Test_openjdk11_hs_sanity.system_x86-64_linux_testList_2/jvmtest/system/aqa-systemtest/openjdk.test.modularity/bin/common-override/com.hello .
[2024-08-16T16:59:59.840Z] STF 16:59:55.930 - Redirecting stderr to /home/jenkins/workspace/Test_openjdk11_hs_sanity.system_x86-64_linux_testList_2/aqa-tests/TKG/output_17238263044651/PatModImg_Adv_0/20240816-165905-PatModImgTest/results/7.CMJ.stderr
[2024-08-16T16:59:59.840Z] STF 16:59:55.930 - Redirecting stdout to /home/jenkins/workspace/Test_openjdk11_hs_sanity.system_x86-64_linux_testList_2/aqa-tests/TKG/output_17238263044651/PatModImg_Adv_0/20240816-165905-PatModImgTest/results/7.CMJ.stdout
[2024-08-16T16:59:59.840Z] STF 16:59:55.931 - Monitoring processes: CMJ
[2024-08-16T16:59:59.840Z] STF 16:59:57.639 - Monitoring Report Summary:
[2024-08-16T16:59:59.840Z] STF 16:59:57.639 - o Process CMJ ended with the expected exit code (0)
[2024-08-16T16:59:59.840Z] STF 16:59:57.639 - Created modular jar: 7.com.hello.jar
[2024-08-16T16:59:59.840Z] STF 16:59:57.639 -
[2024-08-16T16:59:59.840Z] STF 16:59:57.639 - +------ Step 8 - create java.xml.jar
[2024-08-16T16:59:59.840Z] STF 16:59:57.639 - | Create modular jar
[2024-08-16T16:59:59.840Z] STF 16:59:57.639 - | ModuleSpec: openjdk.test.modularity/bin/common-override/java.xml
[2024-08-16T16:59:59.840Z] STF 16:59:57.639 - | ModuleVersion: null
[2024-08-16T16:59:59.840Z] STF 16:59:57.639 - | MainClass: null
[2024-08-16T16:59:59.840Z] STF 16:59:57.639 - | HashModules: null
[2024-08-16T16:59:59.840Z] STF 16:59:57.639 - |
[2024-08-16T16:59:59.840Z] STF 16:59:57.640 - Running command: /home/jenkins/workspace/Test_openjdk11_hs_sanity.system_x86-64_linux_testList_2/jdkbinary/j2sdk-image/jdk-11.0.25+3/bin/jar --create --file /home/jenkins/workspace/Test_openjdk11_hs_sanity.system_x86-64_linux_testList_2/aqa-tests/TKG/output_17238263044651/PatModImg_Adv_0/20240816-165905-PatModImgTest/modules/8.java.xml.jar -C /home/jenkins/workspace/Test_openjdk11_hs_sanity.system_x86-64_linux_testList_2/jvmtest/system/aqa-systemtest/openjdk.test.modularity/bin/common-override/java.xml .
[2024-08-16T16:59:59.840Z] STF 16:59:57.640 - Redirecting stderr to /home/jenkins/workspace/Test_openjdk11_hs_sanity.system_x86-64_linux_testList_2/aqa-tests/TKG/output_17238263044651/PatModImg_Adv_0/20240816-165905-PatModImgTest/results/8.CMJ.stderr
[2024-08-16T16:59:59.840Z] STF 16:59:57.640 - Redirecting stdout to /home/jenkins/workspace/Test_openjdk11_hs_sanity.system_x86-64_linux_testList_2/aqa-tests/TKG/output_17238263044651/PatModImg_Adv_0/20240816-165905-PatModImgTest/results/8.CMJ.stdout
[2024-08-16T16:59:59.840Z] STF 16:59:57.653 - Monitoring processes: CMJ
[2024-08-16T17:00:00.649Z] STF 16:59:59.526 - Monitoring Report Summary:
[2024-08-16T17:00:00.649Z] STF 16:59:59.526 - o Process CMJ ended with the expected exit code (0)
[2024-08-16T17:00:00.649Z] STF 16:59:59.526 - Created modular jar: 8.java.xml.jar
[2024-08-16T17:00:00.649Z] STF 16:59:59.526 -
[2024-08-16T17:00:00.649Z] STF 16:59:59.526 - +------ Step 9 - Run application class override test where we specify two exploded module paths in a single --patch-module option
[2024-08-16T17:00:00.649Z] STF 16:59:59.526 - | Run foreground process
[2024-08-16T17:00:00.649Z] STF 16:59:59.526 - | Program: /home/jenkins/workspace/Test_openjdk11_hs_sanity.system_x86-64_linux_testList_2/aqa-tests/TKG/output_17238263044651/PatModImg_Adv_0/20240816-165905-PatModImgTest/tmp/6.XpJVM/bin/java
[2024-08-16T17:00:00.649Z] STF 16:59:59.526 - | Mnemonic: OT1
[2024-08-16T17:00:00.649Z] STF 16:59:59.526 - | Echo: ECHO_ON
[2024-08-16T17:00:00.649Z] STF 16:59:59.526 - | Expectation: CLEAN_RUN within 5m
[2024-08-16T17:00:00.649Z] STF 16:59:59.526 - |
[2024-08-16T17:00:00.650Z] STF 16:59:59.527 - Running command: /home/jenkins/workspace/Test_openjdk11_hs_sanity.system_x86-64_linux_testList_2/aqa-tests/TKG/output_17238263044651/PatModImg_Adv_0/20240816-165905-PatModImgTest/tmp/6.XpJVM/bin/java --add-reads com.test=ALL-UNNAMED --add-exports com.hello/adoptopenjdk.test.modularity.newpkg=com.test --patch-module com.hello=/home/jenkins/workspace/Test_openjdk11_hs_sanity.system_x86-64_linux_testList_2/jvmtest/system/aqa-systemtest/openjdk.test.modularity/bin/common-override/com.hello:/home/jenkins/workspace/Test_openjdk11_hs_sanity.system_x86-64_linux_testList_2/jvmtest/system/aqa-systemtest/openjdk.test.modularity/bin/common-override-new/com.hello -XX:+UseCompressedOops -classpath /home/jenkins/testDependency/system_lib/junit/junit.jar:/home/jenkins/testDependency/system_lib/junit/hamcrest-core.jar org.junit.runner.JUnitCore net.adoptopenjdk.test.modularity.junit.TestOverrideUsingMultipleFilePaths
[2024-08-16T17:00:00.650Z] STF 16:59:59.527 - Redirecting stderr to /home/jenkins/workspace/Test_openjdk11_hs_sanity.system_x86-64_linux_testList_2/aqa-tests/TKG/output_17238263044651/PatModImg_Adv_0/20240816-165905-PatModImgTest/results/9.OT1.stderr
[2024-08-16T17:00:00.650Z] STF 16:59:59.527 - Redirecting stdout to /home/jenkins/workspace/Test_openjdk11_hs_sanity.system_x86-64_linux_testList_2/aqa-tests/TKG/output_17238263044651/PatModImg_Adv_0/20240816-165905-PatModImgTest/results/9.OT1.stdout
[2024-08-16T17:00:00.650Z] STF 16:59:59.528 - Monitoring processes: OT1
[2024-08-16T17:00:01.431Z] OT1 stderr WARNING: module-info.class ignored in patch: /home/jenkins/workspace/Test_openjdk11_hs_sanity.system_x86-64_linux_testList_2/jvmtest/system/aqa-systemtest/openjdk.test.modularity/bin/common-override/com.hello
[2024-08-16T17:00:01.431Z] OT1 stderr WARNING: module-info.class ignored in patch: /home/jenkins/workspace/Test_openjdk11_hs_sanity.system_x86-64_linux_testList_2/jvmtest/system/aqa-systemtest/openjdk.test.modularity/bin/common-override-new/com.hello
[2024-08-16T17:00:01.431Z] OT1 JUnit version 4.12
[2024-08-16T17:00:02.218Z] OT1 ...
[2024-08-16T17:00:02.218Z] OT1 Time: 0.101
[2024-08-16T17:00:02.218Z] OT1
[2024-08-16T17:00:02.218Z] OT1 OK (3 tests)
[2024-08-16T17:00:02.218Z] OT1
[2024-08-16T17:00:02.218Z] STF 17:00:01.818 - Monitoring Report Summary:
[2024-08-16T17:00:02.218Z] STF 17:00:01.818 - o Process OT1 ended with the expected exit code (0)
[2024-08-16T17:00:02.218Z] STF 17:00:01.818 -
[2024-08-16T17:00:02.218Z] STF 17:00:01.819 - +------ Step 10 - Verify if a module can be specified only once on --patch-module
[2024-08-16T17:00:02.218Z] STF 17:00:01.819 - | Run foreground process
[2024-08-16T17:00:02.218Z] STF 17:00:01.819 - | Program: /home/jenkins/workspace/Test_openjdk11_hs_sanity.system_x86-64_linux_testList_2/aqa-tests/TKG/output_17238263044651/PatModImg_Adv_0/20240816-165905-PatModImgTest/tmp/6.XpJVM/bin/java
[2024-08-16T17:00:02.218Z] STF 17:00:01.819 - | Mnemonic: OT7
[2024-08-16T17:00:02.218Z] STF 17:00:01.819 - | Echo: ECHO_ON
[2024-08-16T17:00:02.218Z] STF 17:00:01.819 - | Expectation: NON_ZERO_EXIT [1] within 5m
[2024-08-16T17:00:02.218Z] STF 17:00:01.819 - |
[2024-08-16T17:00:02.218Z] STF 17:00:01.819 - Running command: /home/jenkins/workspace/Test_openjdk11_hs_sanity.system_x86-64_linux_testList_2/aqa-tests/TKG/output_17238263044651/PatModImg_Adv_0/20240816-165905-PatModImgTest/tmp/6.XpJVM/bin/java --add-reads com.test=ALL-UNNAMED --patch-module com.hello=/home/jenkins/workspace/Test_openjdk11_hs_sanity.system_x86-64_linux_testList_2/jvmtest/system/aqa-systemtest/openjdk.test.modularity/bin/common-override-new/com.hello --patch-module com.hello=/home/jenkins/workspace/Test_openjdk11_hs_sanity.system_x86-64_linux_testList_2/jvmtest/system/aqa-systemtest/openjdk.test.modularity/bin/common-override/com.hello -XX:+UseCompressedOops -classpath /home/jenkins/testDependency/system_lib/junit/junit.jar:/home/jenkins/testDependency/system_lib/junit/hamcrest-core.jar org.junit.runner.JUnitCore net.adoptopenjdk.test.modularity.junit.TestOverrideUsingAppModule
[2024-08-16T17:00:02.218Z] STF 17:00:01.819 - Redirecting stderr to /home/jenkins/workspace/Test_openjdk11_hs_sanity.system_x86-64_linux_testList_2/aqa-tests/TKG/output_17238263044651/PatModImg_Adv_0/20240816-165905-PatModImgTest/results/10.OT7.stderr
[2024-08-16T17:00:02.218Z] STF 17:00:01.819 - Redirecting stdout to /home/jenkins/workspace/Test_openjdk11_hs_sanity.system_x86-64_linux_testList_2/aqa-tests/TKG/output_17238263044651/PatModImg_Adv_0/20240816-165905-PatModImgTest/results/10.OT7.stdout
[2024-08-16T17:00:02.218Z] STF 17:00:01.827 - Monitoring processes: OT7
[2024-08-16T17:00:03.025Z] OT7 Error occurred during initialization of boot layer
[2024-08-16T17:00:03.025Z] OT7 java.lang.ExceptionInInitializerError
[2024-08-16T17:00:03.025Z] OT7 Caused by: java.lang.RuntimeException: com.hello specified more than once to --patch-module
[2024-08-16T17:00:03.025Z] STF 17:00:02.488 - Monitoring Report Summary:
[2024-08-16T17:00:03.025Z] STF 17:00:02.488 - o Process OT7 ended with the expected exit code (1)
[2024-08-16T17:00:03.025Z] STF 17:00:02.488 -
[2024-08-16T17:00:03.025Z] STF 17:00:02.488 - +------ Step 11 - Combine stderr and stdout files of process OT7
[2024-08-16T17:00:03.025Z] STF 17:00:02.488 - | Run foreground process
[2024-08-16T17:00:03.025Z] STF 17:00:02.488 - | Program: /home/jenkins/workspace/Test_openjdk11_hs_sanity.system_x86-64_linux_testList_2/jdkbinary/j2sdk-image/jdk-11.0.25+3/bin/java
[2024-08-16T17:00:03.025Z] STF 17:00:02.488 - | Mnemonic: CO
[2024-08-16T17:00:03.025Z] STF 17:00:02.488 - | Echo: ECHO_OFF
[2024-08-16T17:00:03.025Z] STF 17:00:02.488 - | Expectation: NON_ZERO_EXIT [0] within 30s
[2024-08-16T17:00:03.025Z] STF 17:00:02.488 - |
[2024-08-16T17:00:03.025Z] STF 17:00:02.488 - Running command: /home/jenkins/workspace/Test_openjdk11_hs_sanity.system_x86-64_linux_testList_2/jdkbinary/j2sdk-image/jdk-11.0.25+3/bin/java -Dfile1=/home/jenkins/workspace/Test_openjdk11_hs_sanity.system_x86-64_linux_testList_2/aqa-tests/TKG/output_17238263044651/PatModImg_Adv_0/20240816-165905-PatModImgTest/results/10.OT7.stdout -Dfile2=/home/jenkins/workspace/Test_openjdk11_hs_sanity.system_x86-64_linux_testList_2/aqa-tests/TKG/output_17238263044651/PatModImg_Adv_0/20240816-165905-PatModImgTest/results/10.OT7.stderr -Dfinal.file=/home/jenkins/workspace/Test_openjdk11_hs_sanity.system_x86-64_linux_testList_2/aqa-tests/TKG/output_17238263044651/PatModImg_Adv_0/20240816-165905-PatModImgTest/results/combinedOT7.txt -XX:+UseCompressedOops -classpath /home/jenkins/workspace/Test_openjdk11_hs_sanity.system_x86-64_linux_testList_2/jvmtest/system/STF/stf.core/bin:/home/jenkins/workspace/Test_openjdk11_hs_sanity.system_x86-64_linux_testList_2/jvmtest/system/aqa-systemtest/openjdk.test.modularity/bin net.adoptopenjdk.test.modularity.TestUtil
[2024-08-16T17:00:03.025Z] STF 17:00:02.488 - Redirecting stderr to /home/jenkins/workspace/Test_openjdk11_hs_sanity.system_x86-64_linux_testList_2/aqa-tests/TKG/output_17238263044651/PatModImg_Adv_0/20240816-165905-PatModImgTest/results/11.CO.stderr
[2024-08-16T17:00:03.025Z] STF 17:00:02.488 - Redirecting stdout to /home/jenkins/workspace/Test_openjdk11_hs_sanity.system_x86-64_linux_testList_2/aqa-tests/TKG/output_17238263044651/PatModImg_Adv_0/20240816-165905-PatModImgTest/results/11.CO.stdout
[2024-08-16T17:00:03.025Z] STF 17:00:02.503 - Monitoring processes: CO
[2024-08-16T17:00:04.648Z] STF 17:00:04.164 - Monitoring Report Summary:
[2024-08-16T17:00:04.648Z] STF 17:00:04.164 - o Process CO ended with the expected exit code (0)
[2024-08-16T17:00:04.648Z] STF 17:00:04.165 -
[2024-08-16T17:00:04.648Z] STF 17:00:04.165 - +------ Step 12 - Check output
[2024-08-16T17:00:04.648Z] STF 17:00:04.165 - | Count file matches
[2024-08-16T17:00:04.648Z] STF 17:00:04.165 - | TargetFile: /home/jenkins/workspace/Test_openjdk11_hs_sanity.system_x86-64_linux_testList_2/aqa-tests/TKG/output_17238263044651/PatModImg_Adv_0/20240816-165905-PatModImgTest/results/combinedOT7.txt
[2024-08-16T17:00:04.648Z] STF 17:00:04.165 - | ExpectedNumMatches: 1
[2024-08-16T17:00:04.648Z] STF 17:00:04.165 - | SearchStrings: ["java.lang.ExceptionInInitializerError"]
[2024-08-16T17:00:04.648Z] STF 17:00:04.165 - |
[2024-08-16T17:00:04.648Z] STF 17:00:04.165 - Found 1 instances of ["java.lang.ExceptionInInitializerError"]
[2024-08-16T17:00:04.648Z] STF 17:00:04.165 -
[2024-08-16T17:00:04.648Z] STF 17:00:04.165 - +------ Step 13 - (Negative test) Verify if --patch-module allows replacing of module-info.class
[2024-08-16T17:00:04.648Z] STF 17:00:04.165 - | Run foreground process
[2024-08-16T17:00:04.648Z] STF 17:00:04.165 - | Program: /home/jenkins/workspace/Test_openjdk11_hs_sanity.system_x86-64_linux_testList_2/aqa-tests/TKG/output_17238263044651/PatModImg_Adv_0/20240816-165905-PatModImgTest/tmp/6.XpJVM/bin/java
[2024-08-16T17:00:04.648Z] STF 17:00:04.165 - | Mnemonic: OT8
[2024-08-16T17:00:04.648Z] STF 17:00:04.165 - | Echo: ECHO_ON
[2024-08-16T17:00:04.648Z] STF 17:00:04.165 - | Expectation: NON_ZERO_EXIT [1] within 5m
[2024-08-16T17:00:04.648Z] STF 17:00:04.165 - |
[2024-08-16T17:00:04.648Z] STF 17:00:04.165 - Running command: /home/jenkins/workspace/Test_openjdk11_hs_sanity.system_x86-64_linux_testList_2/aqa-tests/TKG/output_17238263044651/PatModImg_Adv_0/20240816-165905-PatModImgTest/tmp/6.XpJVM/bin/java --add-reads com.test=ALL-UNNAMED --patch-module com.hello=/home/jenkins/workspace/Test_openjdk11_hs_sanity.system_x86-64_linux_testList_2/jvmtest/system/aqa-systemtest/openjdk.test.modularity/bin/common-override-new/com.hello -XX:+UseCompressedOops -classpath /home/jenkins/testDependency/system_lib/junit/junit.jar:/home/jenkins/testDependency/system_lib/junit/hamcrest-core.jar org.junit.runner.JUnitCore net.adoptopenjdk.test.modularity.junit.TestOverrideUsingUnexportedPublicType
[2024-08-16T17:00:04.648Z] STF 17:00:04.165 - Redirecting stderr to /home/jenkins/workspace/Test_openjdk11_hs_sanity.system_x86-64_linux_testList_2/aqa-tests/TKG/output_17238263044651/PatModImg_Adv_0/20240816-165905-PatModImgTest/results/13.OT8.stderr
[2024-08-16T17:00:04.648Z] STF 17:00:04.165 - Redirecting stdout to /home/jenkins/workspace/Test_openjdk11_hs_sanity.system_x86-64_linux_testList_2/aqa-tests/TKG/output_17238263044651/PatModImg_Adv_0/20240816-165905-PatModImgTest/results/13.OT8.stdout
[2024-08-16T17:00:04.648Z] STF 17:00:04.167 - Monitoring processes: OT8
[2024-08-16T17:00:05.438Z] OT8 stderr WARNING: module-info.class ignored in patch: /home/jenkins/workspace/Test_openjdk11_hs_sanity.system_x86-64_linux_testList_2/jvmtest/system/aqa-systemtest/openjdk.test.modularity/bin/common-override-new/com.hello
[2024-08-16T17:00:06.227Z] OT8 JUnit version 4.12
[2024-08-16T17:00:06.997Z] OT8 .E
[2024-08-16T17:00:06.997Z] OT8 Time: 0.079
[2024-08-16T17:00:06.997Z] OT8 There was 1 failure:
[2024-08-16T17:00:06.997Z] OT8 1) testPatchingOfNewClassInExistingPackage(net.adoptopenjdk.test.modularity.junit.TestOverrideUsingUnexportedPublicType)
[2024-08-16T17:00:06.997Z] OT8 java.lang.IllegalAccessException: class net.adoptopenjdk.test.modularity.junit.TestOverrideUsingUnexportedPublicType (in module com.test) cannot access class adoptopenjdk.test.modularity.newpkg.NewClass2 (in module com.hello) because module com.hello does not export adoptopenjdk.test.modularity.newpkg to module com.test
[2024-08-16T17:00:06.997Z] OT8 at java.base/jdk.internal.reflect.Reflection.newIllegalAccessException(Reflection.java:361)
[2024-08-16T17:00:06.997Z] OT8 at java.base/java.lang.reflect.AccessibleObject.checkAccess(AccessibleObject.java:591)
[2024-08-16T17:00:06.997Z] OT8 at java.base/java.lang.reflect.Constructor.newInstance(Constructor.java:481)
[2024-08-16T17:00:06.997Z] OT8 at com.test/net.adoptopenjdk.test.modularity.junit.TestOverrideUsingUnexportedPublicType.testPatchingOfNewClassInExistingPackage(TestOverrideUsingUnexportedPublicType.java:34)
[2024-08-16T17:00:06.997Z] OT8 at java.base/jdk.internal.reflect.NativeMethodAccessorImpl.invoke0(Native Method)
[2024-08-16T17:00:06.997Z] OT8 at java.base/jdk.internal.reflect.NativeMethodAccessorImpl.invoke(NativeMethodAccessorImpl.java:62)
[2024-08-16T17:00:06.998Z] OT8 at java.base/jdk.internal.reflect.DelegatingMethodAccessorImpl.invoke(DelegatingMethodAccessorImpl.java:43)
[2024-08-16T17:00:06.998Z] OT8 at java.base/java.lang.reflect.Method.invoke(Method.java:566)
[2024-08-16T17:00:06.998Z] OT8 at org.junit.runners.model.FrameworkMethod$1.runReflectiveCall(FrameworkMethod.java:50)
[2024-08-16T17:00:06.998Z] OT8 at org.junit.internal.runners.model.ReflectiveCallable.run(ReflectiveCallable.java:12)
[2024-08-16T17:00:06.998Z] OT8 at org.junit.runners.model.FrameworkMethod.invokeExplosively(FrameworkMethod.java:47)
[2024-08-16T17:00:06.998Z] OT8 at org.junit.internal.runners.statements.InvokeMethod.evaluate(InvokeMethod.java:17)
[2024-08-16T17:00:06.998Z] OT8 at org.junit.runners.ParentRunner.runLeaf(ParentRunner.java:325)
[2024-08-16T17:00:06.998Z] OT8 at org.junit.runners.BlockJUnit4ClassRunner.runChild(BlockJUnit4ClassRunner.java:78)
[2024-08-16T17:00:06.998Z] OT8 at org.junit.runners.BlockJUnit4ClassRunner.runChild(BlockJUnit4ClassRunner.java:57)
[2024-08-16T17:00:06.998Z] OT8 at org.junit.runners.ParentRunner$3.run(ParentRunner.java:290)
[2024-08-16T17:00:06.998Z] OT8 at org.junit.runners.ParentRunner$1.schedule(ParentRunner.java:71)
[2024-08-16T17:00:06.998Z] OT8 at org.junit.runners.ParentRunner.runChildren(ParentRunner.java:288)
[2024-08-16T17:00:06.998Z] OT8 at org.junit.runners.ParentRunner.access$000(ParentRunner.java:58)
[2024-08-16T17:00:06.998Z] OT8 at org.junit.runners.ParentRunner$2.evaluate(ParentRunner.java:268)
[2024-08-16T17:00:06.998Z] OT8 at org.junit.runners.ParentRunner.run(ParentRunner.java:363)
[2024-08-16T17:00:06.998Z] OT8 at org.junit.runners.Suite.runChild(Suite.java:128)
[2024-08-16T17:00:06.998Z] OT8 at org.junit.runners.Suite.runChild(Suite.java:27)
[2024-08-16T17:00:06.998Z] OT8 at org.junit.runners.ParentRunner$3.run(ParentRunner.java:290)
[2024-08-16T17:00:06.998Z] OT8 at org.junit.runners.ParentRunner$1.schedule(ParentRunner.java:71)
[2024-08-16T17:00:06.998Z] OT8 at org.junit.runners.ParentRunner.runChildren(ParentRunner.java:288)
[2024-08-16T17:00:06.998Z] OT8 at org.junit.runners.ParentRunner.access$000(ParentRunner.java:58)
[2024-08-16T17:00:06.998Z] OT8 at org.junit.runners.ParentRunner$2.evaluate(ParentRunner.java:268)
[2024-08-16T17:00:06.998Z] OT8 at org.junit.runners.ParentRunner.run(ParentRunner.java:363)
[2024-08-16T17:00:06.998Z] OT8 at org.junit.runner.JUnitCore.run(JUnitCore.java:137)
[2024-08-16T17:00:06.998Z] OT8 at org.junit.runner.JUnitCore.run(JUnitCore.java:115)
[2024-08-16T17:00:06.998Z] OT8 at org.junit.runner.JUnitCore.runMain(JUnitCore.java:77)
[2024-08-16T17:00:06.998Z] OT8 at org.junit.runner.JUnitCore.main(JUnitCore.java:36)
[2024-08-16T17:00:06.998Z] OT8
[2024-08-16T17:00:06.998Z] OT8 FAILURES!!!
[2024-08-16T17:00:06.998Z] OT8 Tests run: 1, Failures: 1
[2024-08-16T17:00:06.998Z] OT8
[2024-08-16T17:00:06.998Z] STF 17:00:06.606 - Monitoring Report Summary:
[2024-08-16T17:00:06.998Z] STF 17:00:06.606 - o Process OT8 ended with the expected exit code (1)
[2024-08-16T17:00:06.998Z] STF 17:00:06.606 -
[2024-08-16T17:00:06.998Z] STF 17:00:06.606 - +------ Step 14 - Check output
[2024-08-16T17:00:06.998Z] STF 17:00:06.606 - | Count file matches
[2024-08-16T17:00:06.998Z] STF 17:00:06.606 - | TargetFile: /home/jenkins/workspace/Test_openjdk11_hs_sanity.system_x86-64_linux_testList_2/aqa-tests/TKG/output_17238263044651/PatModImg_Adv_0/20240816-165905-PatModImgTest/results/13.OT8.stdout
[2024-08-16T17:00:06.998Z] STF 17:00:06.606 - | ExpectedNumMatches: 1
[2024-08-16T17:00:06.998Z] STF 17:00:06.606 - | SearchStrings: ["java.lang.IllegalAccessException"]
[2024-08-16T17:00:06.998Z] STF 17:00:06.606 - |
[2024-08-16T17:00:06.998Z] STF 17:00:06.606 - Found 1 instances of ["java.lang.IllegalAccessException"]
[2024-08-16T17:00:06.998Z] STF 17:00:06.606 - EXECUTE stage completed
[2024-08-16T17:00:07.791Z] STF 17:00:07.059 -
[2024-08-16T17:00:07.791Z] STF 17:00:07.059 - ==================== T E A R D O W N ====================
[2024-08-16T17:00:07.792Z] STF 17:00:07.059 - Running teardown: perl /home/jenkins/workspace/Test_openjdk11_hs_sanity.system_x86-64_linux_testList_2/aqa-tests/TKG/../TKG/output_17238263044651/PatModImg_Adv_0/20240816-165905-PatModImgTest/tearDown.pl
[2024-08-16T17:00:07.792Z] STF 17:00:07.459 - TEARDOWN stage completed
[2024-08-16T17:00:07.792Z] STF 17:00:07.468 -
[2024-08-16T17:00:07.792Z] STF 17:00:07.469 - ===================== R E S U L T S =====================
[2024-08-16T17:00:07.792Z] STF 17:00:07.469 - Stage results:
[2024-08-16T17:00:07.792Z] STF 17:00:07.469 - setUp: pass
[2024-08-16T17:00:07.792Z] STF 17:00:07.469 - execute: pass
[2024-08-16T17:00:07.792Z] STF 17:00:07.469 - teardown: pass
[2024-08-16T17:00:07.792Z] STF 17:00:07.469 -
[2024-08-16T17:00:07.792Z] STF 17:00:07.469 - Overall result: PASSED
[2024-08-16T17:00:07.792Z] -----------------------------------
[2024-08-16T17:00:07.792Z] PatModImg_Adv_0_PASSED
[2024-08-16T17:00:07.792Z] -----------------------------------
[2024-08-16T17:00:07.792Z]
[2024-08-16T17:00:07.792Z] TEST TEARDOWN:
[2024-08-16T17:00:07.792Z] Nothing to be done for teardown.
[2024-08-16T17:00:08.567Z] PatModImg_Adv_0 Finish Time: Fri Aug 16 17:00:07 2024 Epoch Time (ms): 1723827607737