PatMod_Unex_1
[2024-08-16T21:00:06.028Z] Running test PatMod_Unex_1 ...
[2024-08-16T21:00:06.028Z] ===============================================
[2024-08-16T21:00:06.446Z] PatMod_Unex_1 Start Time: Fri Aug 16 14:00:05 2024 Epoch Time (ms): 1723842005572
[2024-08-16T21:00:06.446Z] variation: Mode650
[2024-08-16T21:00:06.446Z] JVM_OPTIONS: -XX:-UseCompressedOops
[2024-08-16T21:00:06.446Z] { \
[2024-08-16T21:00:06.446Z] echo ""; echo "TEST SETUP:"; \
[2024-08-16T21:00:06.446Z] echo "Nothing to be done for setup."; \
[2024-08-16T21:00:06.446Z] mkdir -p "/Users/admin/workspace/workspace/Test_openjdk21_hs_sanity.system_x86-64_mac_testList_2/aqa-tests/TKG/../TKG/output_17238414279401/PatMod_Unex_1"; \
[2024-08-16T21:00:06.446Z] cd "/Users/admin/workspace/workspace/Test_openjdk21_hs_sanity.system_x86-64_mac_testList_2/aqa-tests/TKG/../TKG/output_17238414279401/PatMod_Unex_1"; \
[2024-08-16T21:00:06.446Z] echo ""; echo "TESTING:"; \
[2024-08-16T21:00:06.446Z] perl /Users/admin/workspace/workspace/Test_openjdk21_hs_sanity.system_x86-64_mac_testList_2/aqa-tests/TKG/../../jvmtest/system/modularity/..//STF/stf.core/scripts/stf.pl -test-root="/Users/admin/workspace/workspace/Test_openjdk21_hs_sanity.system_x86-64_mac_testList_2/aqa-tests/TKG/../../jvmtest/system/modularity/..//STF;/Users/admin/workspace/workspace/Test_openjdk21_hs_sanity.system_x86-64_mac_testList_2/aqa-tests/TKG/../../jvmtest/system/modularity/..//aqa-systemtest""" -systemtest-prereqs="/Users/admin/workspace/workspace/Test_openjdk21_hs_sanity.system_x86-64_mac_testList_2/../../testDependency/system_lib/" -java-args=' -XX:-UseCompressedOops ' -results-root="/Users/admin/workspace/workspace/Test_openjdk21_hs_sanity.system_x86-64_mac_testList_2/aqa-tests/TKG/../TKG/output_17238414279401/PatMod_Unex_1" -test=PatModTest -test-args="variant=Unex"; \
[2024-08-16T21:00:06.446Z] if [ $? -eq 0 ]; then echo "-----------------------------------"; echo "PatMod_Unex_1""_PASSED"; echo "-----------------------------------"; cd /Users/admin/workspace/workspace/Test_openjdk21_hs_sanity.system_x86-64_mac_testList_2/aqa-tests/TKG/..; rm -f -r "/Users/admin/workspace/workspace/Test_openjdk21_hs_sanity.system_x86-64_mac_testList_2/aqa-tests/TKG/../TKG/output_17238414279401/PatMod_Unex_1"; else echo "-----------------------------------"; echo "PatMod_Unex_1""_FAILED"; echo "-----------------------------------"; fi; \
[2024-08-16T21:00:06.446Z] echo ""; echo "TEST TEARDOWN:"; \
[2024-08-16T21:00:06.446Z] echo "Nothing to be done for teardown."; \
[2024-08-16T21:00:06.446Z] } 2>&1 | tee -a "/Users/admin/workspace/workspace/Test_openjdk21_hs_sanity.system_x86-64_mac_testList_2/aqa-tests/TKG/../TKG/output_17238414279401/TestTargetResult";
[2024-08-16T21:00:06.446Z]
[2024-08-16T21:00:06.446Z] TEST SETUP:
[2024-08-16T21:00:06.446Z] Nothing to be done for setup.
[2024-08-16T21:00:06.446Z]
[2024-08-16T21:00:06.446Z] TESTING:
[2024-08-16T21:00:06.446Z] STF 14:00:05.808 - ========================= S T F =========================
[2024-08-16T21:00:06.446Z] systemtest-prereqs has been processed, and set to: /Users/admin/workspace/testDependency/system_libRetrieving amount of free space on drive containing /Users/admin/workspace/workspace/Test_openjdk21_hs_sanity.system_x86-64_mac_testList_2/aqa-tests/TKG/../TKG/output_17238414279401/PatMod_Unex_1
[2024-08-16T21:00:06.446Z] There is 10639 Mb free
[2024-08-16T21:00:06.446Z] STF 14:00:05.852 - ================== G E N E R A T I O N ==================
[2024-08-16T21:00:06.446Z] STF 14:00:05.854 - Checking JVM: /Users/admin/workspace/workspace/Test_openjdk21_hs_sanity.system_x86-64_mac_testList_2/jdkbinary/j2sdk-image/Contents/Home/bin/../
[2024-08-16T21:00:06.446Z] STF 14:00:05.854 - Starting process to generate scripts: /Users/admin/workspace/workspace/Test_openjdk21_hs_sanity.system_x86-64_mac_testList_2/jdkbinary/j2sdk-image/Contents/Home/bin/..//bin/java -Dlog4j.skipJansi=true -Djava.system.class.loader=net.adoptopenjdk.stf.runner.StfClassLoader -classpath /Users/admin/workspace/workspace/Test_openjdk21_hs_sanity.system_x86-64_mac_testList_2/../../testDependency/system_lib//log4j/log4j-api.jar:/Users/admin/workspace/workspace/Test_openjdk21_hs_sanity.system_x86-64_mac_testList_2/../../testDependency/system_lib//log4j/log4j-core.jar:/Users/admin/workspace/workspace/Test_openjdk21_hs_sanity.system_x86-64_mac_testList_2/jvmtest/system/STF/stf.core/scripts/../bin net.adoptopenjdk.stf.runner.StfRunner -properties "/Users/admin/workspace/workspace/Test_openjdk21_hs_sanity.system_x86-64_mac_testList_2/aqa-tests/TKG/../TKG/output_17238414279401/PatMod_Unex_1/20240816-140005-PatModTest/stf_parameters.properties, , /Users/admin/workspace/workspace/Test_openjdk21_hs_sanity.system_x86-64_mac_testList_2/jvmtest/system/STF/stf.core/config/stf.properties" -testDir "/Users/admin/workspace/workspace/Test_openjdk21_hs_sanity.system_x86-64_mac_testList_2/aqa-tests/TKG/../TKG/output_17238414279401/PatMod_Unex_1/20240816-140005-PatModTest"
[2024-08-16T21:00:06.972Z] GEN stderr Picked up JAVA_TOOL_OPTIONS: -Djava.security.manager=allow
[2024-08-16T21:00:10.881Z] GEN 14:00:09.640 - Found test. Project: 'openjdk.test.modularity' class: 'PatModTest.class' Dir: '/Users/admin/workspace/workspace/Test_openjdk21_hs_sanity.system_x86-64_mac_testList_2/jvmtest/system/aqa-systemtest/openjdk.test.modularity/bin'
[2024-08-16T21:00:10.881Z] GEN 14:00:09.664 - Found test. Project: 'openjdk.test.modularity' class: 'net.adoptopenjdk.test.modularity.PatModTest'
[2024-08-16T21:00:10.881Z] GEN Classpath directories used by project 'openjdk.test.modularity':
[2024-08-16T21:00:10.881Z] GEN /Users/admin/workspace/workspace/Test_openjdk21_hs_sanity.system_x86-64_mac_testList_2/jvmtest/system/aqa-systemtest/openjdk.test.modularity/bin/common-mods/displayService
[2024-08-16T21:00:10.881Z] GEN /Users/admin/workspace/workspace/Test_openjdk21_hs_sanity.system_x86-64_mac_testList_2/jvmtest/system/aqa-systemtest/openjdk.test.modularity/bin/common-mods/com.helper
[2024-08-16T21:00:10.881Z] GEN /Users/admin/workspace/workspace/Test_openjdk21_hs_sanity.system_x86-64_mac_testList_2/jvmtest/system/aqa-systemtest/openjdk.test.modularity/bin/common-mods/displayServiceImpl1
[2024-08-16T21:00:10.881Z] GEN /Users/admin/workspace/workspace/Test_openjdk21_hs_sanity.system_x86-64_mac_testList_2/jvmtest/system/aqa-systemtest/openjdk.test.modularity/bin/common-mods/com.discreet
[2024-08-16T21:00:10.881Z] GEN /Users/admin/workspace/workspace/Test_openjdk21_hs_sanity.system_x86-64_mac_testList_2/jvmtest/system/aqa-systemtest/openjdk.test.modularity/bin/common-mods/com.hello
[2024-08-16T21:00:10.881Z] GEN /Users/admin/workspace/workspace/Test_openjdk21_hs_sanity.system_x86-64_mac_testList_2/jvmtest/system/aqa-systemtest/openjdk.test.modularity/bin/common-mods/com.hola
[2024-08-16T21:00:10.881Z] GEN /Users/admin/workspace/workspace/Test_openjdk21_hs_sanity.system_x86-64_mac_testList_2/jvmtest/system/aqa-systemtest/openjdk.test.modularity/bin/common-mods/displayServiceImpl2
[2024-08-16T21:00:10.881Z] GEN /Users/admin/workspace/workspace/Test_openjdk21_hs_sanity.system_x86-64_mac_testList_2/jvmtest/system/aqa-systemtest/openjdk.test.modularity/bin/common-mods/com.hi
[2024-08-16T21:00:10.881Z] GEN /Users/admin/workspace/workspace/Test_openjdk21_hs_sanity.system_x86-64_mac_testList_2/jvmtest/system/aqa-systemtest/openjdk.test.modularity/bin/common-override
[2024-08-16T21:00:10.882Z] GEN /Users/admin/workspace/workspace/Test_openjdk21_hs_sanity.system_x86-64_mac_testList_2/jvmtest/system/aqa-systemtest/openjdk.test.modularity/bin/common-override-new
[2024-08-16T21:00:10.882Z] GEN /Users/admin/workspace/workspace/Test_openjdk21_hs_sanity.system_x86-64_mac_testList_2/jvmtest/system/aqa-systemtest/openjdk.test.modularity/bin/common/displayServiceImpl3
[2024-08-16T21:00:10.882Z] GEN /Users/admin/workspace/workspace/Test_openjdk21_hs_sanity.system_x86-64_mac_testList_2/jvmtest/system/aqa-systemtest/openjdk.test.modularity/bin/common/displayServiceImpl4
[2024-08-16T21:00:10.882Z] GEN /Users/admin/workspace/workspace/Test_openjdk21_hs_sanity.system_x86-64_mac_testList_2/jvmtest/system/aqa-systemtest/openjdk.test.modularity/bin/common
[2024-08-16T21:00:10.882Z] GEN /Users/admin/workspace/workspace/Test_openjdk21_hs_sanity.system_x86-64_mac_testList_2/jvmtest/system/aqa-systemtest/openjdk.test.modularity/bin/tests
[2024-08-16T21:00:10.882Z] GEN /Users/admin/workspace/workspace/Test_openjdk21_hs_sanity.system_x86-64_mac_testList_2/jvmtest/system/aqa-systemtest/openjdk.test.modularity/bin
[2024-08-16T21:00:10.882Z] GEN /Users/admin/workspace/workspace/Test_openjdk21_hs_sanity.system_x86-64_mac_testList_2/jvmtest/system/STF/stf.core/bin
[2024-08-16T21:00:10.882Z] GEN /Users/admin/workspace/testDependency/system_lib/log4j/log4j-api.jar
[2024-08-16T21:00:10.882Z] GEN /Users/admin/workspace/testDependency/system_lib/log4j/log4j-core.jar
[2024-08-16T21:00:10.882Z] GEN /Users/admin/workspace/testDependency/system_lib/junit/junit.jar
[2024-08-16T21:00:10.882Z] GEN 14:00:10.295 - Using Mode NoOptions. Values = ''
[2024-08-16T21:00:11.457Z] GEN 14:00:10.771 -
[2024-08-16T21:00:11.457Z] GEN 14:00:10.771 - Test command summary:
[2024-08-16T21:00:11.457Z] GEN 14:00:10.781 - Step Stage Command Description
[2024-08-16T21:00:11.457Z] GEN 14:00:10.782 - -----+--------+-----------------+------------
[2024-08-16T21:00:11.457Z] GEN 14:00:10.782 - 1 execute jar Create com.hello jar
[2024-08-16T21:00:11.457Z] GEN 14:00:10.783 - 2 execute jar Create com.discreet jar
[2024-08-16T21:00:11.457Z] GEN 14:00:10.783 - 3 execute jar create java.xml.jar
[2024-08-16T21:00:11.457Z] GEN 14:00:10.783 - 4 execute Run java (Negative test) Include a new package that is not exported and ensure the public type cannot be accessed
[2024-08-16T21:00:11.457Z] GEN 14:00:10.784 - 5 execute count Check output
[2024-08-16T21:00:11.457Z] GEN 14:00:10.784 - 6 execute Run java Include a new package that is not exported and check if the public type can be accessed by adding --add-exports
[2024-08-16T21:00:11.958Z] STF 14:00:11.017 -
[2024-08-16T21:00:11.958Z] STF 14:00:11.017 - Script generation completed
[2024-08-16T21:00:11.958Z] STF 14:00:11.017 -
[2024-08-16T21:00:11.958Z] STF 14:00:11.021 -
[2024-08-16T21:00:11.958Z] STF 14:00:11.022 - ======================= S E T U P =======================
[2024-08-16T21:00:11.958Z] STF 14:00:11.022 - Running setup: perl /Users/admin/workspace/workspace/Test_openjdk21_hs_sanity.system_x86-64_mac_testList_2/aqa-tests/TKG/../TKG/output_17238414279401/PatMod_Unex_1/20240816-140005-PatModTest/setUp.pl
[2024-08-16T21:00:12.594Z] STF 14:00:11.697 - SETUP stage completed
[2024-08-16T21:00:12.594Z] STF 14:00:11.820 -
[2024-08-16T21:00:12.594Z] STF 14:00:11.821 - ==================== E X E C U T E - ====================
[2024-08-16T21:00:12.594Z] STF 14:00:11.821 - Running execute: perl /Users/admin/workspace/workspace/Test_openjdk21_hs_sanity.system_x86-64_mac_testList_2/aqa-tests/TKG/../TKG/output_17238414279401/PatMod_Unex_1/20240816-140005-PatModTest/execute.pl
[2024-08-16T21:00:13.030Z] STF 14:00:12.311 -
[2024-08-16T21:00:13.030Z] STF 14:00:12.311 - Java version
[2024-08-16T21:00:13.030Z] STF 14:00:12.311 - Running: /Users/admin/workspace/workspace/Test_openjdk21_hs_sanity.system_x86-64_mac_testList_2/jdkbinary/j2sdk-image/Contents/Home/bin/java -version
[2024-08-16T21:00:13.030Z] Picked up JAVA_TOOL_OPTIONS: -Djava.security.manager=allow
[2024-08-16T21:00:13.547Z] openjdk version "21.0.5-beta" 2024-10-15
[2024-08-16T21:00:13.547Z] OpenJDK Runtime Environment Temurin-21.0.5+3-202408161501 (build 21.0.5-beta+3-ea)
[2024-08-16T21:00:13.547Z] OpenJDK 64-Bit Server VM Temurin-21.0.5+3-202408161501 (build 21.0.5-beta+3-ea, mixed mode)
[2024-08-16T21:00:13.547Z] STF 14:00:12.612 -
[2024-08-16T21:00:13.547Z] STF 14:00:12.612 - +------ Step 1 - Create com.hello jar
[2024-08-16T21:00:13.547Z] STF 14:00:12.612 - | Create modular jar
[2024-08-16T21:00:13.547Z] STF 14:00:12.612 - | ModuleSpec: openjdk.test.modularity/bin/common-override/com.hello
[2024-08-16T21:00:13.547Z] STF 14:00:12.612 - | ModuleVersion: null
[2024-08-16T21:00:13.547Z] STF 14:00:12.612 - | MainClass: null
[2024-08-16T21:00:13.547Z] STF 14:00:12.612 - | HashModules: null
[2024-08-16T21:00:13.547Z] STF 14:00:12.612 - |
[2024-08-16T21:00:13.547Z] STF 14:00:12.613 - Running command: /Users/admin/workspace/workspace/Test_openjdk21_hs_sanity.system_x86-64_mac_testList_2/jdkbinary/j2sdk-image/Contents/Home/bin/jar --create --file /Users/admin/workspace/workspace/Test_openjdk21_hs_sanity.system_x86-64_mac_testList_2/aqa-tests/TKG/output_17238414279401/PatMod_Unex_1/20240816-140005-PatModTest/modules/1.com.hello.jar -C /Users/admin/workspace/workspace/Test_openjdk21_hs_sanity.system_x86-64_mac_testList_2/jvmtest/system/aqa-systemtest/openjdk.test.modularity/bin/common-override/com.hello .
[2024-08-16T21:00:13.547Z] STF 14:00:12.613 - Redirecting stderr to /Users/admin/workspace/workspace/Test_openjdk21_hs_sanity.system_x86-64_mac_testList_2/aqa-tests/TKG/output_17238414279401/PatMod_Unex_1/20240816-140005-PatModTest/results/1.CMJ.stderr
[2024-08-16T21:00:13.547Z] STF 14:00:12.613 - Redirecting stdout to /Users/admin/workspace/workspace/Test_openjdk21_hs_sanity.system_x86-64_mac_testList_2/aqa-tests/TKG/output_17238414279401/PatMod_Unex_1/20240816-140005-PatModTest/results/1.CMJ.stdout
[2024-08-16T21:00:13.547Z] STF 14:00:12.669 - Monitoring processes: CMJ
[2024-08-16T21:00:13.548Z] CMJ stderr Picked up JAVA_TOOL_OPTIONS: -Djava.security.manager=allow
[2024-08-16T21:00:15.692Z] STF 14:00:14.804 - Monitoring Report Summary:
[2024-08-16T21:00:15.692Z] STF 14:00:14.804 - o Process CMJ ended with the expected exit code (0)
[2024-08-16T21:00:15.692Z] STF 14:00:14.804 - Created modular jar: 1.com.hello.jar
[2024-08-16T21:00:15.692Z] STF 14:00:14.804 -
[2024-08-16T21:00:15.692Z] STF 14:00:14.804 - +------ Step 2 - Create com.discreet jar
[2024-08-16T21:00:15.692Z] STF 14:00:14.804 - | Create modular jar
[2024-08-16T21:00:15.692Z] STF 14:00:14.804 - | ModuleSpec: openjdk.test.modularity/bin/common-override/com.discreet
[2024-08-16T21:00:15.692Z] STF 14:00:14.804 - | ModuleVersion: null
[2024-08-16T21:00:15.692Z] STF 14:00:14.804 - | MainClass: null
[2024-08-16T21:00:15.692Z] STF 14:00:14.804 - | HashModules: null
[2024-08-16T21:00:15.692Z] STF 14:00:14.804 - |
[2024-08-16T21:00:15.692Z] STF 14:00:14.805 - Running command: /Users/admin/workspace/workspace/Test_openjdk21_hs_sanity.system_x86-64_mac_testList_2/jdkbinary/j2sdk-image/Contents/Home/bin/jar --create --file /Users/admin/workspace/workspace/Test_openjdk21_hs_sanity.system_x86-64_mac_testList_2/aqa-tests/TKG/output_17238414279401/PatMod_Unex_1/20240816-140005-PatModTest/modules/2.com.discreet.jar -C /Users/admin/workspace/workspace/Test_openjdk21_hs_sanity.system_x86-64_mac_testList_2/jvmtest/system/aqa-systemtest/openjdk.test.modularity/bin/common-override/com.discreet .
[2024-08-16T21:00:15.692Z] STF 14:00:14.805 - Redirecting stderr to /Users/admin/workspace/workspace/Test_openjdk21_hs_sanity.system_x86-64_mac_testList_2/aqa-tests/TKG/output_17238414279401/PatMod_Unex_1/20240816-140005-PatModTest/results/2.CMJ.stderr
[2024-08-16T21:00:15.692Z] STF 14:00:14.805 - Redirecting stdout to /Users/admin/workspace/workspace/Test_openjdk21_hs_sanity.system_x86-64_mac_testList_2/aqa-tests/TKG/output_17238414279401/PatMod_Unex_1/20240816-140005-PatModTest/results/2.CMJ.stdout
[2024-08-16T21:00:15.692Z] STF 14:00:14.810 - Monitoring processes: CMJ
[2024-08-16T21:00:15.692Z] CMJ stderr Picked up JAVA_TOOL_OPTIONS: -Djava.security.manager=allow
[2024-08-16T21:00:16.689Z] STF 14:00:15.800 - Monitoring Report Summary:
[2024-08-16T21:00:16.689Z] STF 14:00:15.800 - o Process CMJ ended with the expected exit code (0)
[2024-08-16T21:00:16.690Z] STF 14:00:15.800 - Created modular jar: 2.com.discreet.jar
[2024-08-16T21:00:16.690Z] STF 14:00:15.800 -
[2024-08-16T21:00:16.690Z] STF 14:00:15.800 - +------ Step 3 - create java.xml.jar
[2024-08-16T21:00:16.690Z] STF 14:00:15.800 - | Create modular jar
[2024-08-16T21:00:16.690Z] STF 14:00:15.800 - | ModuleSpec: openjdk.test.modularity/bin/common-override/java.xml
[2024-08-16T21:00:16.690Z] STF 14:00:15.800 - | ModuleVersion: null
[2024-08-16T21:00:16.690Z] STF 14:00:15.801 - | MainClass: null
[2024-08-16T21:00:16.690Z] STF 14:00:15.801 - | HashModules: null
[2024-08-16T21:00:16.690Z] STF 14:00:15.801 - |
[2024-08-16T21:00:16.690Z] STF 14:00:15.801 - Running command: /Users/admin/workspace/workspace/Test_openjdk21_hs_sanity.system_x86-64_mac_testList_2/jdkbinary/j2sdk-image/Contents/Home/bin/jar --create --file /Users/admin/workspace/workspace/Test_openjdk21_hs_sanity.system_x86-64_mac_testList_2/aqa-tests/TKG/output_17238414279401/PatMod_Unex_1/20240816-140005-PatModTest/modules/3.java.xml.jar -C /Users/admin/workspace/workspace/Test_openjdk21_hs_sanity.system_x86-64_mac_testList_2/jvmtest/system/aqa-systemtest/openjdk.test.modularity/bin/common-override/java.xml .
[2024-08-16T21:00:16.690Z] STF 14:00:15.801 - Redirecting stderr to /Users/admin/workspace/workspace/Test_openjdk21_hs_sanity.system_x86-64_mac_testList_2/aqa-tests/TKG/output_17238414279401/PatMod_Unex_1/20240816-140005-PatModTest/results/3.CMJ.stderr
[2024-08-16T21:00:16.690Z] STF 14:00:15.801 - Redirecting stdout to /Users/admin/workspace/workspace/Test_openjdk21_hs_sanity.system_x86-64_mac_testList_2/aqa-tests/TKG/output_17238414279401/PatMod_Unex_1/20240816-140005-PatModTest/results/3.CMJ.stdout
[2024-08-16T21:00:16.690Z] STF 14:00:15.818 - Monitoring processes: CMJ
[2024-08-16T21:00:16.690Z] CMJ stderr Picked up JAVA_TOOL_OPTIONS: -Djava.security.manager=allow
[2024-08-16T21:00:18.822Z] STF 14:00:18.230 - Monitoring Report Summary:
[2024-08-16T21:00:18.822Z] STF 14:00:18.230 - o Process CMJ ended with the expected exit code (0)
[2024-08-16T21:00:18.822Z] STF 14:00:18.230 - Created modular jar: 3.java.xml.jar
[2024-08-16T21:00:18.822Z] STF 14:00:18.230 -
[2024-08-16T21:00:18.822Z] STF 14:00:18.230 - +------ Step 4 - (Negative test) Include a new package that is not exported and ensure the public type cannot be accessed
[2024-08-16T21:00:18.822Z] STF 14:00:18.230 - | Run foreground process
[2024-08-16T21:00:18.822Z] STF 14:00:18.230 - | Program: /Users/admin/workspace/workspace/Test_openjdk21_hs_sanity.system_x86-64_mac_testList_2/jdkbinary/j2sdk-image/Contents/Home/bin/java
[2024-08-16T21:00:18.822Z] STF 14:00:18.230 - | Mnemonic: OT3
[2024-08-16T21:00:18.822Z] STF 14:00:18.230 - | Echo: ECHO_ON
[2024-08-16T21:00:18.822Z] STF 14:00:18.230 - | Expectation: NON_ZERO_EXIT [1] within 1m
[2024-08-16T21:00:18.822Z] STF 14:00:18.230 - |
[2024-08-16T21:00:18.822Z] STF 14:00:18.231 - Running command: /Users/admin/workspace/workspace/Test_openjdk21_hs_sanity.system_x86-64_mac_testList_2/jdkbinary/j2sdk-image/Contents/Home/bin/java --add-reads com.test=ALL-UNNAMED --module-path /Users/admin/workspace/workspace/Test_openjdk21_hs_sanity.system_x86-64_mac_testList_2/jvmtest/system/aqa-systemtest/openjdk.test.modularity/bin/common-mods:/Users/admin/workspace/workspace/Test_openjdk21_hs_sanity.system_x86-64_mac_testList_2/jvmtest/system/aqa-systemtest/openjdk.test.modularity/bin/tests --add-modules=com.test --patch-module com.hello=/Users/admin/workspace/workspace/Test_openjdk21_hs_sanity.system_x86-64_mac_testList_2/aqa-tests/TKG/output_17238414279401/PatMod_Unex_1/20240816-140005-PatModTest/modules/1.com.hello.jar -XX:-UseCompressedOops -classpath /Users/admin/workspace/testDependency/system_lib/junit/junit.jar:/Users/admin/workspace/testDependency/system_lib/junit/hamcrest-core.jar org.junit.runner.JUnitCore net.adoptopenjdk.test.modularity.junit.TestOverrideUsingAppModuleAndNewPackage
[2024-08-16T21:00:18.822Z] STF 14:00:18.231 - Redirecting stderr to /Users/admin/workspace/workspace/Test_openjdk21_hs_sanity.system_x86-64_mac_testList_2/aqa-tests/TKG/output_17238414279401/PatMod_Unex_1/20240816-140005-PatModTest/results/4.OT3.stderr
[2024-08-16T21:00:18.822Z] STF 14:00:18.231 - Redirecting stdout to /Users/admin/workspace/workspace/Test_openjdk21_hs_sanity.system_x86-64_mac_testList_2/aqa-tests/TKG/output_17238414279401/PatMod_Unex_1/20240816-140005-PatModTest/results/4.OT3.stdout
[2024-08-16T21:00:18.822Z] STF 14:00:18.258 - Monitoring processes: OT3
[2024-08-16T21:00:19.275Z] OT3 stderr Picked up JAVA_TOOL_OPTIONS: -Djava.security.manager=allow
[2024-08-16T21:00:19.275Z] OT3 stderr WARNING: module-info.class ignored in patch: /Users/admin/workspace/workspace/Test_openjdk21_hs_sanity.system_x86-64_mac_testList_2/aqa-tests/TKG/output_17238414279401/PatMod_Unex_1/20240816-140005-PatModTest/modules/1.com.hello.jar
[2024-08-16T21:00:19.728Z] OT3 JUnit version 4.12
[2024-08-16T21:00:19.728Z] OT3 .E
[2024-08-16T21:00:19.728Z] OT3 Time: 0.017
[2024-08-16T21:00:19.728Z] OT3 There was 1 failure:
[2024-08-16T21:00:19.728Z] OT3 1) testOverrideUsingAppModuleAndNewPackage(net.adoptopenjdk.test.modularity.junit.TestOverrideUsingAppModuleAndNewPackage)
[2024-08-16T21:00:19.728Z] OT3 java.lang.IllegalAccessException: class net.adoptopenjdk.test.modularity.junit.TestOverrideUsingAppModuleAndNewPackage (in module com.test) cannot access class adoptopenjdk.test.modularity.hellonew.HelloNew (in module com.hello) because module com.hello does not export adoptopenjdk.test.modularity.hellonew to module com.test
[2024-08-16T21:00:19.728Z] OT3 at java.base/jdk.internal.reflect.Reflection.newIllegalAccessException(Reflection.java:394)
[2024-08-16T21:00:19.728Z] OT3 at java.base/java.lang.reflect.AccessibleObject.checkAccess(AccessibleObject.java:714)
[2024-08-16T21:00:19.728Z] OT3 at java.base/java.lang.reflect.Constructor.newInstanceWithCaller(Constructor.java:495)
[2024-08-16T21:00:19.728Z] OT3 at java.base/java.lang.reflect.Constructor.newInstance(Constructor.java:486)
[2024-08-16T21:00:19.728Z] OT3 at com.test/net.adoptopenjdk.test.modularity.junit.TestOverrideUsingAppModuleAndNewPackage.testOverrideUsingAppModuleAndNewPackage(TestOverrideUsingAppModuleAndNewPackage.java:31)
[2024-08-16T21:00:19.728Z] OT3 at java.base/jdk.internal.reflect.DirectMethodHandleAccessor.invoke(DirectMethodHandleAccessor.java:103)
[2024-08-16T21:00:19.728Z] OT3 at java.base/java.lang.reflect.Method.invoke(Method.java:580)
[2024-08-16T21:00:19.728Z] OT3 at org.junit.runners.model.FrameworkMethod$1.runReflectiveCall(FrameworkMethod.java:50)
[2024-08-16T21:00:19.728Z] OT3 at org.junit.internal.runners.model.ReflectiveCallable.run(ReflectiveCallable.java:12)
[2024-08-16T21:00:19.728Z] OT3 at org.junit.runners.model.FrameworkMethod.invokeExplosively(FrameworkMethod.java:47)
[2024-08-16T21:00:19.728Z] OT3 at org.junit.internal.runners.statements.InvokeMethod.evaluate(InvokeMethod.java:17)
[2024-08-16T21:00:19.728Z] OT3 at org.junit.runners.ParentRunner.runLeaf(ParentRunner.java:325)
[2024-08-16T21:00:19.728Z] OT3 at org.junit.runners.BlockJUnit4ClassRunner.runChild(BlockJUnit4ClassRunner.java:78)
[2024-08-16T21:00:19.728Z] OT3 at org.junit.runners.BlockJUnit4ClassRunner.runChild(BlockJUnit4ClassRunner.java:57)
[2024-08-16T21:00:19.728Z] OT3 at org.junit.runners.ParentRunner$3.run(ParentRunner.java:290)
[2024-08-16T21:00:19.728Z] OT3 at org.junit.runners.ParentRunner$1.schedule(ParentRunner.java:71)
[2024-08-16T21:00:19.728Z] OT3 at org.junit.runners.ParentRunner.runChildren(ParentRunner.java:288)
[2024-08-16T21:00:19.728Z] OT3 at org.junit.runners.ParentRunner.access$000(ParentRunner.java:58)
[2024-08-16T21:00:19.728Z] OT3 at org.junit.runners.ParentRunner$2.evaluate(ParentRunner.java:268)
[2024-08-16T21:00:19.728Z] OT3 at org.junit.runners.ParentRunner.run(ParentRunner.java:363)
[2024-08-16T21:00:19.728Z] OT3 at org.junit.runners.Suite.runChild(Suite.java:128)
[2024-08-16T21:00:19.728Z] OT3 at org.junit.runners.Suite.runChild(Suite.java:27)
[2024-08-16T21:00:19.728Z] OT3 at org.junit.runners.ParentRunner$3.run(ParentRunner.java:290)
[2024-08-16T21:00:19.728Z] OT3 at org.junit.runners.ParentRunner$1.schedule(ParentRunner.java:71)
[2024-08-16T21:00:19.728Z] OT3 at org.junit.runners.ParentRunner.runChildren(ParentRunner.java:288)
[2024-08-16T21:00:19.728Z] OT3 at org.junit.runners.ParentRunner.access$000(ParentRunner.java:58)
[2024-08-16T21:00:19.728Z] OT3 at org.junit.runners.ParentRunner$2.evaluate(ParentRunner.java:268)
[2024-08-16T21:00:19.728Z] OT3 at org.junit.runners.ParentRunner.run(ParentRunner.java:363)
[2024-08-16T21:00:19.728Z] OT3 at org.junit.runner.JUnitCore.run(JUnitCore.java:137)
[2024-08-16T21:00:19.728Z] OT3 at org.junit.runner.JUnitCore.run(JUnitCore.java:115)
[2024-08-16T21:00:19.728Z] OT3 at org.junit.runner.JUnitCore.runMain(JUnitCore.java:77)
[2024-08-16T21:00:19.728Z] OT3 at org.junit.runner.JUnitCore.main(JUnitCore.java:36)
[2024-08-16T21:00:19.728Z] OT3
[2024-08-16T21:00:19.728Z] OT3 FAILURES!!!
[2024-08-16T21:00:19.728Z] OT3 Tests run: 1, Failures: 1
[2024-08-16T21:00:19.728Z] OT3
[2024-08-16T21:00:19.728Z] STF 14:00:18.998 - Monitoring Report Summary:
[2024-08-16T21:00:19.728Z] STF 14:00:18.998 - o Process OT3 ended with the expected exit code (1)
[2024-08-16T21:00:19.728Z] STF 14:00:18.998 -
[2024-08-16T21:00:19.728Z] STF 14:00:18.998 - +------ Step 5 - Check output
[2024-08-16T21:00:19.728Z] STF 14:00:18.998 - | Count file matches
[2024-08-16T21:00:19.728Z] STF 14:00:18.998 - | TargetFile: /Users/admin/workspace/workspace/Test_openjdk21_hs_sanity.system_x86-64_mac_testList_2/aqa-tests/TKG/output_17238414279401/PatMod_Unex_1/20240816-140005-PatModTest/results/4.OT3.stdout
[2024-08-16T21:00:19.728Z] STF 14:00:18.998 - | ExpectedNumMatches: 1
[2024-08-16T21:00:19.728Z] STF 14:00:18.998 - | SearchStrings: ["java.lang.IllegalAccessException"]
[2024-08-16T21:00:19.728Z] STF 14:00:18.998 - |
[2024-08-16T21:00:19.728Z] STF 14:00:19.020 - Found 1 instances of ["java.lang.IllegalAccessException"]
[2024-08-16T21:00:19.728Z] STF 14:00:19.020 -
[2024-08-16T21:00:19.728Z] STF 14:00:19.020 - +------ Step 6 - Include a new package that is not exported and check if the public type can be accessed by adding --add-exports
[2024-08-16T21:00:19.728Z] STF 14:00:19.020 - | Run foreground process
[2024-08-16T21:00:19.728Z] STF 14:00:19.020 - | Program: /Users/admin/workspace/workspace/Test_openjdk21_hs_sanity.system_x86-64_mac_testList_2/jdkbinary/j2sdk-image/Contents/Home/bin/java
[2024-08-16T21:00:19.728Z] STF 14:00:19.020 - | Mnemonic: OT4
[2024-08-16T21:00:19.728Z] STF 14:00:19.020 - | Echo: ECHO_ON
[2024-08-16T21:00:19.728Z] STF 14:00:19.020 - | Expectation: CLEAN_RUN within 1m
[2024-08-16T21:00:19.728Z] STF 14:00:19.020 - |
[2024-08-16T21:00:19.728Z] STF 14:00:19.021 - Running command: /Users/admin/workspace/workspace/Test_openjdk21_hs_sanity.system_x86-64_mac_testList_2/jdkbinary/j2sdk-image/Contents/Home/bin/java --add-reads com.test=ALL-UNNAMED --module-path /Users/admin/workspace/workspace/Test_openjdk21_hs_sanity.system_x86-64_mac_testList_2/jvmtest/system/aqa-systemtest/openjdk.test.modularity/bin/common-mods:/Users/admin/workspace/workspace/Test_openjdk21_hs_sanity.system_x86-64_mac_testList_2/jvmtest/system/aqa-systemtest/openjdk.test.modularity/bin/tests --add-modules=com.test --add-exports com.hello/adoptopenjdk.test.modularity.hellonew=com.test --patch-module com.hello=/Users/admin/workspace/workspace/Test_openjdk21_hs_sanity.system_x86-64_mac_testList_2/aqa-tests/TKG/output_17238414279401/PatMod_Unex_1/20240816-140005-PatModTest/modules/1.com.hello.jar -XX:-UseCompressedOops -classpath /Users/admin/workspace/testDependency/system_lib/junit/junit.jar:/Users/admin/workspace/testDependency/system_lib/junit/hamcrest-core.jar org.junit.runner.JUnitCore net.adoptopenjdk.test.modularity.junit.TestOverrideUsingAppModuleAndNewPackage
[2024-08-16T21:00:19.728Z] STF 14:00:19.021 - Redirecting stderr to /Users/admin/workspace/workspace/Test_openjdk21_hs_sanity.system_x86-64_mac_testList_2/aqa-tests/TKG/output_17238414279401/PatMod_Unex_1/20240816-140005-PatModTest/results/6.OT4.stderr
[2024-08-16T21:00:19.728Z] STF 14:00:19.021 - Redirecting stdout to /Users/admin/workspace/workspace/Test_openjdk21_hs_sanity.system_x86-64_mac_testList_2/aqa-tests/TKG/output_17238414279401/PatMod_Unex_1/20240816-140005-PatModTest/results/6.OT4.stdout
[2024-08-16T21:00:19.728Z] STF 14:00:19.023 - Monitoring processes: OT4
[2024-08-16T21:00:19.728Z] OT4 stderr Picked up JAVA_TOOL_OPTIONS: -Djava.security.manager=allow
[2024-08-16T21:00:21.849Z] OT4 stderr WARNING: module-info.class ignored in patch: /Users/admin/workspace/workspace/Test_openjdk21_hs_sanity.system_x86-64_mac_testList_2/aqa-tests/TKG/output_17238414279401/PatMod_Unex_1/20240816-140005-PatModTest/modules/1.com.hello.jar
[2024-08-16T21:00:21.849Z] OT4 JUnit version 4.12
[2024-08-16T21:00:21.849Z] OT4 .
[2024-08-16T21:00:22.226Z] OT4 Time: 0.006
[2024-08-16T21:00:22.226Z] OT4
[2024-08-16T21:00:22.226Z] OT4 OK (1 test)
[2024-08-16T21:00:22.226Z] OT4
[2024-08-16T21:00:22.226Z] STF 14:00:21.383 - Monitoring Report Summary:
[2024-08-16T21:00:22.226Z] STF 14:00:21.383 - o Process OT4 ended with the expected exit code (0)
[2024-08-16T21:00:22.226Z] STF 14:00:21.383 - EXECUTE stage completed
[2024-08-16T21:00:22.226Z] STF 14:00:21.420 -
[2024-08-16T21:00:22.226Z] STF 14:00:21.420 - ==================== T E A R D O W N ====================
[2024-08-16T21:00:22.226Z] STF 14:00:21.420 - Running teardown: perl /Users/admin/workspace/workspace/Test_openjdk21_hs_sanity.system_x86-64_mac_testList_2/aqa-tests/TKG/../TKG/output_17238414279401/PatMod_Unex_1/20240816-140005-PatModTest/tearDown.pl
[2024-08-16T21:00:22.226Z] STF 14:00:21.615 - TEARDOWN stage completed
[2024-08-16T21:00:22.226Z] STF 14:00:21.625 -
[2024-08-16T21:00:22.226Z] STF 14:00:21.625 - ===================== R E S U L T S =====================
[2024-08-16T21:00:22.226Z] STF 14:00:21.625 - Stage results:
[2024-08-16T21:00:22.226Z] STF 14:00:21.625 - setUp: pass
[2024-08-16T21:00:22.226Z] STF 14:00:21.625 - execute: pass
[2024-08-16T21:00:22.226Z] STF 14:00:21.625 - teardown: pass
[2024-08-16T21:00:22.226Z] STF 14:00:21.625 -
[2024-08-16T21:00:22.226Z] STF 14:00:21.625 - Overall result: PASSED
[2024-08-16T21:00:22.226Z] -----------------------------------
[2024-08-16T21:00:22.226Z] PatMod_Unex_1_PASSED
[2024-08-16T21:00:22.226Z] -----------------------------------
[2024-08-16T21:00:22.226Z]
[2024-08-16T21:00:22.226Z] TEST TEARDOWN:
[2024-08-16T21:00:22.226Z] Nothing to be done for teardown.
[2024-08-16T21:00:22.636Z] PatMod_Unex_1 Finish Time: Fri Aug 16 14:00:21 2024 Epoch Time (ms): 1723842021771