Post Test
[2023-04-19T06:24:27.081Z] make[4]: Leaving directory '/cygdrive/d/jenkins/workspace/Test_openjdk17_hs_extended.openjdk_x86-32_windows_testList_0/aqa-tests/openjdk'
[2023-04-19T06:24:27.081Z] make[3]: Leaving directory '/cygdrive/d/jenkins/workspace/Test_openjdk17_hs_extended.openjdk_x86-32_windows_testList_0/aqa-tests'
[2023-04-19T06:24:27.081Z]
[2023-04-19T06:24:27.081Z]
[2023-04-19T06:24:27.081Z] All tests finished, run result summary:
[2023-04-19T06:24:27.081Z] cd "D:/jenkins/workspace/Test_openjdk17_hs_extended.openjdk_x86-32_windows_testList_0/aqa-tests/\\TKG\\scripts"; \
[2023-04-19T06:24:27.081Z] perl "resultsSum.pl" --failuremk="D:/jenkins/workspace/Test_openjdk17_hs_extended.openjdk_x86-32_windows_testList_0/aqa-tests/\\TKG\\failedtargets.mk" --resultFile="D:/jenkins/workspace/Test_openjdk17_hs_extended.openjdk_x86-32_windows_testList_0/aqa-tests/\\TKG\\output_16818668345149\\TestTargetResult" --platFile="D:/jenkins/workspace/Test_openjdk17_hs_extended.openjdk_x86-32_windows_testList_0/aqa-tests/\\TKG\\resources\\buildPlatformMap.properties" --diagnostic=failure --jdkVersion=17 --jdkImpl=hotspot --jdkVendor="eclipse" --spec=win_x86 --buildList=openjdk --customTarget="" --testTarget=testList --tapPath=D:/jenkins/workspace/Test_openjdk17_hs_extended.openjdk_x86-32_windows_testList_0/aqa-tests/\\TKG\\output_16818668345149\\ --tapName=Test_openjdk17_hs_extended.openjdk_x86-32_windows_testList_0.tap
[2023-04-19T06:24:27.081Z]
[2023-04-19T06:24:27.081Z]
[2023-04-19T06:24:27.081Z] TEST TARGETS SUMMARY
[2023-04-19T06:24:27.081Z] ++++++++++++++++++++++++++++++++++++++++++++++++++++++++++++++++++++++++++
[2023-04-19T06:24:27.081Z] PASSED test targets:
[2023-04-19T06:24:27.081Z] jdk_custom_2
[2023-04-19T06:24:27.081Z] hotspot_custom_2
[2023-04-19T06:24:27.081Z] jdk_security1_2
[2023-04-19T06:24:27.081Z] jdk_security3_2
[2023-04-19T06:24:27.081Z] jdk_time_2
[2023-04-19T06:24:27.081Z] jdk_management_2
[2023-04-19T06:24:27.081Z] jdk_jfr_2
[2023-04-19T06:24:27.081Z] jdk_security_infra_2
[2023-04-19T06:24:27.081Z] jdk_vector_2
[2023-04-19T06:24:27.081Z]
[2023-04-19T06:24:27.081Z] FAILED test targets:
[2023-04-19T06:24:27.081Z] jvm_compiler_2
[2023-04-19T06:24:27.081Z]
[2023-04-19T06:24:27.081Z] TOTAL: 10 EXECUTED: 10 PASSED: 9 FAILED: 1 DISABLED: 0 SKIPPED: 0
[2023-04-19T06:24:27.081Z] cat: 'D:/jenkins/workspace/Test_openjdk17_hs_extended.openjdk_x86-32_windows_testList_0/aqa-tests/TKGoutput_16818668345149../AQACert.log': No such file or directory
[2023-04-19T06:24:27.081Z] cat: 'D:/jenkins/workspace/Test_openjdk17_hs_extended.openjdk_x86-32_windows_testList_0/aqa-tests/TKGoutput_16818668345149../SHA.txt': No such file or directory
[2023-04-19T06:24:27.081Z] ++++++++++++++++++++++++++++++++++++++++++++++++++++++++++++++++++++++++++
[2023-04-19T06:24:27.081Z] make[2]: *** [settings.mk:446: resultsSummary] Error 2
[2023-04-19T06:24:27.081Z] make[2]: Leaving directory '/cygdrive/d/jenkins/workspace/Test_openjdk17_hs_extended.openjdk_x86-32_windows_testList_0/aqa-tests/TKG'
[2023-04-19T06:24:27.081Z] make[1]: *** [makefile:50: _testList] Error 2
[2023-04-19T06:24:27.081Z] make[1]: Leaving directory '/cygdrive/d/jenkins/workspace/Test_openjdk17_hs_extended.openjdk_x86-32_windows_testList_0/aqa-tests/TKG'
[2023-04-19T06:24:27.081Z] make: *** [parallelList.mk:8: testList_0] Error 2
[Pipeline] sh
[2023-04-19T06:24:28.374Z] ++ uname
[2023-04-19T06:24:28.374Z] + '[' CYGWIN_NT-6.3 = AIX ']'
[2023-04-19T06:24:28.374Z] ++ uname
[2023-04-19T06:24:28.374Z] + '[' CYGWIN_NT-6.3 = SunOS ']'
[2023-04-19T06:24:28.374Z] ++ uname
[2023-04-19T06:24:28.374Z] + '[' CYGWIN_NT-6.3 = '*BSD' ']'
[2023-04-19T06:24:28.374Z] + MAKE=make
[2023-04-19T06:24:28.374Z] + make -f ./aqa-tests/TKG/testEnv.mk testEnvTeardown
[2023-04-19T06:24:28.375Z] make: Nothing to be done for 'testEnvTeardown'.
[Pipeline] echo
[2023-04-19T06:24:28.607Z] There were test failures, set build result to UNSTABLE.
[Pipeline] }
[Pipeline] // stage
[Pipeline] stage
[Pipeline] { (Post)
[Pipeline] step
[2023-04-19T06:24:28.840Z] TAP Reports Processing: START
[2023-04-19T06:24:28.844Z] Looking for TAP results report in workspace using pattern: aqa-tests/TKG/**/*.tap
[2023-04-19T06:24:29.959Z] Saving reports...
[2023-04-19T06:24:30.064Z] Processing '/home/jenkins/.jenkins/jobs/Test_openjdk17_hs_extended.openjdk_x86-32_windows_testList_0/builds/86/tap-master-files/aqa-tests/TKG/output_16818668345149/Test_openjdk17_hs_extended.openjdk_x86-32_windows_testList_0.tap'
[2023-04-19T06:24:30.064Z] Parsing TAP test result [/home/jenkins/.jenkins/jobs/Test_openjdk17_hs_extended.openjdk_x86-32_windows_testList_0/builds/86/tap-master-files/aqa-tests/TKG/output_16818668345149/Test_openjdk17_hs_extended.openjdk_x86-32_windows_testList_0.tap].
[2023-04-19T06:24:30.068Z] There are failed test cases. Marking build as UNSTABLE
[2023-04-19T06:24:30.068Z] TAP Reports Processing: FINISH
[Pipeline] junit
[2023-04-19T06:24:30.177Z] Recording test results
[2023-04-19T06:24:37.566Z] [Checks API] No suitable checks publisher found.
[Pipeline] echo
[2023-04-19T06:24:37.573Z] Saving aqa-tests/testenv/testenv.properties file on jenkins.
[Pipeline] archiveArtifacts
[2023-04-19T06:24:37.680Z] Archiving artifacts
[2023-04-19T06:24:37.867Z] Recording fingerprints
[Pipeline] echo
[2023-04-19T06:24:37.977Z] Saving aqa-tests/TKG/**/*.tap file on jenkins.
[Pipeline] archiveArtifacts
[2023-04-19T06:24:38.087Z] Archiving artifacts
[2023-04-19T06:24:39.120Z] Recording fingerprints
[Pipeline] sh
[2023-04-19T06:24:41.310Z] + tar -cf - ./aqa-tests/TKG/output_16818668345149
[2023-04-19T06:24:41.311Z] + pigz -9
[2023-04-19T06:24:41.311Z] + gzip -9
[Pipeline] echo
[2023-04-19T06:24:54.680Z] ARTIFACTORY_SERVER is not set. Saving artifacts on jenkins.
[Pipeline] archiveArtifacts
[2023-04-19T06:24:54.790Z] Archiving artifacts
[2023-04-19T06:25:02.648Z] Recording fingerprints
[Pipeline] findFiles
[Pipeline] echo
[2023-04-19T06:25:05.573Z] Tap file found: aqa-tests\TKG\output_16818668345149\Test_openjdk17_hs_extended.openjdk_x86-32_windows_testList_0.tap...
[Pipeline] readFile
[Pipeline] echo
[2023-04-19T06:25:05.712Z] Rerun in Grinder with failed test targets: https://ci.adoptium.net/job/Grinder/parambuild/?SDK_RESOURCE=upstream&TARGET=testList+TESTLIST=jvm_compiler_2&TEST_FLAG=&UPSTREAM_TEST_JOB_NAME=Test_openjdk17_hs_extended.openjdk_x86-32_windows&DOCKER_REQUIRED=false&ACTIVE_NODE_TIMEOUT=0&VENDOR_TEST_DIRS=&EXTRA_DOCKER_ARGS=&TKG_OWNER_BRANCH=adoptium%3Amaster&OPENJ9_SYSTEMTEST_OWNER_BRANCH=eclipse%3Amaster&PLATFORM=x86-32_windows&GENERATE_JOBS=false&KEEP_REPORTDIR=true&PERSONAL_BUILD=false&DOCKER_REGISTRY_DIR=&ADOPTOPENJDK_REPO=https%3A%2F%2Fgithub.com%2Fadoptium%2Faqa-tests.git&RERUN_ITERATIONS=0&SETUP_JCK_RUN=false&DOCKER_REGISTRY_URL_CREDENTIAL_ID=&LABEL=&EXTRA_OPTIONS=&CUSTOMIZED_SDK_URL=&BUILD_IDENTIFIER=&JENKINS_KEY=&ADOPTOPENJDK_BRANCH=v0.9.7-release&LIGHT_WEIGHT_CHECKOUT=false&USE_JRE=false&ARTIFACTORY_SERVER=&KEEP_WORKSPACE=false&USER_CREDENTIALS_ID=&JDK_VERSION=17&DOCKER_REGISTRY_URL=&ITERATIONS=1&VENDOR_TEST_REPOS=&JDK_REPO=https%3A%2F%2Fgithub.com%2Fadoptium%2Fjdk17u&JCK_GIT_BRANCH=master&OPENJ9_BRANCH=master&OPENJ9_SHA=&JCK_GIT_REPO=&VENDOR_TEST_BRANCHES=&UPSTREAM_JOB_NAME=build-scripts%2Fjobs%2Frelease%2Fjobs%2Fjdk17u%2Fjdk17u-release-windows-x86-32-temurin&OPENJ9_REPO=https%3A%2F%2Fgithub.com%2Feclipse-openj9%2Fopenj9.git&CLOUD_PROVIDER=&CUSTOM_TARGET=&VENDOR_TEST_SHAS=&JDK_BRANCH=jdk-17.0.7%2B7_adopt&LABEL_ADDITION=&ARTIFACTORY_REPO=&ARTIFACTORY_ROOT_DIR=&UPSTREAM_TEST_JOB_NUMBER=110&DOCKERIMAGE_TAG=&JDK_IMPL=hotspot&TEST_TIME=&SSH_AGENT_CREDENTIAL=&AUTO_DETECT=true&SLACK_CHANNEL=&DYNAMIC_COMPILE=false&RELATED_NODES=&ADOPTOPENJDK_SYSTEMTEST_OWNER_BRANCH=adoptium%3Amaster&APPLICATION_OPTIONS=&CUSTOMIZED_SDK_URL_CREDENTIAL_ID=eclipse_temurin_bot_email_and_token&ARCHIVE_TEST_RESULTS=false&NUM_MACHINES=&OPENJDK_SHA=&TRSS_URL=&USE_TESTENV_PROPERTIES=true&BUILD_LIST=openjdk&ADDITIONAL_ARTIFACTS_REQUIRED=&UPSTREAM_JOB_NUMBER=8&STF_OWNER_BRANCH=adoptium%3Amaster&TIME_LIMIT=15&JVM_OPTIONS=&PARALLEL=None
[Pipeline] echo
[2023-04-19T06:25:05.759Z] Rerun failed hotspot test cases in Grinder with hotspot_custom target: https://ci.adoptium.net/job/Grinder/parambuild/?SDK_RESOURCE=upstream&TARGET=hotspot_custom&TEST_FLAG=&UPSTREAM_TEST_JOB_NAME=Test_openjdk17_hs_extended.openjdk_x86-32_windows&DOCKER_REQUIRED=false&ACTIVE_NODE_TIMEOUT=0&VENDOR_TEST_DIRS=&EXTRA_DOCKER_ARGS=&TKG_OWNER_BRANCH=adoptium%3Amaster&OPENJ9_SYSTEMTEST_OWNER_BRANCH=eclipse%3Amaster&PLATFORM=x86-32_windows&GENERATE_JOBS=false&KEEP_REPORTDIR=true&PERSONAL_BUILD=false&DOCKER_REGISTRY_DIR=&ADOPTOPENJDK_REPO=https%3A%2F%2Fgithub.com%2Fadoptium%2Faqa-tests.git&RERUN_ITERATIONS=0&SETUP_JCK_RUN=false&DOCKER_REGISTRY_URL_CREDENTIAL_ID=&LABEL=&EXTRA_OPTIONS=&CUSTOMIZED_SDK_URL=&BUILD_IDENTIFIER=&JENKINS_KEY=&ADOPTOPENJDK_BRANCH=v0.9.7-release&LIGHT_WEIGHT_CHECKOUT=false&USE_JRE=false&ARTIFACTORY_SERVER=&KEEP_WORKSPACE=false&USER_CREDENTIALS_ID=&JDK_VERSION=17&DOCKER_REGISTRY_URL=&ITERATIONS=1&VENDOR_TEST_REPOS=&JDK_REPO=https%3A%2F%2Fgithub.com%2Fadoptium%2Fjdk17u&JCK_GIT_BRANCH=master&OPENJ9_BRANCH=master&OPENJ9_SHA=&JCK_GIT_REPO=&VENDOR_TEST_BRANCHES=&UPSTREAM_JOB_NAME=build-scripts%2Fjobs%2Frelease%2Fjobs%2Fjdk17u%2Fjdk17u-release-windows-x86-32-temurin&OPENJ9_REPO=https%3A%2F%2Fgithub.com%2Feclipse-openj9%2Fopenj9.git&CLOUD_PROVIDER=&CUSTOM_TARGET=compiler/c2/irTests/TestFewIterationsCountedLoop.java+compiler/codecache/MHIntrinsicAllocFailureTest.java+compiler/loopopts/TestRemoveEmptyLoop.java&VENDOR_TEST_SHAS=&JDK_BRANCH=jdk-17.0.7%2B7_adopt&LABEL_ADDITION=&ARTIFACTORY_REPO=&ARTIFACTORY_ROOT_DIR=&UPSTREAM_TEST_JOB_NUMBER=110&DOCKERIMAGE_TAG=&JDK_IMPL=hotspot&TEST_TIME=&SSH_AGENT_CREDENTIAL=&AUTO_DETECT=true&SLACK_CHANNEL=&DYNAMIC_COMPILE=false&RELATED_NODES=&ADOPTOPENJDK_SYSTEMTEST_OWNER_BRANCH=adoptium%3Amaster&APPLICATION_OPTIONS=&CUSTOMIZED_SDK_URL_CREDENTIAL_ID=eclipse_temurin_bot_email_and_token&ARCHIVE_TEST_RESULTS=false&NUM_MACHINES=&OPENJDK_SHA=&TRSS_URL=&USE_TESTENV_PROPERTIES=true&BUILD_LIST=openjdk&ADDITIONAL_ARTIFACTS_REQUIRED=&UPSTREAM_JOB_NUMBER=8&STF_OWNER_BRANCH=adoptium%3Amaster&TIME_LIMIT=15&JVM_OPTIONS=&PARALLEL=None
[Pipeline] }
[Pipeline] // stage
[Pipeline] echo
[2023-04-19T06:25:05.854Z] PROCESSCATCH: Terminating any hung/left over test processes:
[Pipeline] sh
[2023-04-19T06:25:07.036Z] + aqa-tests/terminateTestProcesses.sh null
[2023-04-19T06:25:07.036Z] Windows machine, using powershell queries...
[2023-04-19T06:25:07.036Z] Woohoo - no rogue processes detected!
[Pipeline] cleanWs
[2023-04-19T06:25:07.431Z] [WS-CLEANUP] Deleting project workspace...
[2023-04-19T06:25:07.431Z] [WS-CLEANUP] Deferred wipeout is disabled by the job configuration...
[2023-04-19T06:25:22.789Z] [WS-CLEANUP] done
[Pipeline] sh
[2023-04-19T06:25:23.984Z] + find /cygdrive/c/temp -name '*core*' -print -exec rm -f '{}' ';'
[2023-04-19T06:25:23.984Z] /cygdrive/c/temp/vs2013_install_log_005_vc_compilercore86.txt
[2023-04-19T06:25:23.984Z] /cygdrive/c/temp/vs2013_install_log_005_vc_librarycore86.txt
[2023-04-19T06:25:23.984Z] /cygdrive/c/temp/vs2013_install_log_006_vc_compilercore86res.txt
[2023-04-19T06:25:23.984Z] /cygdrive/c/temp/vs2013_install_log_006_vc_librarycore.txt
[2023-04-19T06:25:23.984Z] /cygdrive/c/temp/vs2013_install_log_007_vc_compilercore.txt
[2023-04-19T06:25:23.984Z] /cygdrive/c/temp/vs2013_install_log_008_vc_compilercoreres.txt
[2023-04-19T06:25:23.984Z] /cygdrive/c/temp/vs2013_install_log_008_vs_professionalcore.txt
[2023-04-19T06:25:23.984Z] /cygdrive/c/temp/vs2013_install_log_015_tfs_objectmodelcore_x64.txt
[2023-04-19T06:25:23.984Z] /cygdrive/c/temp/vs2013_install_log_016_tfs_objectmodelcoreres_x64_enu.txt
[2023-04-19T06:25:23.984Z] /cygdrive/c/temp/vs2013_install_log_019_netfx_451mtpackcore.txt
[2023-04-19T06:25:23.984Z] /cygdrive/c/temp/vs2013_install_log_020_netfx_451mtpackcorelp.txt
[2023-04-19T06:25:23.984Z] /cygdrive/c/temp/vs2013_install_log_023_vs_minshellcore.txt
[Pipeline] }
[Pipeline] // timeout
[Pipeline] }
[Pipeline] // node
[Pipeline] }
[Pipeline] // stage
[Pipeline] }
[Pipeline] // timestamps
[Pipeline] End of Pipeline
Finished: UNSTABLE