Post Test
[2025-11-08T14:11:17.111Z] make[3]: Leaving directory '/home/jenkins/workspace/Test_openjdk25_hs_extended.openjdk_x86-64_linux_rerun/aqa-tests/openjdk'
[2025-11-08T14:11:17.111Z] make[2]: Leaving directory '/home/jenkins/workspace/Test_openjdk25_hs_extended.openjdk_x86-64_linux_rerun/aqa-tests'
[2025-11-08T14:11:17.111Z]
[2025-11-08T14:11:17.111Z]
[2025-11-08T14:11:17.111Z] All tests finished, run result summary:
[2025-11-08T14:11:17.111Z] cd "/home/jenkins/workspace/Test_openjdk25_hs_extended.openjdk_x86-64_linux_rerun/aqa-tests/TKG/../TKG/scripts"; \
[2025-11-08T14:11:17.111Z] perl "resultsSum.pl" --failuremk="/home/jenkins/workspace/Test_openjdk25_hs_extended.openjdk_x86-64_linux_rerun/aqa-tests/TKG/../TKG/failedtargets.mk" --resultFile="/home/jenkins/workspace/Test_openjdk25_hs_extended.openjdk_x86-64_linux_rerun/aqa-tests/TKG/../TKG/output_17626110613075/TestTargetResult" --platFile="/home/jenkins/workspace/Test_openjdk25_hs_extended.openjdk_x86-64_linux_rerun/aqa-tests/TKG/../TKG/resources/buildPlatformMap.properties" --diagnostic=failure --jdkVersion=25 --jdkImpl=hotspot --jdkVendor="eclipse" --spec=linux_x86-64 --buildList=openjdk --customTarget="" --testTarget=testList --tapPath=/home/jenkins/workspace/Test_openjdk25_hs_extended.openjdk_x86-64_linux_rerun/aqa-tests/TKG/../TKG/output_17626110613075/ --tapName=Test_openjdk25_hs_extended.openjdk_x86-64_linux_rerun.tap --comment=""
[2025-11-08T14:11:17.111Z]
[2025-11-08T14:11:17.111Z]
[2025-11-08T14:11:17.111Z] TEST TARGETS SUMMARY
[2025-11-08T14:11:17.111Z] ++++++++++++++++++++++++++++++++++++++++++++++++++++++++++++++++++++++++++
[2025-11-08T14:11:17.111Z] FAILED test targets:
[2025-11-08T14:11:17.111Z] hotspot_compiler_0
[2025-11-08T14:11:17.111Z] hotspot_gc_0
[2025-11-08T14:11:17.111Z] hotspot_runtime_0
[2025-11-08T14:11:17.111Z] hotspot_serviceability_0
[2025-11-08T14:11:17.111Z] hotspot_native_sanity_0
[2025-11-08T14:11:17.111Z] hotspot_vmTestbase_vm_compiler_0
[2025-11-08T14:11:17.111Z] hotspot_vmTestbase_vm_gc_0
[2025-11-08T14:11:17.111Z] hotspot_vmTestbase_vm_defmeth_0
[2025-11-08T14:11:17.111Z] jdk_beans_0
[2025-11-08T14:11:17.111Z] jdk_beans_1
[2025-11-08T14:11:17.111Z] jdk_io_0
[2025-11-08T14:11:17.111Z] jdk_io_1
[2025-11-08T14:11:17.111Z] jdk_other_0
[2025-11-08T14:11:17.111Z] jdk_other_1
[2025-11-08T14:11:17.111Z] jdk_net_0
[2025-11-08T14:11:17.111Z] jdk_net_1
[2025-11-08T14:11:17.111Z] jdk_nio_0
[2025-11-08T14:11:17.111Z] jdk_nio_1
[2025-11-08T14:11:17.111Z] jdk_security3_0
[2025-11-08T14:11:17.111Z] jdk_security3_1
[2025-11-08T14:11:17.111Z] jdk_text_0
[2025-11-08T14:11:17.111Z] jdk_text_1
[2025-11-08T14:11:17.111Z] jdk_time_0
[2025-11-08T14:11:17.111Z] jdk_time_1
[2025-11-08T14:11:17.111Z] jdk_management_0
[2025-11-08T14:11:17.111Z] jdk_management_1
[2025-11-08T14:11:17.111Z] jdk_jmx_0
[2025-11-08T14:11:17.111Z] jdk_jmx_1
[2025-11-08T14:11:17.111Z] jdk_rmi_0
[2025-11-08T14:11:17.111Z] jdk_rmi_1
[2025-11-08T14:11:17.111Z] jdk_tools_0
[2025-11-08T14:11:17.111Z] jdk_tools_1
[2025-11-08T14:11:17.111Z] jdk_jfr_0
[2025-11-08T14:11:17.111Z] jdk_jfr_1
[2025-11-08T14:11:17.111Z] jdk_instrument_0
[2025-11-08T14:11:17.111Z] jdk_instrument_1
[2025-11-08T14:11:17.111Z] jdk_jdi_0
[2025-11-08T14:11:17.111Z] jdk_jdi_1
[2025-11-08T14:11:17.111Z] jdk_build_0
[2025-11-08T14:11:17.111Z] jdk_build_1
[2025-11-08T14:11:17.111Z] jdk_imageio_0
[2025-11-08T14:11:17.111Z] jdk_imageio_1
[2025-11-08T14:11:17.111Z] jdk_native_sanity_0
[2025-11-08T14:11:17.111Z] jdk_native_sanity_1
[2025-11-08T14:11:17.111Z] jdk_vector_0
[2025-11-08T14:11:17.111Z] jdk_vector_1
[2025-11-08T14:11:17.111Z]
[2025-11-08T14:11:17.111Z] TOTAL: 46 EXECUTED: 46 PASSED: 0 FAILED: 46 DISABLED: 0 SKIPPED: 0
[2025-11-08T14:11:17.111Z] ++++++++++++++++++++++++++++++++++++++++++++++++++++++++++++++++++++++++++
[2025-11-08T14:11:17.111Z]
[2025-11-08T14:11:17.111Z] make[1]: *** [settings.mk:454: resultsSummary] Error 2
[2025-11-08T14:11:17.111Z] make[1]: Leaving directory '/home/jenkins/workspace/Test_openjdk25_hs_extended.openjdk_x86-64_linux_rerun/aqa-tests/TKG'
[2025-11-08T14:11:17.111Z] make: *** [makefile:62: _testList] Error 2
[Pipeline] sh
[2025-11-08T14:11:18.951Z] ++ uname
[2025-11-08T14:11:18.951Z] + '[' Linux = AIX ']'
[2025-11-08T14:11:18.951Z] ++ uname
[2025-11-08T14:11:18.951Z] + '[' Linux = SunOS ']'
[2025-11-08T14:11:18.951Z] ++ uname
[2025-11-08T14:11:18.951Z] + '[' Linux = '*BSD' ']'
[2025-11-08T14:11:18.951Z] + MAKE=make
[2025-11-08T14:11:18.951Z] + make -f ./aqa-tests/TKG/testEnv.mk testEnvTeardown
[2025-11-08T14:11:18.951Z] make: Nothing to be done for 'testEnvTeardown'.
[Pipeline] }
[2025-11-08T14:11:19.379Z] $ ssh-agent -k
[2025-11-08T14:11:19.384Z] unset SSH_AUTH_SOCK;
[2025-11-08T14:11:19.384Z] unset SSH_AGENT_PID;
[2025-11-08T14:11:19.384Z] echo Agent pid 3820248 killed;
[2025-11-08T14:11:19.931Z] [ssh-agent] Stopped.
[Pipeline] // sshagent
[Pipeline] }
[2025-11-08T14:11:19.963Z] Xvfb stopping
[Pipeline] // wrap
[Pipeline] echo
[2025-11-08T14:11:21.415Z] There were test failures, current build status is UNSTABLE.
[Pipeline] }
[Pipeline] // stage
[Pipeline] stage
[Pipeline] { (Post)
[Pipeline] echo
[2025-11-08T14:11:21.509Z] Saving aqa-tests/testenv/testenv.properties file on jenkins.
[Pipeline] archiveArtifacts
[2025-11-08T14:11:21.643Z] Archiving artifacts
[2025-11-08T14:11:21.894Z] Recording fingerprints
[Pipeline] echo
[2025-11-08T14:11:22.032Z] Saving aqa-tests/TKG/**/*.tap file on jenkins.
[Pipeline] archiveArtifacts
[2025-11-08T14:11:22.163Z] Archiving artifacts
[2025-11-08T14:11:23.664Z] Recording fingerprints
[Pipeline] sh
[2025-11-08T14:11:26.700Z] + tar -cf - ./aqa-tests/TKG/output_17626110613075
[2025-11-08T14:11:26.701Z] + pigz -9
[2025-11-08T14:11:26.701Z] + gzip -9
[Pipeline] echo
[2025-11-08T14:11:27.069Z] ARTIFACTORY_SERVER is not set. Saving artifacts on jenkins.
[Pipeline] archiveArtifacts
[2025-11-08T14:11:27.201Z] Archiving artifacts
[2025-11-08T14:11:27.448Z] Recording fingerprints
[Pipeline] findFiles
[Pipeline] echo
[2025-11-08T14:11:31.676Z] Tap file found: aqa-tests/TKG/output_17626110613075/Test_openjdk25_hs_extended.openjdk_x86-64_linux_rerun.tap...
[Pipeline] readFile
[Pipeline] echo
[2025-11-08T14:11:32.201Z] Rerun in Grinder with failed test targets: https://ci.adoptium.net/job/Grinder/parambuild/?SDK_RESOURCE=upstream&TARGET=testList+TESTLIST=hotspot_compiler_0,hotspot_gc_0,hotspot_runtime_0,hotspot_serviceability_0,hotspot_native_sanity_0,hotspot_vmTestbase_vm_compiler_0,hotspot_vmTestbase_vm_gc_0,hotspot_vmTestbase_vm_defmeth_0,jdk_beans_0,jdk_beans_1,jdk_io_0,jdk_io_1,jdk_other_0,jdk_other_1,jdk_net_0,jdk_net_1,jdk_nio_0,jdk_nio_1,jdk_security3_0,jdk_security3_1,jdk_text_0,jdk_text_1,jdk_time_0,jdk_time_1,jdk_management_0,jdk_management_1,jdk_jmx_0,jdk_jmx_1,jdk_rmi_0,jdk_rmi_1,jdk_tools_0,jdk_tools_1,jdk_jfr_0,jdk_jfr_1,jdk_instrument_0,jdk_instrument_1,jdk_jdi_0,jdk_jdi_1,jdk_build_0,jdk_build_1,jdk_imageio_0,jdk_imageio_1,jdk_native_sanity_0,jdk_native_sanity_1,jdk_vector_0,jdk_vector_1&BASE_DOCKER_REGISTRY_CREDENTIAL_ID=&TEST_FLAG=&UPSTREAM_TEST_JOB_NAME=&DOCKER_REQUIRED=false&ACTIVE_NODE_TIMEOUT=5&VENDOR_TEST_DIRS=&EXTRA_DOCKER_ARGS=&TKG_OWNER_BRANCH=adoptium%3Amaster&OPENJ9_SYSTEMTEST_OWNER_BRANCH=eclipse%3Amaster&PLATFORM=x86-64_linux&GENERATE_JOBS=true&KEEP_REPORTDIR=true&PERSONAL_BUILD=false&DOCKER_REGISTRY_DIR=&RERUN_ITERATIONS=0&ADOPTOPENJDK_REPO=https%3A%2F%2Fgithub.com%2Fadoptium%2Faqa-tests.git&SETUP_JCK_RUN=false&DOCKER_REGISTRY_URL_CREDENTIAL_ID=&LABEL=&EXTRA_OPTIONS=&CUSTOMIZED_SDK_URL=&BUILD_IDENTIFIER=&JENKINS_KEY=&ADOPTOPENJDK_BRANCH=master&LIGHT_WEIGHT_CHECKOUT=false&USE_JRE=false&ARTIFACTORY_SERVER=&KEEP_WORKSPACE=false&USER_CREDENTIALS_ID=&JDK_VERSION=25&DOCKER_REGISTRY_URL=&ITERATIONS=1&VENDOR_TEST_REPOS=&JDK_REPO=https%3A%2F%2Fgithub.com%2Fadoptium%2Fjdk25u&JCK_GIT_BRANCH=master&OPENJ9_BRANCH=master&OPENJ9_SHA=&JCK_GIT_REPO=&VENDOR_TEST_BRANCHES=&UPSTREAM_JOB_NAME=build-scripts%2Fjobs%2Fjdk25u%2Fjdk25u-linux-x64-temurin&OPENJ9_REPO=https%3A%2F%2Fgithub.com%2Feclipse-openj9%2Fopenj9.git&CLOUD_PROVIDER=&CUSTOM_TARGET=&VENDOR_TEST_SHAS=&JDK_BRANCH=dev&LABEL_ADDITION=%21sw.tool.glibc.2_12&ARTIFACTORY_REPO=&ARTIFACTORY_ROOT_DIR=&UPSTREAM_TEST_JOB_NUMBER=&DOCKERIMAGE_TAG=&TEST_TIME=&JDK_IMPL=hotspot&SSH_AGENT_CREDENTIAL=&AUTO_DETECT=true&SLACK_CHANNEL=aqavit-bot&DYNAMIC_COMPILE=false&RELATED_NODES=&ADOPTOPENJDK_SYSTEMTEST_OWNER_BRANCH=adoptium%3Amaster&APPLICATION_OPTIONS=&CUSTOMIZED_SDK_URL_CREDENTIAL_ID=eclipse_temurin_bot_email_and_token&ARCHIVE_TEST_RESULTS=false&NUM_MACHINES=&OPENJDK_SHA=&TRSS_URL=&RERUN_FAILURE=false&USE_TESTENV_PROPERTIES=false&BUILD_LIST=openjdk&ADDITIONAL_ARTIFACTS_REQUIRED=&UPSTREAM_JOB_NUMBER=3&STF_OWNER_BRANCH=adoptium%3Amaster&TIME_LIMIT=25&JVM_OPTIONS=&PARALLEL=None
[Pipeline] junit
[2025-11-08T14:11:32.338Z] Recording test results
[2025-11-08T14:11:35.482Z] None of the test reports contained any result
[2025-11-08T14:11:35.483Z] [Checks API] No suitable checks publisher found.
[Pipeline] }
[Pipeline] // stage
[Pipeline] echo
[2025-11-08T14:11:35.514Z] PROCESSCATCH: Terminating any hung/left over test processes:
[Pipeline] sh
[2025-11-08T14:11:35.396Z] No test report files were found. Configuration error?
[2025-11-08T14:11:41.115Z] + aqa-tests/terminateTestProcesses.sh jenkins
[2025-11-08T14:11:41.115Z] Unix type machine..
[2025-11-08T14:11:41.115Z] Running on a Linux host
[2025-11-08T14:11:41.851Z] Woohoo - no rogue processes detected!
[Pipeline] retry
[Pipeline] {
[Pipeline] cleanWs
[2025-11-08T14:11:42.498Z] [WS-CLEANUP] Deleting project workspace...
[2025-11-08T14:11:42.498Z] [WS-CLEANUP] Deferred wipeout is disabled by the job configuration...
[2025-11-08T14:11:58.295Z] [WS-CLEANUP] done
[Pipeline] }
[Pipeline] // retry
[Pipeline] sh
[2025-11-08T14:11:59.819Z] + find /tmp -name '*core*' -print -exec rm -f '{}' ';'
[Pipeline] }
[Pipeline] // timeout
[Pipeline] timeout
[2025-11-08T14:12:01.746Z] Timeout set to expire in 5 min 0 sec
[Pipeline] {
[Pipeline] }
[Pipeline] // timeout
[Pipeline] }
[Pipeline] // node
[Pipeline] }
[Pipeline] // stage
[Pipeline] }
[Pipeline] // timestamps
[Pipeline] End of Pipeline
Finished: UNSTABLE