jdk_jdi_1
[2025-10-22T02:57:19.527Z] Running test jdk_jdi_1 ...
[2025-10-22T02:57:19.527Z] ===============================================
[2025-10-22T02:57:19.527Z] jdk_jdi_1 Start Time: Tue Oct 21 22:57:18 2025 Epoch Time (ms): 1761101838945
[2025-10-22T02:57:19.527Z] variation: Mode650
[2025-10-22T02:57:19.527Z] JVM_OPTIONS: -XX:-UseCompressedOops
[2025-10-22T02:57:19.527Z] { \
[2025-10-22T02:57:19.527Z] echo ""; echo "TEST SETUP:"; \
[2025-10-22T02:57:19.527Z] echo "Nothing to be done for setup."; \
[2025-10-22T02:57:19.527Z] mkdir -p "/Users/admin/workspace/workspace/Test_openjdk21_hs_extended.openjdk_aarch64_mac_testList_3/aqa-tests/TKG/../TKG/output_17610981702766/jdk_jdi_1"; \
[2025-10-22T02:57:19.527Z] cd "/Users/admin/workspace/workspace/Test_openjdk21_hs_extended.openjdk_aarch64_mac_testList_3/aqa-tests/TKG/../TKG/output_17610981702766/jdk_jdi_1"; \
[2025-10-22T02:57:19.527Z] echo ""; echo "TESTING:"; \
[2025-10-22T02:57:19.527Z] "/Users/admin/workspace/workspace/Test_openjdk21_hs_extended.openjdk_aarch64_mac_testList_3/jdkbinary/j2sdk-image/Contents/Home/bin/..//bin/java" -Xmx512m -jar "/Users/admin/workspace/workspace/Test_openjdk21_hs_extended.openjdk_aarch64_mac_testList_3/aqa-tests/TKG/../../jvmtest/openjdk/jtreg/lib/jtreg.jar" \
[2025-10-22T02:57:19.527Z] -agentvm -a -ea -esa -v:fail,error,time,nopass -retain:fail,error,*.dmp,javacore.*,heapdump.*,*.trc -ignore:quiet -timeoutFactor:8 -xml:verify -concurrency:2 -nativepath:"/Users/admin/workspace/workspace/Test_openjdk21_hs_extended.openjdk_aarch64_mac_testList_3/jdkbinary/openjdk-test-image/jdk/jtreg/native" -vmoptions:"-Xmx512m -XX:-UseCompressedOops " \
[2025-10-22T02:57:19.527Z] -w ""/Users/admin/workspace/workspace/Test_openjdk21_hs_extended.openjdk_aarch64_mac_testList_3/aqa-tests/TKG/../TKG/output_17610981702766/jdk_jdi_1"/work" \
[2025-10-22T02:57:19.527Z] -r ""/Users/admin/workspace/workspace/Test_openjdk21_hs_extended.openjdk_aarch64_mac_testList_3/aqa-tests/TKG/../TKG/output_17610981702766/jdk_jdi_1"/report" \
[2025-10-22T02:57:19.527Z] -jdk:"/Users/admin/workspace/workspace/Test_openjdk21_hs_extended.openjdk_aarch64_mac_testList_3/jdkbinary/j2sdk-image/Contents/Home/bin/../" \
[2025-10-22T02:57:19.527Z] -exclude:"/Users/admin/workspace/workspace/Test_openjdk21_hs_extended.openjdk_aarch64_mac_testList_3/aqa-tests/TKG/../openjdk/openjdk-jdk/test/jdk/ProblemList.txt" \
[2025-10-22T02:57:19.527Z] -exclude:"/Users/admin/workspace/workspace/Test_openjdk21_hs_extended.openjdk_aarch64_mac_testList_3/aqa-tests/TKG/../../jvmtest/openjdk/excludes/ProblemList_openjdk21.txt" \
[2025-10-22T02:57:19.527Z] \
[2025-10-22T02:57:19.527Z] -exclude:"/Users/admin/workspace/workspace/Test_openjdk21_hs_extended.openjdk_aarch64_mac_testList_3/aqa-tests/TKG/../openjdk/excludes/vendors/eclipse/ProblemList_openjdk21.txt" \
[2025-10-22T02:57:19.527Z] "/Users/admin/workspace/workspace/Test_openjdk21_hs_extended.openjdk_aarch64_mac_testList_3/aqa-tests/TKG/../openjdk/openjdk-jdk/test/jdk:jdk_jdi"; \
[2025-10-22T02:57:19.527Z] if [ $? -eq 0 ]; then echo "-----------------------------------"; echo "jdk_jdi_1""_PASSED"; echo "-----------------------------------"; cd /Users/admin/workspace/workspace/Test_openjdk21_hs_extended.openjdk_aarch64_mac_testList_3/aqa-tests/TKG/..; else echo "-----------------------------------"; echo "jdk_jdi_1""_FAILED"; echo "-----------------------------------"; fi; \
[2025-10-22T02:57:19.527Z] echo ""; echo "TEST TEARDOWN:"; \
[2025-10-22T02:57:19.527Z] echo "Nothing to be done for teardown."; \
[2025-10-22T02:57:19.528Z] } 2>&1 | tee -a "/Users/admin/workspace/workspace/Test_openjdk21_hs_extended.openjdk_aarch64_mac_testList_3/aqa-tests/TKG/../TKG/output_17610981702766/TestTargetResult";
[2025-10-22T02:57:19.528Z]
[2025-10-22T02:57:19.528Z] TEST SETUP:
[2025-10-22T02:57:19.528Z] Nothing to be done for setup.
[2025-10-22T02:57:19.528Z]
[2025-10-22T02:57:19.528Z] TESTING:
[2025-10-22T02:57:19.528Z] Directory "/Users/admin/workspace/workspace/Test_openjdk21_hs_extended.openjdk_aarch64_mac_testList_3/aqa-tests/TKG/../TKG/output_17610981702766/jdk_jdi_1/work" not found: creating
[2025-10-22T02:57:19.528Z] Directory "/Users/admin/workspace/workspace/Test_openjdk21_hs_extended.openjdk_aarch64_mac_testList_3/aqa-tests/TKG/../TKG/output_17610981702766/jdk_jdi_1/report" not found: creating
[2025-10-22T02:57:20.791Z] XML output with verification to /Users/admin/workspace/workspace/Test_openjdk21_hs_extended.openjdk_aarch64_mac_testList_3/aqa-tests/TKG/output_17610981702766/jdk_jdi_1/work
[2025-10-22T03:00:01.229Z] --------------------------------------------------
[2025-10-22T03:00:01.229Z] TEST: com/sun/jdi/FinalizerTest.java
[2025-10-22T03:00:01.229Z] TEST JDK: /Users/admin/workspace/workspace/Test_openjdk21_hs_extended.openjdk_aarch64_mac_testList_3/jdkbinary/j2sdk-image/Contents/Home/bin/..
[2025-10-22T03:00:01.229Z]
[2025-10-22T03:00:01.229Z] ACTION: build -- Passed. Build successful
[2025-10-22T03:00:01.229Z] REASON: User specified action: run build TestScaffold VMConnection TargetListener TargetAdapter
[2025-10-22T03:00:01.229Z] TIME: 0.033 seconds
[2025-10-22T03:00:01.229Z] messages:
[2025-10-22T03:00:01.229Z] command: build TestScaffold VMConnection TargetListener TargetAdapter
[2025-10-22T03:00:01.229Z] reason: User specified action: run build TestScaffold VMConnection TargetListener TargetAdapter
[2025-10-22T03:00:01.229Z] started: Tue Oct 21 22:59:48 EDT 2025
[2025-10-22T03:00:01.229Z] Test directory:
[2025-10-22T03:00:01.229Z] compile: TestScaffold, VMConnection, TargetListener, TargetAdapter
[2025-10-22T03:00:01.229Z] finished: Tue Oct 21 22:59:48 EDT 2025
[2025-10-22T03:00:01.229Z] elapsed time (seconds): 0.033
[2025-10-22T03:00:01.229Z]
[2025-10-22T03:00:01.229Z] ACTION: compile -- Passed. Compilation successful
[2025-10-22T03:00:01.229Z] REASON: .class file out of date or does not exist
[2025-10-22T03:00:01.229Z] TIME: 0.033 seconds
[2025-10-22T03:00:01.229Z] messages:
[2025-10-22T03:00:01.229Z] command: compile /Users/admin/workspace/workspace/Test_openjdk21_hs_extended.openjdk_aarch64_mac_testList_3/aqa-tests/openjdk/openjdk-jdk/test/jdk/com/sun/jdi/TestScaffold.java /Users/admin/workspace/workspace/Test_openjdk21_hs_extended.openjdk_aarch64_mac_testList_3/aqa-tests/openjdk/openjdk-jdk/test/jdk/com/sun/jdi/VMConnection.java /Users/admin/workspace/workspace/Test_openjdk21_hs_extended.openjdk_aarch64_mac_testList_3/aqa-tests/openjdk/openjdk-jdk/test/jdk/com/sun/jdi/TargetListener.java /Users/admin/workspace/workspace/Test_openjdk21_hs_extended.openjdk_aarch64_mac_testList_3/aqa-tests/openjdk/openjdk-jdk/test/jdk/com/sun/jdi/TargetAdapter.java
[2025-10-22T03:00:01.229Z] reason: .class file out of date or does not exist
[2025-10-22T03:00:01.229Z] started: Tue Oct 21 22:59:48 EDT 2025
[2025-10-22T03:00:01.229Z] Additional options from @modules: --add-modules jdk.jdi
[2025-10-22T03:00:01.229Z] Mode: agentvm
[2025-10-22T03:00:01.229Z] Agent id: 1
[2025-10-22T03:00:01.229Z] finished: Tue Oct 21 22:59:48 EDT 2025
[2025-10-22T03:00:01.229Z] elapsed time (seconds): 0.033
[2025-10-22T03:00:01.229Z] configuration:
[2025-10-22T03:00:01.229Z] Boot Layer (javac runtime environment)
[2025-10-22T03:00:01.229Z] class path: /Users/admin/workspace/workspace/Test_openjdk21_hs_extended.openjdk_aarch64_mac_testList_3/jvmtest/openjdk/jtreg/lib/javatest.jar
[2025-10-22T03:00:01.229Z] /Users/admin/workspace/workspace/Test_openjdk21_hs_extended.openjdk_aarch64_mac_testList_3/jvmtest/openjdk/jtreg/lib/jtreg.jar
[2025-10-22T03:00:01.229Z] patch: java.base /Users/admin/workspace/workspace/Test_openjdk21_hs_extended.openjdk_aarch64_mac_testList_3/aqa-tests/TKG/output_17610981702766/jdk_jdi_1/work/patches/java.base
[2025-10-22T03:00:01.229Z]
[2025-10-22T03:00:01.229Z] javac compilation environment
[2025-10-22T03:00:01.229Z] add modules: jdk.jdi
[2025-10-22T03:00:01.229Z] source path: /Users/admin/workspace/workspace/Test_openjdk21_hs_extended.openjdk_aarch64_mac_testList_3/aqa-tests/openjdk/openjdk-jdk/test/jdk/com/sun/jdi
[2025-10-22T03:00:01.229Z] class path: /Users/admin/workspace/workspace/Test_openjdk21_hs_extended.openjdk_aarch64_mac_testList_3/aqa-tests/openjdk/openjdk-jdk/test/jdk/com/sun/jdi
[2025-10-22T03:00:01.229Z] /Users/admin/workspace/workspace/Test_openjdk21_hs_extended.openjdk_aarch64_mac_testList_3/aqa-tests/TKG/output_17610981702766/jdk_jdi_1/work/classes/0/com/sun/jdi/FinalizerTest.d
[2025-10-22T03:00:01.229Z]
[2025-10-22T03:00:01.229Z] rerun:
[2025-10-22T03:00:01.229Z] cd /Users/admin/workspace/workspace/Test_openjdk21_hs_extended.openjdk_aarch64_mac_testList_3/aqa-tests/TKG/output_17610981702766/jdk_jdi_1/work/scratch/1 && \
[2025-10-22T03:00:01.229Z] HOME=/Users/admin \
[2025-10-22T03:00:01.229Z] PATH=/bin:/usr/bin:/usr/sbin \
[2025-10-22T03:00:01.229Z] /Users/admin/workspace/workspace/Test_openjdk21_hs_extended.openjdk_aarch64_mac_testList_3/jdkbinary/j2sdk-image/Contents/Home/bin/../bin/javac \
[2025-10-22T03:00:01.229Z] -J-ea \
[2025-10-22T03:00:01.229Z] -J-esa \
[2025-10-22T03:00:01.229Z] -J-Xmx512m \
[2025-10-22T03:00:01.229Z] -J-XX:-UseCompressedOops \
[2025-10-22T03:00:01.229Z] -J-Dtest.vm.opts='-ea -esa -Xmx512m -XX:-UseCompressedOops' \
[2025-10-22T03:00:01.229Z] -J-Dtest.tool.vm.opts='-J-ea -J-esa -J-Xmx512m -J-XX:-UseCompressedOops' \
[2025-10-22T03:00:01.229Z] -J-Dtest.compiler.opts= \
[2025-10-22T03:00:01.229Z] -J-Dtest.java.opts= \
[2025-10-22T03:00:01.229Z] -J-Dtest.jdk=/Users/admin/workspace/workspace/Test_openjdk21_hs_extended.openjdk_aarch64_mac_testList_3/jdkbinary/j2sdk-image/Contents/Home/bin/.. \
[2025-10-22T03:00:01.229Z] -J-Dcompile.jdk=/Users/admin/workspace/workspace/Test_openjdk21_hs_extended.openjdk_aarch64_mac_testList_3/jdkbinary/j2sdk-image/Contents/Home/bin/.. \
[2025-10-22T03:00:01.229Z] -J-Dtest.timeout.factor=8.0 \
[2025-10-22T03:00:01.229Z] -J-Dtest.nativepath=/Users/admin/workspace/workspace/Test_openjdk21_hs_extended.openjdk_aarch64_mac_testList_3/jdkbinary/openjdk-test-image/jdk/jtreg/native \
[2025-10-22T03:00:01.229Z] -J-Dtest.root=/Users/admin/workspace/workspace/Test_openjdk21_hs_extended.openjdk_aarch64_mac_testList_3/aqa-tests/openjdk/openjdk-jdk/test/jdk \
[2025-10-22T03:00:01.229Z] -J-Dtest.name=com/sun/jdi/FinalizerTest.java \
[2025-10-22T03:00:01.229Z] -J-Dtest.file=/Users/admin/workspace/workspace/Test_openjdk21_hs_extended.openjdk_aarch64_mac_testList_3/aqa-tests/openjdk/openjdk-jdk/test/jdk/com/sun/jdi/FinalizerTest.java \
[2025-10-22T03:00:01.229Z] -J-Dtest.src=/Users/admin/workspace/workspace/Test_openjdk21_hs_extended.openjdk_aarch64_mac_testList_3/aqa-tests/openjdk/openjdk-jdk/test/jdk/com/sun/jdi \
[2025-10-22T03:00:01.229Z] -J-Dtest.src.path=/Users/admin/workspace/workspace/Test_openjdk21_hs_extended.openjdk_aarch64_mac_testList_3/aqa-tests/openjdk/openjdk-jdk/test/jdk/com/sun/jdi \
[2025-10-22T03:00:01.229Z] -J-Dtest.classes=/Users/admin/workspace/workspace/Test_openjdk21_hs_extended.openjdk_aarch64_mac_testList_3/aqa-tests/TKG/output_17610981702766/jdk_jdi_1/work/classes/0/com/sun/jdi/FinalizerTest.d \
[2025-10-22T03:00:01.229Z] -J-Dtest.class.path=/Users/admin/workspace/workspace/Test_openjdk21_hs_extended.openjdk_aarch64_mac_testList_3/aqa-tests/TKG/output_17610981702766/jdk_jdi_1/work/classes/0/com/sun/jdi/FinalizerTest.d \
[2025-10-22T03:00:01.229Z] -J-Dtest.class.path.prefix=/Users/admin/workspace/workspace/Test_openjdk21_hs_extended.openjdk_aarch64_mac_testList_3/aqa-tests/TKG/output_17610981702766/jdk_jdi_1/work/classes/0/com/sun/jdi/FinalizerTest.d:/Users/admin/workspace/workspace/Test_openjdk21_hs_extended.openjdk_aarch64_mac_testList_3/aqa-tests/openjdk/openjdk-jdk/test/jdk/com/sun/jdi \
[2025-10-22T03:00:01.229Z] -J-Dtest.modules=jdk.jdi \
[2025-10-22T03:00:01.229Z] --add-modules jdk.jdi \
[2025-10-22T03:00:01.229Z] -d /Users/admin/workspace/workspace/Test_openjdk21_hs_extended.openjdk_aarch64_mac_testList_3/aqa-tests/TKG/output_17610981702766/jdk_jdi_1/work/classes/0/com/sun/jdi/FinalizerTest.d \
[2025-10-22T03:00:01.229Z] -sourcepath /Users/admin/workspace/workspace/Test_openjdk21_hs_extended.openjdk_aarch64_mac_testList_3/aqa-tests/openjdk/openjdk-jdk/test/jdk/com/sun/jdi \
[2025-10-22T03:00:01.229Z] -classpath /Users/admin/workspace/workspace/Test_openjdk21_hs_extended.openjdk_aarch64_mac_testList_3/aqa-tests/openjdk/openjdk-jdk/test/jdk/com/sun/jdi:/Users/admin/workspace/workspace/Test_openjdk21_hs_extended.openjdk_aarch64_mac_testList_3/aqa-tests/TKG/output_17610981702766/jdk_jdi_1/work/classes/0/com/sun/jdi/FinalizerTest.d /Users/admin/workspace/workspace/Test_openjdk21_hs_extended.openjdk_aarch64_mac_testList_3/aqa-tests/openjdk/openjdk-jdk/test/jdk/com/sun/jdi/TestScaffold.java /Users/admin/workspace/workspace/Test_openjdk21_hs_extended.openjdk_aarch64_mac_testList_3/aqa-tests/openjdk/openjdk-jdk/test/jdk/com/sun/jdi/VMConnection.java /Users/admin/workspace/workspace/Test_openjdk21_hs_extended.openjdk_aarch64_mac_testList_3/aqa-tests/openjdk/openjdk-jdk/test/jdk/com/sun/jdi/TargetListener.java /Users/admin/workspace/workspace/Test_openjdk21_hs_extended.openjdk_aarch64_mac_testList_3/aqa-tests/openjdk/openjdk-jdk/test/jdk/com/sun/jdi/TargetAdapter.java
[2025-10-22T03:00:01.229Z] direct:
[2025-10-22T03:00:01.229Z] /Users/admin/workspace/workspace/Test_openjdk21_hs_extended.openjdk_aarch64_mac_testList_3/aqa-tests/openjdk/openjdk-jdk/test/jdk/com/sun/jdi/DebuggeeWrapper.java:115: warning: [removal] ThreadDeath in java.lang has been deprecated and marked for removal
[2025-10-22T03:00:01.229Z] if (e instanceof ThreadDeath) {
[2025-10-22T03:00:01.229Z] ^
[2025-10-22T03:00:01.229Z] Note: Some input files use unchecked or unsafe operations.
[2025-10-22T03:00:01.229Z] Note: Recompile with -Xlint:unchecked for details.
[2025-10-22T03:00:01.229Z] 1 warning
[2025-10-22T03:00:01.229Z]
[2025-10-22T03:00:01.229Z] ACTION: compile -- Passed. Compilation successful
[2025-10-22T03:00:01.229Z] REASON: User specified action: run compile -g FinalizerTest.java
[2025-10-22T03:00:01.229Z] TIME: 0.015 seconds
[2025-10-22T03:00:01.229Z] messages:
[2025-10-22T03:00:01.229Z] command: compile -g /Users/admin/workspace/workspace/Test_openjdk21_hs_extended.openjdk_aarch64_mac_testList_3/aqa-tests/openjdk/openjdk-jdk/test/jdk/com/sun/jdi/FinalizerTest.java
[2025-10-22T03:00:01.229Z] reason: User specified action: run compile -g FinalizerTest.java
[2025-10-22T03:00:01.229Z] started: Tue Oct 21 22:59:48 EDT 2025
[2025-10-22T03:00:01.229Z] Additional options from @modules: --add-modules jdk.jdi
[2025-10-22T03:00:01.229Z] Mode: agentvm
[2025-10-22T03:00:01.229Z] Agent id: 1
[2025-10-22T03:00:01.229Z] finished: Tue Oct 21 22:59:48 EDT 2025
[2025-10-22T03:00:01.229Z] elapsed time (seconds): 0.015
[2025-10-22T03:00:01.229Z] configuration:
[2025-10-22T03:00:01.229Z] Boot Layer (javac runtime environment)
[2025-10-22T03:00:01.229Z] class path: /Users/admin/workspace/workspace/Test_openjdk21_hs_extended.openjdk_aarch64_mac_testList_3/jvmtest/openjdk/jtreg/lib/javatest.jar
[2025-10-22T03:00:01.229Z] /Users/admin/workspace/workspace/Test_openjdk21_hs_extended.openjdk_aarch64_mac_testList_3/jvmtest/openjdk/jtreg/lib/jtreg.jar
[2025-10-22T03:00:01.229Z] patch: java.base /Users/admin/workspace/workspace/Test_openjdk21_hs_extended.openjdk_aarch64_mac_testList_3/aqa-tests/TKG/output_17610981702766/jdk_jdi_1/work/patches/java.base
[2025-10-22T03:00:01.229Z]
[2025-10-22T03:00:01.229Z] javac compilation environment
[2025-10-22T03:00:01.229Z] add modules: jdk.jdi
[2025-10-22T03:00:01.229Z] source path: /Users/admin/workspace/workspace/Test_openjdk21_hs_extended.openjdk_aarch64_mac_testList_3/aqa-tests/openjdk/openjdk-jdk/test/jdk/com/sun/jdi
[2025-10-22T03:00:01.229Z] class path: /Users/admin/workspace/workspace/Test_openjdk21_hs_extended.openjdk_aarch64_mac_testList_3/aqa-tests/openjdk/openjdk-jdk/test/jdk/com/sun/jdi
[2025-10-22T03:00:01.229Z] /Users/admin/workspace/workspace/Test_openjdk21_hs_extended.openjdk_aarch64_mac_testList_3/aqa-tests/TKG/output_17610981702766/jdk_jdi_1/work/classes/0/com/sun/jdi/FinalizerTest.d
[2025-10-22T03:00:01.229Z]
[2025-10-22T03:00:01.229Z] rerun:
[2025-10-22T03:00:01.229Z] cd /Users/admin/workspace/workspace/Test_openjdk21_hs_extended.openjdk_aarch64_mac_testList_3/aqa-tests/TKG/output_17610981702766/jdk_jdi_1/work/scratch/1 && \
[2025-10-22T03:00:01.229Z] HOME=/Users/admin \
[2025-10-22T03:00:01.229Z] PATH=/bin:/usr/bin:/usr/sbin \
[2025-10-22T03:00:01.229Z] /Users/admin/workspace/workspace/Test_openjdk21_hs_extended.openjdk_aarch64_mac_testList_3/jdkbinary/j2sdk-image/Contents/Home/bin/../bin/javac \
[2025-10-22T03:00:01.229Z] -J-ea \
[2025-10-22T03:00:01.229Z] -J-esa \
[2025-10-22T03:00:01.229Z] -J-Xmx512m \
[2025-10-22T03:00:01.229Z] -J-XX:-UseCompressedOops \
[2025-10-22T03:00:01.229Z] -J-Dtest.vm.opts='-ea -esa -Xmx512m -XX:-UseCompressedOops' \
[2025-10-22T03:00:01.229Z] -J-Dtest.tool.vm.opts='-J-ea -J-esa -J-Xmx512m -J-XX:-UseCompressedOops' \
[2025-10-22T03:00:01.229Z] -J-Dtest.compiler.opts= \
[2025-10-22T03:00:01.229Z] -J-Dtest.java.opts= \
[2025-10-22T03:00:01.229Z] -J-Dtest.jdk=/Users/admin/workspace/workspace/Test_openjdk21_hs_extended.openjdk_aarch64_mac_testList_3/jdkbinary/j2sdk-image/Contents/Home/bin/.. \
[2025-10-22T03:00:01.229Z] -J-Dcompile.jdk=/Users/admin/workspace/workspace/Test_openjdk21_hs_extended.openjdk_aarch64_mac_testList_3/jdkbinary/j2sdk-image/Contents/Home/bin/.. \
[2025-10-22T03:00:01.229Z] -J-Dtest.timeout.factor=8.0 \
[2025-10-22T03:00:01.229Z] -J-Dtest.nativepath=/Users/admin/workspace/workspace/Test_openjdk21_hs_extended.openjdk_aarch64_mac_testList_3/jdkbinary/openjdk-test-image/jdk/jtreg/native \
[2025-10-22T03:00:01.229Z] -J-Dtest.root=/Users/admin/workspace/workspace/Test_openjdk21_hs_extended.openjdk_aarch64_mac_testList_3/aqa-tests/openjdk/openjdk-jdk/test/jdk \
[2025-10-22T03:00:01.229Z] -J-Dtest.name=com/sun/jdi/FinalizerTest.java \
[2025-10-22T03:00:01.229Z] -J-Dtest.file=/Users/admin/workspace/workspace/Test_openjdk21_hs_extended.openjdk_aarch64_mac_testList_3/aqa-tests/openjdk/openjdk-jdk/test/jdk/com/sun/jdi/FinalizerTest.java \
[2025-10-22T03:00:01.229Z] -J-Dtest.src=/Users/admin/workspace/workspace/Test_openjdk21_hs_extended.openjdk_aarch64_mac_testList_3/aqa-tests/openjdk/openjdk-jdk/test/jdk/com/sun/jdi \
[2025-10-22T03:00:01.229Z] -J-Dtest.src.path=/Users/admin/workspace/workspace/Test_openjdk21_hs_extended.openjdk_aarch64_mac_testList_3/aqa-tests/openjdk/openjdk-jdk/test/jdk/com/sun/jdi \
[2025-10-22T03:00:01.229Z] -J-Dtest.classes=/Users/admin/workspace/workspace/Test_openjdk21_hs_extended.openjdk_aarch64_mac_testList_3/aqa-tests/TKG/output_17610981702766/jdk_jdi_1/work/classes/0/com/sun/jdi/FinalizerTest.d \
[2025-10-22T03:00:01.229Z] -J-Dtest.class.path=/Users/admin/workspace/workspace/Test_openjdk21_hs_extended.openjdk_aarch64_mac_testList_3/aqa-tests/TKG/output_17610981702766/jdk_jdi_1/work/classes/0/com/sun/jdi/FinalizerTest.d \
[2025-10-22T03:00:01.229Z] -J-Dtest.class.path.prefix=/Users/admin/workspace/workspace/Test_openjdk21_hs_extended.openjdk_aarch64_mac_testList_3/aqa-tests/TKG/output_17610981702766/jdk_jdi_1/work/classes/0/com/sun/jdi/FinalizerTest.d:/Users/admin/workspace/workspace/Test_openjdk21_hs_extended.openjdk_aarch64_mac_testList_3/aqa-tests/openjdk/openjdk-jdk/test/jdk/com/sun/jdi \
[2025-10-22T03:00:01.229Z] -J-Dtest.modules=jdk.jdi \
[2025-10-22T03:00:01.229Z] --add-modules jdk.jdi \
[2025-10-22T03:00:01.229Z] -d /Users/admin/workspace/workspace/Test_openjdk21_hs_extended.openjdk_aarch64_mac_testList_3/aqa-tests/TKG/output_17610981702766/jdk_jdi_1/work/classes/0/com/sun/jdi/FinalizerTest.d \
[2025-10-22T03:00:01.229Z] -sourcepath /Users/admin/workspace/workspace/Test_openjdk21_hs_extended.openjdk_aarch64_mac_testList_3/aqa-tests/openjdk/openjdk-jdk/test/jdk/com/sun/jdi \
[2025-10-22T03:00:01.229Z] -classpath /Users/admin/workspace/workspace/Test_openjdk21_hs_extended.openjdk_aarch64_mac_testList_3/aqa-tests/openjdk/openjdk-jdk/test/jdk/com/sun/jdi:/Users/admin/workspace/workspace/Test_openjdk21_hs_extended.openjdk_aarch64_mac_testList_3/aqa-tests/TKG/output_17610981702766/jdk_jdi_1/work/classes/0/com/sun/jdi/FinalizerTest.d \
[2025-10-22T03:00:01.229Z] -g /Users/admin/workspace/workspace/Test_openjdk21_hs_extended.openjdk_aarch64_mac_testList_3/aqa-tests/openjdk/openjdk-jdk/test/jdk/com/sun/jdi/FinalizerTest.java
[2025-10-22T03:00:01.229Z] direct:
[2025-10-22T03:00:01.229Z] /Users/admin/workspace/workspace/Test_openjdk21_hs_extended.openjdk_aarch64_mac_testList_3/aqa-tests/openjdk/openjdk-jdk/test/jdk/com/sun/jdi/FinalizerTest.java:62: warning: [removal] finalize() in Object has been deprecated and marked for removal
[2025-10-22T03:00:01.229Z] protected void finalize() throws Throwable {
[2025-10-22T03:00:01.229Z] ^
[2025-10-22T03:00:01.229Z] /Users/admin/workspace/workspace/Test_openjdk21_hs_extended.openjdk_aarch64_mac_testList_3/aqa-tests/openjdk/openjdk-jdk/test/jdk/com/sun/jdi/FinalizerTest.java:68: warning: [removal] finalize() in Object has been deprecated and marked for removal
[2025-10-22T03:00:01.229Z] super.finalize();
[2025-10-22T03:00:01.229Z] ^
[2025-10-22T03:00:01.229Z] /Users/admin/workspace/workspace/Test_openjdk21_hs_extended.openjdk_aarch64_mac_testList_3/aqa-tests/openjdk/openjdk-jdk/test/jdk/com/sun/jdi/FinalizerTest.java:79: warning: [removal] runFinalization() in System has been deprecated and marked for removal
[2025-10-22T03:00:01.229Z] System.runFinalization();
[2025-10-22T03:00:01.229Z] ^
[2025-10-22T03:00:01.229Z] /Users/admin/workspace/workspace/Test_openjdk21_hs_extended.openjdk_aarch64_mac_testList_3/aqa-tests/openjdk/openjdk-jdk/test/jdk/com/sun/jdi/FinalizerTest.java:100: warning: [removal] runFinalization() in System has been deprecated and marked for removal
[2025-10-22T03:00:01.229Z] System.runFinalization();
[2025-10-22T03:00:01.229Z] ^
[2025-10-22T03:00:01.229Z] Note: /Users/admin/workspace/workspace/Test_openjdk21_hs_extended.openjdk_aarch64_mac_testList_3/aqa-tests/openjdk/openjdk-jdk/test/jdk/com/sun/jdi/FinalizerTest.java uses unchecked or unsafe operations.
[2025-10-22T03:00:01.229Z] Note: Recompile with -Xlint:unchecked for details.
[2025-10-22T03:00:01.229Z] 4 warnings
[2025-10-22T03:00:01.229Z]
[2025-10-22T03:00:01.229Z] ACTION: build -- Passed. All files up to date
[2025-10-22T03:00:01.229Z] REASON: Named class compiled on demand
[2025-10-22T03:00:01.229Z] TIME: 0.0 seconds
[2025-10-22T03:00:01.229Z] messages:
[2025-10-22T03:00:01.229Z] command: build FinalizerTest
[2025-10-22T03:00:01.229Z] reason: Named class compiled on demand
[2025-10-22T03:00:01.229Z] started: Tue Oct 21 22:59:48 EDT 2025
[2025-10-22T03:00:01.229Z] finished: Tue Oct 21 22:59:48 EDT 2025
[2025-10-22T03:00:01.229Z] elapsed time (seconds): 0.0
[2025-10-22T03:00:01.229Z]
[2025-10-22T03:00:01.229Z] ACTION: driver -- Failed. Execution failed: `main' threw exception: java.lang.RuntimeException: Invalid debuggee exitValue: 1
[2025-10-22T03:00:01.229Z] REASON: User specified action: run driver FinalizerTest
[2025-10-22T03:00:01.229Z] TIME: 0.143 seconds
[2025-10-22T03:00:01.229Z] messages:
[2025-10-22T03:00:01.229Z] command: driver FinalizerTest
[2025-10-22T03:00:01.229Z] reason: User specified action: run driver FinalizerTest
[2025-10-22T03:00:01.229Z] started: Tue Oct 21 22:59:48 EDT 2025
[2025-10-22T03:00:01.229Z] Mode: agentvm
[2025-10-22T03:00:01.229Z] Agent id: 11
[2025-10-22T03:00:01.229Z] finished: Tue Oct 21 22:59:49 EDT 2025
[2025-10-22T03:00:01.229Z] elapsed time (seconds): 0.143
[2025-10-22T03:00:01.229Z] configuration:
[2025-10-22T03:00:01.229Z] Boot Layer
[2025-10-22T03:00:01.230Z] class path: /Users/admin/workspace/workspace/Test_openjdk21_hs_extended.openjdk_aarch64_mac_testList_3/jvmtest/openjdk/jtreg/lib/javatest.jar
[2025-10-22T03:00:01.230Z] /Users/admin/workspace/workspace/Test_openjdk21_hs_extended.openjdk_aarch64_mac_testList_3/jvmtest/openjdk/jtreg/lib/jtreg.jar
[2025-10-22T03:00:01.230Z] /Users/admin/workspace/workspace/Test_openjdk21_hs_extended.openjdk_aarch64_mac_testList_3/jvmtest/openjdk/jtreg/lib/junit-platform-console-standalone-1.9.2.jar
[2025-10-22T03:00:01.230Z] /Users/admin/workspace/workspace/Test_openjdk21_hs_extended.openjdk_aarch64_mac_testList_3/jvmtest/openjdk/jtreg/lib/testng-7.3.0.jar
[2025-10-22T03:00:01.230Z] /Users/admin/workspace/workspace/Test_openjdk21_hs_extended.openjdk_aarch64_mac_testList_3/jvmtest/openjdk/jtreg/lib/guice-5.1.0.jar
[2025-10-22T03:00:01.230Z] /Users/admin/workspace/workspace/Test_openjdk21_hs_extended.openjdk_aarch64_mac_testList_3/jvmtest/openjdk/jtreg/lib/jcommander-1.82.jar
[2025-10-22T03:00:01.230Z] patch: java.base /Users/admin/workspace/workspace/Test_openjdk21_hs_extended.openjdk_aarch64_mac_testList_3/aqa-tests/TKG/output_17610981702766/jdk_jdi_1/work/patches/java.base
[2025-10-22T03:00:01.230Z]
[2025-10-22T03:00:01.230Z] Test Layer
[2025-10-22T03:00:01.230Z] class path: /Users/admin/workspace/workspace/Test_openjdk21_hs_extended.openjdk_aarch64_mac_testList_3/aqa-tests/TKG/output_17610981702766/jdk_jdi_1/work/classes/0/com/sun/jdi/FinalizerTest.d
[2025-10-22T03:00:01.230Z] /Users/admin/workspace/workspace/Test_openjdk21_hs_extended.openjdk_aarch64_mac_testList_3/aqa-tests/openjdk/openjdk-jdk/test/jdk/com/sun/jdi
[2025-10-22T03:00:01.230Z]
[2025-10-22T03:00:01.230Z] rerun:
[2025-10-22T03:00:01.230Z] cd /Users/admin/workspace/workspace/Test_openjdk21_hs_extended.openjdk_aarch64_mac_testList_3/aqa-tests/TKG/output_17610981702766/jdk_jdi_1/work/scratch/1 && \
[2025-10-22T03:00:01.230Z] HOME=/Users/admin \
[2025-10-22T03:00:01.230Z] PATH=/bin:/usr/bin:/usr/sbin \
[2025-10-22T03:00:01.230Z] /Users/admin/workspace/workspace/Test_openjdk21_hs_extended.openjdk_aarch64_mac_testList_3/jdkbinary/j2sdk-image/Contents/Home/bin/../bin/java \
[2025-10-22T03:00:01.230Z] -Dtest.vm.opts='-ea -esa -Xmx512m -XX:-UseCompressedOops' \
[2025-10-22T03:00:01.230Z] -Dtest.tool.vm.opts='-J-ea -J-esa -J-Xmx512m -J-XX:-UseCompressedOops' \
[2025-10-22T03:00:01.230Z] -Dtest.compiler.opts= \
[2025-10-22T03:00:01.230Z] -Dtest.java.opts= \
[2025-10-22T03:00:01.230Z] -Dtest.jdk=/Users/admin/workspace/workspace/Test_openjdk21_hs_extended.openjdk_aarch64_mac_testList_3/jdkbinary/j2sdk-image/Contents/Home/bin/.. \
[2025-10-22T03:00:01.230Z] -Dcompile.jdk=/Users/admin/workspace/workspace/Test_openjdk21_hs_extended.openjdk_aarch64_mac_testList_3/jdkbinary/j2sdk-image/Contents/Home/bin/.. \
[2025-10-22T03:00:01.230Z] -Dtest.timeout.factor=8.0 \
[2025-10-22T03:00:01.230Z] -Dtest.nativepath=/Users/admin/workspace/workspace/Test_openjdk21_hs_extended.openjdk_aarch64_mac_testList_3/jdkbinary/openjdk-test-image/jdk/jtreg/native \
[2025-10-22T03:00:01.230Z] -Dtest.root=/Users/admin/workspace/workspace/Test_openjdk21_hs_extended.openjdk_aarch64_mac_testList_3/aqa-tests/openjdk/openjdk-jdk/test/jdk \
[2025-10-22T03:00:01.230Z] -Dtest.name=com/sun/jdi/FinalizerTest.java \
[2025-10-22T03:00:01.230Z] -Dtest.file=/Users/admin/workspace/workspace/Test_openjdk21_hs_extended.openjdk_aarch64_mac_testList_3/aqa-tests/openjdk/openjdk-jdk/test/jdk/com/sun/jdi/FinalizerTest.java \
[2025-10-22T03:00:01.230Z] -Dtest.src=/Users/admin/workspace/workspace/Test_openjdk21_hs_extended.openjdk_aarch64_mac_testList_3/aqa-tests/openjdk/openjdk-jdk/test/jdk/com/sun/jdi \
[2025-10-22T03:00:01.230Z] -Dtest.src.path=/Users/admin/workspace/workspace/Test_openjdk21_hs_extended.openjdk_aarch64_mac_testList_3/aqa-tests/openjdk/openjdk-jdk/test/jdk/com/sun/jdi \
[2025-10-22T03:00:01.230Z] -Dtest.classes=/Users/admin/workspace/workspace/Test_openjdk21_hs_extended.openjdk_aarch64_mac_testList_3/aqa-tests/TKG/output_17610981702766/jdk_jdi_1/work/classes/0/com/sun/jdi/FinalizerTest.d \
[2025-10-22T03:00:01.230Z] -Dtest.class.path=/Users/admin/workspace/workspace/Test_openjdk21_hs_extended.openjdk_aarch64_mac_testList_3/aqa-tests/TKG/output_17610981702766/jdk_jdi_1/work/classes/0/com/sun/jdi/FinalizerTest.d \
[2025-10-22T03:00:01.230Z] -Dtest.class.path.prefix=/Users/admin/workspace/workspace/Test_openjdk21_hs_extended.openjdk_aarch64_mac_testList_3/aqa-tests/TKG/output_17610981702766/jdk_jdi_1/work/classes/0/com/sun/jdi/FinalizerTest.d:/Users/admin/workspace/workspace/Test_openjdk21_hs_extended.openjdk_aarch64_mac_testList_3/aqa-tests/openjdk/openjdk-jdk/test/jdk/com/sun/jdi \
[2025-10-22T03:00:01.230Z] -Dtest.modules=jdk.jdi \
[2025-10-22T03:00:01.230Z] -classpath /Users/admin/workspace/workspace/Test_openjdk21_hs_extended.openjdk_aarch64_mac_testList_3/aqa-tests/TKG/output_17610981702766/jdk_jdi_1/work/classes/0/com/sun/jdi/FinalizerTest.d:/Users/admin/workspace/workspace/Test_openjdk21_hs_extended.openjdk_aarch64_mac_testList_3/aqa-tests/openjdk/openjdk-jdk/test/jdk/com/sun/jdi:/Users/admin/workspace/workspace/Test_openjdk21_hs_extended.openjdk_aarch64_mac_testList_3/jvmtest/openjdk/jtreg/lib/javatest.jar:/Users/admin/workspace/workspace/Test_openjdk21_hs_extended.openjdk_aarch64_mac_testList_3/jvmtest/openjdk/jtreg/lib/jtreg.jar \
[2025-10-22T03:00:01.230Z] FinalizerTest
[2025-10-22T03:00:01.230Z] STDERR:
[2025-10-22T03:00:01.230Z] [0ms] run args: [FinalizerTarg]
[2025-10-22T03:00:01.230Z] [36ms] Breakpoint at finalize:68 (0)
[2025-10-22T03:00:01.230Z] [37ms] Try a stepOverLine()...
[2025-10-22T03:00:01.230Z] [39ms] Step Complete at finalize:70 (4)
[2025-10-22T03:00:01.230Z] [128ms] Note: Unexpected Debuggee Exception: java.lang.OutOfMemoryError at line 145
[2025-10-22T03:00:01.230Z] [130ms] detailMessage = "Java heap space"
[2025-10-22T03:00:01.230Z] java.lang.RuntimeException: Invalid debuggee exitValue: 1
[2025-10-22T03:00:01.230Z] at TestScaffold.waitForVMDisconnect(TestScaffold.java:787)
[2025-10-22T03:00:01.230Z] at TestScaffold.resumeToVMDisconnect(TestScaffold.java:1015)
[2025-10-22T03:00:01.230Z] at TestScaffold.listenUntilVMDisconnect(TestScaffold.java:743)
[2025-10-22T03:00:01.230Z] at FinalizerTest.runTests(FinalizerTest.java:186)
[2025-10-22T03:00:01.230Z] at TestScaffold.startTests(TestScaffold.java:468)
[2025-10-22T03:00:01.230Z] at FinalizerTest.main(FinalizerTest.java:121)
[2025-10-22T03:00:01.230Z] at java.base/jdk.internal.reflect.DirectMethodHandleAccessor.invoke(DirectMethodHandleAccessor.java:103)
[2025-10-22T03:00:01.230Z] at java.base/java.lang.reflect.Method.invoke(Method.java:580)
[2025-10-22T03:00:01.230Z] at com.sun.javatest.regtest.agent.MainActionHelper$AgentVMRunnable.run(MainActionHelper.java:333)
[2025-10-22T03:00:01.230Z] at java.base/java.lang.Thread.run(Thread.java:1583)
[2025-10-22T03:00:01.230Z]
[2025-10-22T03:00:01.230Z] JavaTest Message: Test threw exception: java.lang.RuntimeException
[2025-10-22T03:00:01.230Z] JavaTest Message: shutting down test
[2025-10-22T03:00:01.230Z]
[2025-10-22T03:00:01.230Z] STDOUT:
[2025-10-22T03:00:01.230Z] vmOpts: '-ea -esa -Xmx512m -XX:-UseCompressedOops'
[2025-10-22T03:00:01.230Z] javaOpts: ''
[2025-10-22T03:00:01.230Z] JVM version:21.0.9
[2025-10-22T03:00:01.230Z] JDI version: 21.0
[2025-10-22T03:00:01.230Z] JVM description: Java Debug Interface (Reference Implementation) version 21.0
[2025-10-22T03:00:01.230Z] Java Debug Wire Protocol (Reference Implementation) version 21.0
[2025-10-22T03:00:01.230Z] JVM Debug Interface version 21.0
[2025-10-22T03:00:01.230Z] JVM version 21.0.9 (OpenJDK 64-Bit Server VM, mixed mode, sharing)
[2025-10-22T03:00:01.230Z] Allocated 10000000
[2025-10-22T03:00:01.230Z] Allocated 10000000
[2025-10-22T03:00:01.230Z] Allocated 10000000
[2025-10-22T03:00:01.230Z] Allocated 10000000
[2025-10-22T03:00:01.230Z] Allocated 10000000
[2025-10-22T03:00:01.230Z] Allocated 10000000
[2025-10-22T03:00:01.230Z] Allocated 10000000
[2025-10-22T03:00:01.230Z] Allocated 10000000
[2025-10-22T03:00:01.230Z] Allocated 10000000
[2025-10-22T03:00:01.230Z] Allocated 10000000
[2025-10-22T03:00:01.230Z] Allocated 10000000
[2025-10-22T03:00:01.230Z] Allocated 10000000
[2025-10-22T03:00:01.230Z] Allocated 10000000
[2025-10-22T03:00:01.230Z] Allocated 10000000
[2025-10-22T03:00:01.230Z] Allocated 10000000
[2025-10-22T03:00:01.230Z] Allocated 10000000
[2025-10-22T03:00:01.230Z] Allocated 10000000
[2025-10-22T03:00:01.230Z] Allocated 10000000
[2025-10-22T03:00:01.230Z] Allocated 10000000
[2025-10-22T03:00:01.230Z] Allocated 10000000
[2025-10-22T03:00:01.230Z] Allocated 10000000
[2025-10-22T03:00:01.230Z] Allocated 10000000
[2025-10-22T03:00:01.230Z] Allocated 10000000
[2025-10-22T03:00:01.230Z] Allocated 10000000
[2025-10-22T03:00:01.230Z] Allocated 10000000
[2025-10-22T03:00:01.230Z] Allocated 10000000
[2025-10-22T03:00:01.230Z] Allocated 10000000
[2025-10-22T03:00:01.230Z] Allocated 10000000
[2025-10-22T03:00:01.230Z] Allocated 10000000
[2025-10-22T03:00:01.230Z] Allocated 10000000
[2025-10-22T03:00:01.230Z] Allocated 10000000
[2025-10-22T03:00:01.230Z] Allocated 10000000
[2025-10-22T03:00:01.230Z] Allocated 10000000
[2025-10-22T03:00:01.230Z] Allocated 10000000
[2025-10-22T03:00:01.230Z] Allocated 10000000
[2025-10-22T03:00:01.230Z] Allocated 10000000
[2025-10-22T03:00:01.230Z] Allocated 10000000
[2025-10-22T03:00:01.230Z] Allocated 10000000
[2025-10-22T03:00:01.230Z] Allocated 10000000
[2025-10-22T03:00:01.230Z] Allocated 10000000
[2025-10-22T03:00:01.230Z] Allocated 10000000
[2025-10-22T03:00:01.230Z] Allocated 10000000
[2025-10-22T03:00:01.230Z] Allocated 10000000
[2025-10-22T03:00:01.230Z] Allocated 10000000
[2025-10-22T03:00:01.230Z] Allocated 10000000
[2025-10-22T03:00:01.230Z] Allocated 10000000
[2025-10-22T03:00:01.230Z] Allocated 10000000
[2025-10-22T03:00:01.230Z] Allocated 10000000
[2025-10-22T03:00:01.230Z] Allocated 10000000
[2025-10-22T03:00:01.230Z] Allocated 10000000
[2025-10-22T03:00:01.230Z] Exception in thread "main" java.lang.OutOfMemoryError: Java heap space
[2025-10-22T03:00:01.230Z] at java.base/java.lang.ref.Finalizer.runFinalization(Finalizer.java:145)
[2025-10-22T03:00:01.230Z] at java.base/java.lang.ref.Reference$1.runFinalization(Reference.java:331)
[2025-10-22T03:00:01.230Z] at java.base/java.lang.Runtime.runFinalization(Runtime.java:788)
[2025-10-22T03:00:01.230Z] at java.base/java.lang.System.runFinalization(System.java:1982)
[2025-10-22T03:00:01.230Z] at FinalizerTarg.waitForAFinalizer(FinalizerTest.java:100)
[2025-10-22T03:00:01.230Z] at FinalizerTarg.main(FinalizerTest.java:111)
[2025-10-22T03:00:01.230Z]
[2025-10-22T03:00:01.230Z] TEST RESULT: Failed. Execution failed: `main' threw exception: java.lang.RuntimeException: Invalid debuggee exitValue: 1
[2025-10-22T03:00:01.230Z] --------------------------------------------------
[2025-10-22T03:04:26.506Z] Test results: passed: 179; failed: 1
[2025-10-22T03:04:26.506Z] Report written to /Users/admin/workspace/workspace/Test_openjdk21_hs_extended.openjdk_aarch64_mac_testList_3/aqa-tests/TKG/output_17610981702766/jdk_jdi_1/report/html/report.html
[2025-10-22T03:04:26.506Z] Results written to /Users/admin/workspace/workspace/Test_openjdk21_hs_extended.openjdk_aarch64_mac_testList_3/aqa-tests/TKG/output_17610981702766/jdk_jdi_1/work
[2025-10-22T03:04:26.506Z] Error: Some tests failed or other problems occurred.
[2025-10-22T03:04:26.506Z] -----------------------------------
[2025-10-22T03:04:26.506Z] jdk_jdi_1_FAILED
[2025-10-22T03:04:26.506Z] -----------------------------------
[2025-10-22T03:04:26.506Z]
[2025-10-22T03:04:26.506Z] TEST TEARDOWN:
[2025-10-22T03:04:26.506Z] Nothing to be done for teardown.
[2025-10-22T03:04:26.506Z] jdk_jdi_1 Finish Time: Tue Oct 21 23:04:20 2025 Epoch Time (ms): 1761102260901