hotspot_tier1_serviceability_0
[2025-08-20T21:59:05.035Z] Running test hotspot_tier1_serviceability_0 ...
[2025-08-20T21:59:05.035Z] ===============================================
[2025-08-20T21:59:05.035Z] hotspot_tier1_serviceability_0 Start Time: Wed Aug 20 14:59:02 2025 Epoch Time (ms): 1755727142619
[2025-08-20T21:59:05.035Z] variation: NoOptions
[2025-08-20T21:59:05.657Z] JVM_OPTIONS:
[2025-08-20T21:59:05.658Z] { \
[2025-08-20T21:59:05.658Z] echo ""; echo "TEST SETUP:"; \
[2025-08-20T21:59:05.658Z] echo "Nothing to be done for setup."; \
[2025-08-20T21:59:05.658Z] mkdir -p "/Users/admin/workspace/workspace/Test_openjdk21_hs_sanity.openjdk_x86-64_mac_testList_2/aqa-tests/TKG/../TKG/output_17557239944767/hotspot_tier1_serviceability_0"; \
[2025-08-20T21:59:05.658Z] cd "/Users/admin/workspace/workspace/Test_openjdk21_hs_sanity.openjdk_x86-64_mac_testList_2/aqa-tests/TKG/../TKG/output_17557239944767/hotspot_tier1_serviceability_0"; \
[2025-08-20T21:59:05.658Z] echo ""; echo "TESTING:"; \
[2025-08-20T21:59:05.658Z] "/Users/admin/workspace/workspace/Test_openjdk21_hs_sanity.openjdk_x86-64_mac_testList_2/jdkbinary/j2sdk-image/Contents/Home/bin/..//bin/java" -Xmx512m -jar "/Users/admin/workspace/workspace/Test_openjdk21_hs_sanity.openjdk_x86-64_mac_testList_2/aqa-tests/TKG/../../jvmtest/openjdk/jtreg/lib/jtreg.jar" \
[2025-08-20T21:59:05.658Z] -agentvm -a -ea -esa -v:fail,error,time,nopass -retain:fail,error,*.dmp,javacore.*,heapdump.*,*.trc -ignore:quiet -timeoutFactor:8 -xml:verify -concurrency:2 -nativepath:"/Users/admin/workspace/workspace/Test_openjdk21_hs_sanity.openjdk_x86-64_mac_testList_2/jdkbinary/openjdk-test-image/hotspot/jtreg/native" -vmoptions:"-Xmx512m " \
[2025-08-20T21:59:05.658Z] -w ""/Users/admin/workspace/workspace/Test_openjdk21_hs_sanity.openjdk_x86-64_mac_testList_2/aqa-tests/TKG/../TKG/output_17557239944767/hotspot_tier1_serviceability_0"/work" \
[2025-08-20T21:59:05.658Z] -r ""/Users/admin/workspace/workspace/Test_openjdk21_hs_sanity.openjdk_x86-64_mac_testList_2/aqa-tests/TKG/../TKG/output_17557239944767/hotspot_tier1_serviceability_0"/report" \
[2025-08-20T21:59:05.658Z] -jdk:"/Users/admin/workspace/workspace/Test_openjdk21_hs_sanity.openjdk_x86-64_mac_testList_2/jdkbinary/j2sdk-image/Contents/Home/bin/../" \
[2025-08-20T21:59:05.658Z] -exclude:"/Users/admin/workspace/workspace/Test_openjdk21_hs_sanity.openjdk_x86-64_mac_testList_2/aqa-tests/TKG/../openjdk/openjdk-jdk/test/hotspot/jtreg/ProblemList.txt" \
[2025-08-20T21:59:05.658Z] -exclude:"/Users/admin/workspace/workspace/Test_openjdk21_hs_sanity.openjdk_x86-64_mac_testList_2/aqa-tests/TKG/../../jvmtest/openjdk/excludes/ProblemList_openjdk21.txt" \
[2025-08-20T21:59:05.658Z] \
[2025-08-20T21:59:05.658Z] -exclude:"/Users/admin/workspace/workspace/Test_openjdk21_hs_sanity.openjdk_x86-64_mac_testList_2/aqa-tests/TKG/../openjdk/excludes/vendors/eclipse/ProblemList_openjdk21.txt" \
[2025-08-20T21:59:05.658Z] "/Users/admin/workspace/workspace/Test_openjdk21_hs_sanity.openjdk_x86-64_mac_testList_2/aqa-tests/TKG/../openjdk/openjdk-jdk/test/hotspot/jtreg:tier1_serviceability"; \
[2025-08-20T21:59:05.658Z] if [ $? -eq 0 ]; then echo "-----------------------------------"; echo "hotspot_tier1_serviceability_0""_PASSED"; echo "-----------------------------------"; cd /Users/admin/workspace/workspace/Test_openjdk21_hs_sanity.openjdk_x86-64_mac_testList_2/aqa-tests/TKG/..; else echo "-----------------------------------"; echo "hotspot_tier1_serviceability_0""_FAILED"; echo "-----------------------------------"; fi; \
[2025-08-20T21:59:05.658Z] echo ""; echo "TEST TEARDOWN:"; \
[2025-08-20T21:59:05.658Z] echo "Nothing to be done for teardown."; \
[2025-08-20T21:59:05.658Z] } 2>&1 | tee -a "/Users/admin/workspace/workspace/Test_openjdk21_hs_sanity.openjdk_x86-64_mac_testList_2/aqa-tests/TKG/../TKG/output_17557239944767/TestTargetResult";
[2025-08-20T21:59:05.658Z]
[2025-08-20T21:59:05.658Z] TEST SETUP:
[2025-08-20T21:59:05.658Z] Nothing to be done for setup.
[2025-08-20T21:59:05.658Z]
[2025-08-20T21:59:05.658Z] TESTING:
[2025-08-20T21:59:16.007Z] Directory "/Users/admin/workspace/workspace/Test_openjdk21_hs_sanity.openjdk_x86-64_mac_testList_2/aqa-tests/TKG/../TKG/output_17557239944767/hotspot_tier1_serviceability_0/work" not found: creating
[2025-08-20T21:59:16.007Z] Directory "/Users/admin/workspace/workspace/Test_openjdk21_hs_sanity.openjdk_x86-64_mac_testList_2/aqa-tests/TKG/../TKG/output_17557239944767/hotspot_tier1_serviceability_0/report" not found: creating
[2025-08-20T21:59:46.322Z] XML output with verification to /Users/admin/workspace/workspace/Test_openjdk21_hs_sanity.openjdk_x86-64_mac_testList_2/aqa-tests/TKG/output_17557239944767/hotspot_tier1_serviceability_0/work
[2025-08-20T22:01:31.815Z] --------------------------------------------------
[2025-08-20T22:01:31.815Z] TEST: serviceability/jvmti/RedefineClasses/RedefineSharedClassJFR.java
[2025-08-20T22:01:31.815Z] TEST JDK: /Users/admin/workspace/workspace/Test_openjdk21_hs_sanity.openjdk_x86-64_mac_testList_2/jdkbinary/j2sdk-image/Contents/Home/bin/..
[2025-08-20T22:01:31.815Z]
[2025-08-20T22:01:31.815Z] ACTION: build -- Passed. Build successful
[2025-08-20T22:01:31.815Z] REASON: Named class compiled on demand
[2025-08-20T22:01:31.815Z] TIME: 2.666 seconds
[2025-08-20T22:01:31.815Z] messages:
[2025-08-20T22:01:31.815Z] command: build RedefineSharedClassJFR
[2025-08-20T22:01:31.815Z] reason: Named class compiled on demand
[2025-08-20T22:01:31.815Z] started: Wed Aug 20 15:01:13 PDT 2025
[2025-08-20T22:01:31.815Z] Test directory:
[2025-08-20T22:01:31.815Z] compile: RedefineSharedClassJFR
[2025-08-20T22:01:31.815Z] finished: Wed Aug 20 15:01:16 PDT 2025
[2025-08-20T22:01:31.815Z] elapsed time (seconds): 2.666
[2025-08-20T22:01:31.815Z]
[2025-08-20T22:01:31.815Z] ACTION: compile -- Passed. Compilation successful
[2025-08-20T22:01:31.815Z] REASON: .class file out of date or does not exist
[2025-08-20T22:01:31.815Z] TIME: 2.666 seconds
[2025-08-20T22:01:31.815Z] messages:
[2025-08-20T22:01:31.815Z] command: compile /Users/admin/workspace/workspace/Test_openjdk21_hs_sanity.openjdk_x86-64_mac_testList_2/aqa-tests/openjdk/openjdk-jdk/test/hotspot/jtreg/serviceability/jvmti/RedefineClasses/RedefineSharedClassJFR.java
[2025-08-20T22:01:31.815Z] reason: .class file out of date or does not exist
[2025-08-20T22:01:31.815Z] started: Wed Aug 20 15:01:13 PDT 2025
[2025-08-20T22:01:31.815Z] Mode: agentvm
[2025-08-20T22:01:31.815Z] Agent id: 2
[2025-08-20T22:01:31.815Z] finished: Wed Aug 20 15:01:16 PDT 2025
[2025-08-20T22:01:31.815Z] elapsed time (seconds): 2.666
[2025-08-20T22:01:31.815Z] configuration:
[2025-08-20T22:01:31.815Z] Boot Layer (javac runtime environment)
[2025-08-20T22:01:31.815Z] class path: /Users/admin/workspace/workspace/Test_openjdk21_hs_sanity.openjdk_x86-64_mac_testList_2/jvmtest/openjdk/jtreg/lib/javatest.jar
[2025-08-20T22:01:31.815Z] /Users/admin/workspace/workspace/Test_openjdk21_hs_sanity.openjdk_x86-64_mac_testList_2/jvmtest/openjdk/jtreg/lib/jtreg.jar
[2025-08-20T22:01:31.815Z] patch: java.base /Users/admin/workspace/workspace/Test_openjdk21_hs_sanity.openjdk_x86-64_mac_testList_2/aqa-tests/TKG/output_17557239944767/hotspot_tier1_serviceability_0/work/patches/java.base
[2025-08-20T22:01:31.815Z]
[2025-08-20T22:01:31.815Z] javac compilation environment
[2025-08-20T22:01:31.815Z] source path: /Users/admin/workspace/workspace/Test_openjdk21_hs_sanity.openjdk_x86-64_mac_testList_2/aqa-tests/openjdk/openjdk-jdk/test/hotspot/jtreg/serviceability/jvmti/RedefineClasses
[2025-08-20T22:01:31.815Z] /Users/admin/workspace/workspace/Test_openjdk21_hs_sanity.openjdk_x86-64_mac_testList_2/aqa-tests/openjdk/openjdk-jdk/test/lib
[2025-08-20T22:01:31.815Z] class path: /Users/admin/workspace/workspace/Test_openjdk21_hs_sanity.openjdk_x86-64_mac_testList_2/aqa-tests/openjdk/openjdk-jdk/test/hotspot/jtreg/serviceability/jvmti/RedefineClasses
[2025-08-20T22:01:31.815Z] /Users/admin/workspace/workspace/Test_openjdk21_hs_sanity.openjdk_x86-64_mac_testList_2/aqa-tests/TKG/output_17557239944767/hotspot_tier1_serviceability_0/work/classes/1/serviceability/jvmti/RedefineClasses/RedefineSharedClassJFR.d
[2025-08-20T22:01:31.815Z] /Users/admin/workspace/workspace/Test_openjdk21_hs_sanity.openjdk_x86-64_mac_testList_2/aqa-tests/TKG/output_17557239944767/hotspot_tier1_serviceability_0/work/classes/1/test/lib
[2025-08-20T22:01:31.815Z]
[2025-08-20T22:01:31.815Z] rerun:
[2025-08-20T22:01:31.815Z] cd /Users/admin/workspace/workspace/Test_openjdk21_hs_sanity.openjdk_x86-64_mac_testList_2/aqa-tests/TKG/output_17557239944767/hotspot_tier1_serviceability_0/work/scratch/1 && \
[2025-08-20T22:01:31.815Z] HOME=/Users/admin \
[2025-08-20T22:01:31.815Z] PATH=/bin:/usr/bin:/usr/sbin \
[2025-08-20T22:01:31.815Z] /Users/admin/workspace/workspace/Test_openjdk21_hs_sanity.openjdk_x86-64_mac_testList_2/jdkbinary/j2sdk-image/Contents/Home/bin/../bin/javac \
[2025-08-20T22:01:31.815Z] -J-ea \
[2025-08-20T22:01:31.815Z] -J-esa \
[2025-08-20T22:01:31.815Z] -J-Xmx512m \
[2025-08-20T22:01:31.815Z] -J-Dtest.vm.opts='-ea -esa -Xmx512m' \
[2025-08-20T22:01:31.815Z] -J-Dtest.tool.vm.opts='-J-ea -J-esa -J-Xmx512m' \
[2025-08-20T22:01:31.815Z] -J-Dtest.compiler.opts= \
[2025-08-20T22:01:31.815Z] -J-Dtest.java.opts= \
[2025-08-20T22:01:31.815Z] -J-Dtest.jdk=/Users/admin/workspace/workspace/Test_openjdk21_hs_sanity.openjdk_x86-64_mac_testList_2/jdkbinary/j2sdk-image/Contents/Home/bin/.. \
[2025-08-20T22:01:31.815Z] -J-Dcompile.jdk=/Users/admin/workspace/workspace/Test_openjdk21_hs_sanity.openjdk_x86-64_mac_testList_2/jdkbinary/j2sdk-image/Contents/Home/bin/.. \
[2025-08-20T22:01:31.815Z] -J-Dtest.timeout.factor=8.0 \
[2025-08-20T22:01:31.815Z] -J-Dtest.nativepath=/Users/admin/workspace/workspace/Test_openjdk21_hs_sanity.openjdk_x86-64_mac_testList_2/jdkbinary/openjdk-test-image/hotspot/jtreg/native \
[2025-08-20T22:01:31.815Z] -J-Dtest.root=/Users/admin/workspace/workspace/Test_openjdk21_hs_sanity.openjdk_x86-64_mac_testList_2/aqa-tests/openjdk/openjdk-jdk/test/hotspot/jtreg \
[2025-08-20T22:01:31.815Z] -J-Dtest.name=serviceability/jvmti/RedefineClasses/RedefineSharedClassJFR.java \
[2025-08-20T22:01:31.815Z] -J-Dtest.file=/Users/admin/workspace/workspace/Test_openjdk21_hs_sanity.openjdk_x86-64_mac_testList_2/aqa-tests/openjdk/openjdk-jdk/test/hotspot/jtreg/serviceability/jvmti/RedefineClasses/RedefineSharedClassJFR.java \
[2025-08-20T22:01:31.815Z] -J-Dtest.src=/Users/admin/workspace/workspace/Test_openjdk21_hs_sanity.openjdk_x86-64_mac_testList_2/aqa-tests/openjdk/openjdk-jdk/test/hotspot/jtreg/serviceability/jvmti/RedefineClasses \
[2025-08-20T22:01:31.815Z] -J-Dtest.src.path=/Users/admin/workspace/workspace/Test_openjdk21_hs_sanity.openjdk_x86-64_mac_testList_2/aqa-tests/openjdk/openjdk-jdk/test/hotspot/jtreg/serviceability/jvmti/RedefineClasses:/Users/admin/workspace/workspace/Test_openjdk21_hs_sanity.openjdk_x86-64_mac_testList_2/aqa-tests/openjdk/openjdk-jdk/test/lib \
[2025-08-20T22:01:31.815Z] -J-Dtest.classes=/Users/admin/workspace/workspace/Test_openjdk21_hs_sanity.openjdk_x86-64_mac_testList_2/aqa-tests/TKG/output_17557239944767/hotspot_tier1_serviceability_0/work/classes/1/serviceability/jvmti/RedefineClasses/RedefineSharedClassJFR.d \
[2025-08-20T22:01:31.815Z] -J-Dtest.class.path=/Users/admin/workspace/workspace/Test_openjdk21_hs_sanity.openjdk_x86-64_mac_testList_2/aqa-tests/TKG/output_17557239944767/hotspot_tier1_serviceability_0/work/classes/1/serviceability/jvmti/RedefineClasses/RedefineSharedClassJFR.d:/Users/admin/workspace/workspace/Test_openjdk21_hs_sanity.openjdk_x86-64_mac_testList_2/aqa-tests/TKG/output_17557239944767/hotspot_tier1_serviceability_0/work/classes/1/test/lib \
[2025-08-20T22:01:31.815Z] -J-Dtest.class.path.prefix=/Users/admin/workspace/workspace/Test_openjdk21_hs_sanity.openjdk_x86-64_mac_testList_2/aqa-tests/TKG/output_17557239944767/hotspot_tier1_serviceability_0/work/classes/1/serviceability/jvmti/RedefineClasses/RedefineSharedClassJFR.d:/Users/admin/workspace/workspace/Test_openjdk21_hs_sanity.openjdk_x86-64_mac_testList_2/aqa-tests/openjdk/openjdk-jdk/test/hotspot/jtreg/serviceability/jvmti/RedefineClasses:/Users/admin/workspace/workspace/Test_openjdk21_hs_sanity.openjdk_x86-64_mac_testList_2/aqa-tests/TKG/output_17557239944767/hotspot_tier1_serviceability_0/work/classes/1/test/lib \
[2025-08-20T22:01:31.815Z] -d /Users/admin/workspace/workspace/Test_openjdk21_hs_sanity.openjdk_x86-64_mac_testList_2/aqa-tests/TKG/output_17557239944767/hotspot_tier1_serviceability_0/work/classes/1/serviceability/jvmti/RedefineClasses/RedefineSharedClassJFR.d \
[2025-08-20T22:01:31.815Z] -sourcepath /Users/admin/workspace/workspace/Test_openjdk21_hs_sanity.openjdk_x86-64_mac_testList_2/aqa-tests/openjdk/openjdk-jdk/test/hotspot/jtreg/serviceability/jvmti/RedefineClasses:/Users/admin/workspace/workspace/Test_openjdk21_hs_sanity.openjdk_x86-64_mac_testList_2/aqa-tests/openjdk/openjdk-jdk/test/lib \
[2025-08-20T22:01:31.815Z] -classpath /Users/admin/workspace/workspace/Test_openjdk21_hs_sanity.openjdk_x86-64_mac_testList_2/aqa-tests/openjdk/openjdk-jdk/test/hotspot/jtreg/serviceability/jvmti/RedefineClasses:/Users/admin/workspace/workspace/Test_openjdk21_hs_sanity.openjdk_x86-64_mac_testList_2/aqa-tests/TKG/output_17557239944767/hotspot_tier1_serviceability_0/work/classes/1/serviceability/jvmti/RedefineClasses/RedefineSharedClassJFR.d:/Users/admin/workspace/workspace/Test_openjdk21_hs_sanity.openjdk_x86-64_mac_testList_2/aqa-tests/TKG/output_17557239944767/hotspot_tier1_serviceability_0/work/classes/1/test/lib /Users/admin/workspace/workspace/Test_openjdk21_hs_sanity.openjdk_x86-64_mac_testList_2/aqa-tests/openjdk/openjdk-jdk/test/hotspot/jtreg/serviceability/jvmti/RedefineClasses/RedefineSharedClassJFR.java
[2025-08-20T22:01:31.815Z]
[2025-08-20T22:01:31.815Z] ACTION: driver -- Passed. Execution successful
[2025-08-20T22:01:31.815Z] REASON: User specified action: run driver RedefineSharedClassJFR xshare-off
[2025-08-20T22:01:31.815Z] TIME: 4.2 seconds
[2025-08-20T22:01:31.815Z] messages:
[2025-08-20T22:01:31.815Z] command: driver RedefineSharedClassJFR xshare-off
[2025-08-20T22:01:31.815Z] reason: User specified action: run driver RedefineSharedClassJFR xshare-off
[2025-08-20T22:01:31.815Z] started: Wed Aug 20 15:01:16 PDT 2025
[2025-08-20T22:01:31.815Z] Mode: agentvm
[2025-08-20T22:01:31.815Z] Agent id: 4
[2025-08-20T22:01:31.815Z] finished: Wed Aug 20 15:01:20 PDT 2025
[2025-08-20T22:01:31.815Z] elapsed time (seconds): 4.2
[2025-08-20T22:01:31.815Z] configuration:
[2025-08-20T22:01:31.815Z] Boot Layer
[2025-08-20T22:01:31.815Z] class path: /Users/admin/workspace/workspace/Test_openjdk21_hs_sanity.openjdk_x86-64_mac_testList_2/jvmtest/openjdk/jtreg/lib/javatest.jar
[2025-08-20T22:01:31.815Z] /Users/admin/workspace/workspace/Test_openjdk21_hs_sanity.openjdk_x86-64_mac_testList_2/jvmtest/openjdk/jtreg/lib/jtreg.jar
[2025-08-20T22:01:31.815Z] /Users/admin/workspace/workspace/Test_openjdk21_hs_sanity.openjdk_x86-64_mac_testList_2/jvmtest/openjdk/jtreg/lib/junit-platform-console-standalone-1.9.2.jar
[2025-08-20T22:01:31.815Z] /Users/admin/workspace/workspace/Test_openjdk21_hs_sanity.openjdk_x86-64_mac_testList_2/jvmtest/openjdk/jtreg/lib/testng-7.3.0.jar
[2025-08-20T22:01:31.815Z] /Users/admin/workspace/workspace/Test_openjdk21_hs_sanity.openjdk_x86-64_mac_testList_2/jvmtest/openjdk/jtreg/lib/guice-5.1.0.jar
[2025-08-20T22:01:31.815Z] /Users/admin/workspace/workspace/Test_openjdk21_hs_sanity.openjdk_x86-64_mac_testList_2/jvmtest/openjdk/jtreg/lib/jcommander-1.82.jar
[2025-08-20T22:01:31.815Z] patch: java.base /Users/admin/workspace/workspace/Test_openjdk21_hs_sanity.openjdk_x86-64_mac_testList_2/aqa-tests/TKG/output_17557239944767/hotspot_tier1_serviceability_0/work/patches/java.base
[2025-08-20T22:01:31.815Z]
[2025-08-20T22:01:31.815Z] Test Layer
[2025-08-20T22:01:31.815Z] class path: /Users/admin/workspace/workspace/Test_openjdk21_hs_sanity.openjdk_x86-64_mac_testList_2/aqa-tests/TKG/output_17557239944767/hotspot_tier1_serviceability_0/work/classes/1/serviceability/jvmti/RedefineClasses/RedefineSharedClassJFR.d
[2025-08-20T22:01:31.815Z] /Users/admin/workspace/workspace/Test_openjdk21_hs_sanity.openjdk_x86-64_mac_testList_2/aqa-tests/openjdk/openjdk-jdk/test/hotspot/jtreg/serviceability/jvmti/RedefineClasses
[2025-08-20T22:01:31.815Z] /Users/admin/workspace/workspace/Test_openjdk21_hs_sanity.openjdk_x86-64_mac_testList_2/aqa-tests/TKG/output_17557239944767/hotspot_tier1_serviceability_0/work/classes/1/test/lib
[2025-08-20T22:01:31.815Z] /Users/admin/workspace/workspace/Test_openjdk21_hs_sanity.openjdk_x86-64_mac_testList_2/aqa-tests/openjdk/openjdk-jdk/test/lib
[2025-08-20T22:01:31.815Z]
[2025-08-20T22:01:31.815Z] rerun:
[2025-08-20T22:01:31.815Z] cd /Users/admin/workspace/workspace/Test_openjdk21_hs_sanity.openjdk_x86-64_mac_testList_2/aqa-tests/TKG/output_17557239944767/hotspot_tier1_serviceability_0/work/scratch/1 && \
[2025-08-20T22:01:31.815Z] HOME=/Users/admin \
[2025-08-20T22:01:31.815Z] PATH=/bin:/usr/bin:/usr/sbin \
[2025-08-20T22:01:31.815Z] /Users/admin/workspace/workspace/Test_openjdk21_hs_sanity.openjdk_x86-64_mac_testList_2/jdkbinary/j2sdk-image/Contents/Home/bin/../bin/java \
[2025-08-20T22:01:31.815Z] -Dtest.vm.opts='-ea -esa -Xmx512m' \
[2025-08-20T22:01:31.815Z] -Dtest.tool.vm.opts='-J-ea -J-esa -J-Xmx512m' \
[2025-08-20T22:01:31.815Z] -Dtest.compiler.opts= \
[2025-08-20T22:01:31.815Z] -Dtest.java.opts= \
[2025-08-20T22:01:31.815Z] -Dtest.jdk=/Users/admin/workspace/workspace/Test_openjdk21_hs_sanity.openjdk_x86-64_mac_testList_2/jdkbinary/j2sdk-image/Contents/Home/bin/.. \
[2025-08-20T22:01:31.815Z] -Dcompile.jdk=/Users/admin/workspace/workspace/Test_openjdk21_hs_sanity.openjdk_x86-64_mac_testList_2/jdkbinary/j2sdk-image/Contents/Home/bin/.. \
[2025-08-20T22:01:31.815Z] -Dtest.timeout.factor=8.0 \
[2025-08-20T22:01:31.815Z] -Dtest.nativepath=/Users/admin/workspace/workspace/Test_openjdk21_hs_sanity.openjdk_x86-64_mac_testList_2/jdkbinary/openjdk-test-image/hotspot/jtreg/native \
[2025-08-20T22:01:31.815Z] -Dtest.root=/Users/admin/workspace/workspace/Test_openjdk21_hs_sanity.openjdk_x86-64_mac_testList_2/aqa-tests/openjdk/openjdk-jdk/test/hotspot/jtreg \
[2025-08-20T22:01:31.815Z] -Dtest.name=serviceability/jvmti/RedefineClasses/RedefineSharedClassJFR.java \
[2025-08-20T22:01:31.815Z] -Dtest.file=/Users/admin/workspace/workspace/Test_openjdk21_hs_sanity.openjdk_x86-64_mac_testList_2/aqa-tests/openjdk/openjdk-jdk/test/hotspot/jtreg/serviceability/jvmti/RedefineClasses/RedefineSharedClassJFR.java \
[2025-08-20T22:01:31.815Z] -Dtest.src=/Users/admin/workspace/workspace/Test_openjdk21_hs_sanity.openjdk_x86-64_mac_testList_2/aqa-tests/openjdk/openjdk-jdk/test/hotspot/jtreg/serviceability/jvmti/RedefineClasses \
[2025-08-20T22:01:31.815Z] -Dtest.src.path=/Users/admin/workspace/workspace/Test_openjdk21_hs_sanity.openjdk_x86-64_mac_testList_2/aqa-tests/openjdk/openjdk-jdk/test/hotspot/jtreg/serviceability/jvmti/RedefineClasses:/Users/admin/workspace/workspace/Test_openjdk21_hs_sanity.openjdk_x86-64_mac_testList_2/aqa-tests/openjdk/openjdk-jdk/test/lib \
[2025-08-20T22:01:31.815Z] -Dtest.classes=/Users/admin/workspace/workspace/Test_openjdk21_hs_sanity.openjdk_x86-64_mac_testList_2/aqa-tests/TKG/output_17557239944767/hotspot_tier1_serviceability_0/work/classes/1/serviceability/jvmti/RedefineClasses/RedefineSharedClassJFR.d \
[2025-08-20T22:01:31.815Z] -Dtest.class.path=/Users/admin/workspace/workspace/Test_openjdk21_hs_sanity.openjdk_x86-64_mac_testList_2/aqa-tests/TKG/output_17557239944767/hotspot_tier1_serviceability_0/work/classes/1/serviceability/jvmti/RedefineClasses/RedefineSharedClassJFR.d:/Users/admin/workspace/workspace/Test_openjdk21_hs_sanity.openjdk_x86-64_mac_testList_2/aqa-tests/TKG/output_17557239944767/hotspot_tier1_serviceability_0/work/classes/1/test/lib \
[2025-08-20T22:01:31.815Z] -Dtest.class.path.prefix=/Users/admin/workspace/workspace/Test_openjdk21_hs_sanity.openjdk_x86-64_mac_testList_2/aqa-tests/TKG/output_17557239944767/hotspot_tier1_serviceability_0/work/classes/1/serviceability/jvmti/RedefineClasses/RedefineSharedClassJFR.d:/Users/admin/workspace/workspace/Test_openjdk21_hs_sanity.openjdk_x86-64_mac_testList_2/aqa-tests/openjdk/openjdk-jdk/test/hotspot/jtreg/serviceability/jvmti/RedefineClasses:/Users/admin/workspace/workspace/Test_openjdk21_hs_sanity.openjdk_x86-64_mac_testList_2/aqa-tests/TKG/output_17557239944767/hotspot_tier1_serviceability_0/work/classes/1/test/lib \
[2025-08-20T22:01:31.815Z] -classpath /Users/admin/workspace/workspace/Test_openjdk21_hs_sanity.openjdk_x86-64_mac_testList_2/aqa-tests/TKG/output_17557239944767/hotspot_tier1_serviceability_0/work/classes/1/serviceability/jvmti/RedefineClasses/RedefineSharedClassJFR.d:/Users/admin/workspace/workspace/Test_openjdk21_hs_sanity.openjdk_x86-64_mac_testList_2/aqa-tests/openjdk/openjdk-jdk/test/hotspot/jtreg/serviceability/jvmti/RedefineClasses:/Users/admin/workspace/workspace/Test_openjdk21_hs_sanity.openjdk_x86-64_mac_testList_2/aqa-tests/TKG/output_17557239944767/hotspot_tier1_serviceability_0/work/classes/1/test/lib:/Users/admin/workspace/workspace/Test_openjdk21_hs_sanity.openjdk_x86-64_mac_testList_2/aqa-tests/openjdk/openjdk-jdk/test/lib:/Users/admin/workspace/workspace/Test_openjdk21_hs_sanity.openjdk_x86-64_mac_testList_2/jvmtest/openjdk/jtreg/lib/javatest.jar:/Users/admin/workspace/workspace/Test_openjdk21_hs_sanity.openjdk_x86-64_mac_testList_2/jvmtest/openjdk/jtreg/lib/jtreg.jar \
[2025-08-20T22:01:31.815Z] RedefineSharedClassJFR xshare-off
[2025-08-20T22:01:31.815Z] STDOUT:
[2025-08-20T22:01:31.816Z] Command line: [/Users/admin/workspace/workspace/Test_openjdk21_hs_sanity.openjdk_x86-64_mac_testList_2/jdkbinary/j2sdk-image/Contents/Home/bin/../bin/java -cp /Users/admin/workspace/workspace/Test_openjdk21_hs_sanity.openjdk_x86-64_mac_testList_2/aqa-tests/TKG/output_17557239944767/hotspot_tier1_serviceability_0/work/classes/1/serviceability/jvmti/RedefineClasses/RedefineSharedClassJFR.d:/Users/admin/workspace/workspace/Test_openjdk21_hs_sanity.openjdk_x86-64_mac_testList_2/aqa-tests/openjdk/openjdk-jdk/test/hotspot/jtreg/serviceability/jvmti/RedefineClasses:/Users/admin/workspace/workspace/Test_openjdk21_hs_sanity.openjdk_x86-64_mac_testList_2/aqa-tests/TKG/output_17557239944767/hotspot_tier1_serviceability_0/work/classes/1/test/lib:/Users/admin/workspace/workspace/Test_openjdk21_hs_sanity.openjdk_x86-64_mac_testList_2/jvmtest/openjdk/jtreg/lib/javatest.jar:/Users/admin/workspace/workspace/Test_openjdk21_hs_sanity.openjdk_x86-64_mac_testList_2/jvmtest/openjdk/jtreg/lib/jtreg.jar:/Users/admin/workspace/workspace/Test_openjdk21_hs_sanity.openjdk_x86-64_mac_testList_2/jvmtest/openjdk/jtreg/lib/junit-platform-console-standalone-1.9.2.jar:/Users/admin/workspace/workspace/Test_openjdk21_hs_sanity.openjdk_x86-64_mac_testList_2/jvmtest/openjdk/jtreg/lib/testng-7.3.0.jar:/Users/admin/workspace/workspace/Test_openjdk21_hs_sanity.openjdk_x86-64_mac_testList_2/jvmtest/openjdk/jtreg/lib/guice-5.1.0.jar:/Users/admin/workspace/workspace/Test_openjdk21_hs_sanity.openjdk_x86-64_mac_testList_2/jvmtest/openjdk/jtreg/lib/jcommander-1.82.jar -Xshare:off -XX:StartFlightRecording -Xlog:redefine+class+iklass+add=trace,redefine+class+iklass+purge=trace RedefineSharedClassJFR ]
[2025-08-20T22:01:31.816Z] [2025-08-20T22:01:16.204358Z] Gathering output for process 10378
[2025-08-20T22:01:31.816Z] [2025-08-20T22:01:20.253020Z] Waiting for completion for process 10378
[2025-08-20T22:01:31.816Z] [2025-08-20T22:01:20.253274Z] Waiting for completion finished for process 10378
[2025-08-20T22:01:31.816Z] STDERR:
[2025-08-20T22:01:31.816Z]
[2025-08-20T22:01:31.816Z] JavaTest Message: Test complete.
[2025-08-20T22:01:31.816Z]
[2025-08-20T22:01:31.816Z]
[2025-08-20T22:01:31.816Z] ACTION: build -- Passed. All files up to date
[2025-08-20T22:01:31.816Z] REASON: Named class compiled on demand
[2025-08-20T22:01:31.816Z] TIME: 0.0 seconds
[2025-08-20T22:01:31.816Z] messages:
[2025-08-20T22:01:31.816Z] command: build RedefineSharedClassJFR
[2025-08-20T22:01:31.816Z] reason: Named class compiled on demand
[2025-08-20T22:01:31.816Z] started: Wed Aug 20 15:01:20 PDT 2025
[2025-08-20T22:01:31.816Z] finished: Wed Aug 20 15:01:20 PDT 2025
[2025-08-20T22:01:31.816Z] elapsed time (seconds): 0.0
[2025-08-20T22:01:31.816Z]
[2025-08-20T22:01:31.816Z] ACTION: driver -- Failed. Execution failed: `main' threw exception: java.lang.RuntimeException: 'Class unloading: should_clean_previous_versions = false' missing from stdout/stderr
[2025-08-20T22:01:31.816Z] REASON: User specified action: run driver RedefineSharedClassJFR xshare-on
[2025-08-20T22:01:31.816Z] TIME: 0.387 seconds
[2025-08-20T22:01:31.816Z] messages:
[2025-08-20T22:01:31.816Z] command: driver RedefineSharedClassJFR xshare-on
[2025-08-20T22:01:31.816Z] reason: User specified action: run driver RedefineSharedClassJFR xshare-on
[2025-08-20T22:01:31.816Z] started: Wed Aug 20 15:01:20 PDT 2025
[2025-08-20T22:01:31.816Z] Mode: agentvm
[2025-08-20T22:01:31.816Z] Agent id: 4
[2025-08-20T22:01:31.816Z] finished: Wed Aug 20 15:01:20 PDT 2025
[2025-08-20T22:01:31.816Z] elapsed time (seconds): 0.387
[2025-08-20T22:01:31.816Z] configuration:
[2025-08-20T22:01:31.816Z] Boot Layer
[2025-08-20T22:01:31.816Z] class path: /Users/admin/workspace/workspace/Test_openjdk21_hs_sanity.openjdk_x86-64_mac_testList_2/jvmtest/openjdk/jtreg/lib/javatest.jar
[2025-08-20T22:01:31.816Z] /Users/admin/workspace/workspace/Test_openjdk21_hs_sanity.openjdk_x86-64_mac_testList_2/jvmtest/openjdk/jtreg/lib/jtreg.jar
[2025-08-20T22:01:31.816Z] /Users/admin/workspace/workspace/Test_openjdk21_hs_sanity.openjdk_x86-64_mac_testList_2/jvmtest/openjdk/jtreg/lib/junit-platform-console-standalone-1.9.2.jar
[2025-08-20T22:01:31.816Z] /Users/admin/workspace/workspace/Test_openjdk21_hs_sanity.openjdk_x86-64_mac_testList_2/jvmtest/openjdk/jtreg/lib/testng-7.3.0.jar
[2025-08-20T22:01:31.816Z] /Users/admin/workspace/workspace/Test_openjdk21_hs_sanity.openjdk_x86-64_mac_testList_2/jvmtest/openjdk/jtreg/lib/guice-5.1.0.jar
[2025-08-20T22:01:31.816Z] /Users/admin/workspace/workspace/Test_openjdk21_hs_sanity.openjdk_x86-64_mac_testList_2/jvmtest/openjdk/jtreg/lib/jcommander-1.82.jar
[2025-08-20T22:01:31.816Z] patch: java.base /Users/admin/workspace/workspace/Test_openjdk21_hs_sanity.openjdk_x86-64_mac_testList_2/aqa-tests/TKG/output_17557239944767/hotspot_tier1_serviceability_0/work/patches/java.base
[2025-08-20T22:01:31.816Z]
[2025-08-20T22:01:31.816Z] Test Layer
[2025-08-20T22:01:31.816Z] class path: /Users/admin/workspace/workspace/Test_openjdk21_hs_sanity.openjdk_x86-64_mac_testList_2/aqa-tests/TKG/output_17557239944767/hotspot_tier1_serviceability_0/work/classes/1/serviceability/jvmti/RedefineClasses/RedefineSharedClassJFR.d
[2025-08-20T22:01:31.816Z] /Users/admin/workspace/workspace/Test_openjdk21_hs_sanity.openjdk_x86-64_mac_testList_2/aqa-tests/openjdk/openjdk-jdk/test/hotspot/jtreg/serviceability/jvmti/RedefineClasses
[2025-08-20T22:01:31.816Z] /Users/admin/workspace/workspace/Test_openjdk21_hs_sanity.openjdk_x86-64_mac_testList_2/aqa-tests/TKG/output_17557239944767/hotspot_tier1_serviceability_0/work/classes/1/test/lib
[2025-08-20T22:01:31.816Z] /Users/admin/workspace/workspace/Test_openjdk21_hs_sanity.openjdk_x86-64_mac_testList_2/aqa-tests/openjdk/openjdk-jdk/test/lib
[2025-08-20T22:01:31.816Z]
[2025-08-20T22:01:31.816Z] rerun:
[2025-08-20T22:01:31.816Z] cd /Users/admin/workspace/workspace/Test_openjdk21_hs_sanity.openjdk_x86-64_mac_testList_2/aqa-tests/TKG/output_17557239944767/hotspot_tier1_serviceability_0/work/scratch/1 && \
[2025-08-20T22:01:31.816Z] HOME=/Users/admin \
[2025-08-20T22:01:31.816Z] PATH=/bin:/usr/bin:/usr/sbin \
[2025-08-20T22:01:31.816Z] /Users/admin/workspace/workspace/Test_openjdk21_hs_sanity.openjdk_x86-64_mac_testList_2/jdkbinary/j2sdk-image/Contents/Home/bin/../bin/java \
[2025-08-20T22:01:31.816Z] -Dtest.vm.opts='-ea -esa -Xmx512m' \
[2025-08-20T22:01:31.816Z] -Dtest.tool.vm.opts='-J-ea -J-esa -J-Xmx512m' \
[2025-08-20T22:01:31.816Z] -Dtest.compiler.opts= \
[2025-08-20T22:01:31.816Z] -Dtest.java.opts= \
[2025-08-20T22:01:31.816Z] -Dtest.jdk=/Users/admin/workspace/workspace/Test_openjdk21_hs_sanity.openjdk_x86-64_mac_testList_2/jdkbinary/j2sdk-image/Contents/Home/bin/.. \
[2025-08-20T22:01:31.816Z] -Dcompile.jdk=/Users/admin/workspace/workspace/Test_openjdk21_hs_sanity.openjdk_x86-64_mac_testList_2/jdkbinary/j2sdk-image/Contents/Home/bin/.. \
[2025-08-20T22:01:31.816Z] -Dtest.timeout.factor=8.0 \
[2025-08-20T22:01:31.816Z] -Dtest.nativepath=/Users/admin/workspace/workspace/Test_openjdk21_hs_sanity.openjdk_x86-64_mac_testList_2/jdkbinary/openjdk-test-image/hotspot/jtreg/native \
[2025-08-20T22:01:31.816Z] -Dtest.root=/Users/admin/workspace/workspace/Test_openjdk21_hs_sanity.openjdk_x86-64_mac_testList_2/aqa-tests/openjdk/openjdk-jdk/test/hotspot/jtreg \
[2025-08-20T22:01:31.816Z] -Dtest.name=serviceability/jvmti/RedefineClasses/RedefineSharedClassJFR.java \
[2025-08-20T22:01:31.816Z] -Dtest.file=/Users/admin/workspace/workspace/Test_openjdk21_hs_sanity.openjdk_x86-64_mac_testList_2/aqa-tests/openjdk/openjdk-jdk/test/hotspot/jtreg/serviceability/jvmti/RedefineClasses/RedefineSharedClassJFR.java \
[2025-08-20T22:01:31.816Z] -Dtest.src=/Users/admin/workspace/workspace/Test_openjdk21_hs_sanity.openjdk_x86-64_mac_testList_2/aqa-tests/openjdk/openjdk-jdk/test/hotspot/jtreg/serviceability/jvmti/RedefineClasses \
[2025-08-20T22:01:31.816Z] -Dtest.src.path=/Users/admin/workspace/workspace/Test_openjdk21_hs_sanity.openjdk_x86-64_mac_testList_2/aqa-tests/openjdk/openjdk-jdk/test/hotspot/jtreg/serviceability/jvmti/RedefineClasses:/Users/admin/workspace/workspace/Test_openjdk21_hs_sanity.openjdk_x86-64_mac_testList_2/aqa-tests/openjdk/openjdk-jdk/test/lib \
[2025-08-20T22:01:31.816Z] -Dtest.classes=/Users/admin/workspace/workspace/Test_openjdk21_hs_sanity.openjdk_x86-64_mac_testList_2/aqa-tests/TKG/output_17557239944767/hotspot_tier1_serviceability_0/work/classes/1/serviceability/jvmti/RedefineClasses/RedefineSharedClassJFR.d \
[2025-08-20T22:01:31.816Z] -Dtest.class.path=/Users/admin/workspace/workspace/Test_openjdk21_hs_sanity.openjdk_x86-64_mac_testList_2/aqa-tests/TKG/output_17557239944767/hotspot_tier1_serviceability_0/work/classes/1/serviceability/jvmti/RedefineClasses/RedefineSharedClassJFR.d:/Users/admin/workspace/workspace/Test_openjdk21_hs_sanity.openjdk_x86-64_mac_testList_2/aqa-tests/TKG/output_17557239944767/hotspot_tier1_serviceability_0/work/classes/1/test/lib \
[2025-08-20T22:01:31.816Z] -Dtest.class.path.prefix=/Users/admin/workspace/workspace/Test_openjdk21_hs_sanity.openjdk_x86-64_mac_testList_2/aqa-tests/TKG/output_17557239944767/hotspot_tier1_serviceability_0/work/classes/1/serviceability/jvmti/RedefineClasses/RedefineSharedClassJFR.d:/Users/admin/workspace/workspace/Test_openjdk21_hs_sanity.openjdk_x86-64_mac_testList_2/aqa-tests/openjdk/openjdk-jdk/test/hotspot/jtreg/serviceability/jvmti/RedefineClasses:/Users/admin/workspace/workspace/Test_openjdk21_hs_sanity.openjdk_x86-64_mac_testList_2/aqa-tests/TKG/output_17557239944767/hotspot_tier1_serviceability_0/work/classes/1/test/lib \
[2025-08-20T22:01:31.816Z] -classpath /Users/admin/workspace/workspace/Test_openjdk21_hs_sanity.openjdk_x86-64_mac_testList_2/aqa-tests/TKG/output_17557239944767/hotspot_tier1_serviceability_0/work/classes/1/serviceability/jvmti/RedefineClasses/RedefineSharedClassJFR.d:/Users/admin/workspace/workspace/Test_openjdk21_hs_sanity.openjdk_x86-64_mac_testList_2/aqa-tests/openjdk/openjdk-jdk/test/hotspot/jtreg/serviceability/jvmti/RedefineClasses:/Users/admin/workspace/workspace/Test_openjdk21_hs_sanity.openjdk_x86-64_mac_testList_2/aqa-tests/TKG/output_17557239944767/hotspot_tier1_serviceability_0/work/classes/1/test/lib:/Users/admin/workspace/workspace/Test_openjdk21_hs_sanity.openjdk_x86-64_mac_testList_2/aqa-tests/openjdk/openjdk-jdk/test/lib:/Users/admin/workspace/workspace/Test_openjdk21_hs_sanity.openjdk_x86-64_mac_testList_2/jvmtest/openjdk/jtreg/lib/javatest.jar:/Users/admin/workspace/workspace/Test_openjdk21_hs_sanity.openjdk_x86-64_mac_testList_2/jvmtest/openjdk/jtreg/lib/jtreg.jar \
[2025-08-20T22:01:31.816Z] RedefineSharedClassJFR xshare-on
[2025-08-20T22:01:31.816Z] STDOUT:
[2025-08-20T22:01:31.816Z] Command line: [/Users/admin/workspace/workspace/Test_openjdk21_hs_sanity.openjdk_x86-64_mac_testList_2/jdkbinary/j2sdk-image/Contents/Home/bin/../bin/java -cp /Users/admin/workspace/workspace/Test_openjdk21_hs_sanity.openjdk_x86-64_mac_testList_2/aqa-tests/TKG/output_17557239944767/hotspot_tier1_serviceability_0/work/classes/1/serviceability/jvmti/RedefineClasses/RedefineSharedClassJFR.d:/Users/admin/workspace/workspace/Test_openjdk21_hs_sanity.openjdk_x86-64_mac_testList_2/aqa-tests/openjdk/openjdk-jdk/test/hotspot/jtreg/serviceability/jvmti/RedefineClasses:/Users/admin/workspace/workspace/Test_openjdk21_hs_sanity.openjdk_x86-64_mac_testList_2/aqa-tests/TKG/output_17557239944767/hotspot_tier1_serviceability_0/work/classes/1/test/lib:/Users/admin/workspace/workspace/Test_openjdk21_hs_sanity.openjdk_x86-64_mac_testList_2/jvmtest/openjdk/jtreg/lib/javatest.jar:/Users/admin/workspace/workspace/Test_openjdk21_hs_sanity.openjdk_x86-64_mac_testList_2/jvmtest/openjdk/jtreg/lib/jtreg.jar:/Users/admin/workspace/workspace/Test_openjdk21_hs_sanity.openjdk_x86-64_mac_testList_2/jvmtest/openjdk/jtreg/lib/junit-platform-console-standalone-1.9.2.jar:/Users/admin/workspace/workspace/Test_openjdk21_hs_sanity.openjdk_x86-64_mac_testList_2/jvmtest/openjdk/jtreg/lib/testng-7.3.0.jar:/Users/admin/workspace/workspace/Test_openjdk21_hs_sanity.openjdk_x86-64_mac_testList_2/jvmtest/openjdk/jtreg/lib/guice-5.1.0.jar:/Users/admin/workspace/workspace/Test_openjdk21_hs_sanity.openjdk_x86-64_mac_testList_2/jvmtest/openjdk/jtreg/lib/jcommander-1.82.jar -Xshare:on -XX:StartFlightRecording -Xlog:redefine+class+iklass+add=trace,redefine+class+iklass+purge=trace RedefineSharedClassJFR ]
[2025-08-20T22:01:31.816Z] [2025-08-20T22:01:20.325698Z] Gathering output for process 10382
[2025-08-20T22:01:31.816Z] [2025-08-20T22:01:20.605960Z] Waiting for completion for process 10382
[2025-08-20T22:01:31.816Z] [2025-08-20T22:01:20.624261Z] Waiting for completion finished for process 10382
[2025-08-20T22:01:31.816Z] STDERR:
[2025-08-20T22:01:31.816Z] stdout: [[0.110s][error][cds] An error has occurred while processing the shared archive file.
[2025-08-20T22:01:31.816Z] [0.110s][error][cds] Unable to map shared spaces
[2025-08-20T22:01:31.816Z] Error occurred during initialization of VM
[2025-08-20T22:01:31.816Z] Unable to use shared archive.
[2025-08-20T22:01:31.816Z] ];
[2025-08-20T22:01:31.816Z] stderr: []
[2025-08-20T22:01:31.816Z] exitValue = 1
[2025-08-20T22:01:31.816Z]
[2025-08-20T22:01:31.816Z] java.lang.RuntimeException: 'Class unloading: should_clean_previous_versions = false' missing from stdout/stderr
[2025-08-20T22:01:31.816Z] at jdk.test.lib.process.OutputAnalyzer.shouldContain(OutputAnalyzer.java:238)
[2025-08-20T22:01:31.816Z] at RedefineSharedClassJFR.main(RedefineSharedClassJFR.java:94)
[2025-08-20T22:01:31.816Z] at java.base/jdk.internal.reflect.DirectMethodHandleAccessor.invoke(DirectMethodHandleAccessor.java:103)
[2025-08-20T22:01:31.816Z] at java.base/java.lang.reflect.Method.invoke(Method.java:580)
[2025-08-20T22:01:31.816Z] at com.sun.javatest.regtest.agent.MainActionHelper$AgentVMRunnable.run(MainActionHelper.java:333)
[2025-08-20T22:01:31.816Z] at java.base/java.lang.Thread.run(Thread.java:1583)
[2025-08-20T22:01:31.816Z]
[2025-08-20T22:01:31.816Z] JavaTest Message: Test threw exception: java.lang.RuntimeException
[2025-08-20T22:01:31.816Z] JavaTest Message: shutting down test
[2025-08-20T22:01:31.816Z]
[2025-08-20T22:01:31.816Z]
[2025-08-20T22:01:31.816Z] TEST RESULT: Failed. Execution failed: `main' threw exception: java.lang.RuntimeException: 'Class unloading: should_clean_previous_versions = false' missing from stdout/stderr
[2025-08-20T22:01:31.816Z] --------------------------------------------------
[2025-08-20T22:18:43.643Z] Test results: passed: 337; failed: 1
[2025-08-20T22:18:55.876Z] Report written to /Users/admin/workspace/workspace/Test_openjdk21_hs_sanity.openjdk_x86-64_mac_testList_2/aqa-tests/TKG/output_17557239944767/hotspot_tier1_serviceability_0/report/html/report.html
[2025-08-20T22:18:55.876Z] Results written to /Users/admin/workspace/workspace/Test_openjdk21_hs_sanity.openjdk_x86-64_mac_testList_2/aqa-tests/TKG/output_17557239944767/hotspot_tier1_serviceability_0/work
[2025-08-20T22:18:55.876Z] Error: Some tests failed or other problems occurred.
[2025-08-20T22:18:55.876Z] -----------------------------------
[2025-08-20T22:18:55.876Z] hotspot_tier1_serviceability_0_FAILED
[2025-08-20T22:18:55.876Z] -----------------------------------
[2025-08-20T22:18:55.876Z]
[2025-08-20T22:18:55.876Z] TEST TEARDOWN:
[2025-08-20T22:18:55.876Z] Nothing to be done for teardown.
[2025-08-20T22:18:55.876Z] hotspot_tier1_serviceability_0 Finish Time: Wed Aug 20 15:18:52 2025 Epoch Time (ms): 1755728332654