jdk_net_0
[2025-08-21T00:32:14.654Z] Running test jdk_net_0 ...
[2025-08-21T00:32:14.654Z] ===============================================
[2025-08-21T00:32:14.654Z] jdk_net_0 Start Time: Thu Aug 21 00:32:09 2025 Epoch Time (ms): 1755736329077
[2025-08-21T00:32:14.654Z] variation: Mode150
[2025-08-21T00:32:14.654Z] JVM_OPTIONS: -XX:+UseCompressedOops
[2025-08-21T00:32:14.654Z] { \
[2025-08-21T00:32:14.654Z] echo ""; echo "TEST SETUP:"; \
[2025-08-21T00:32:14.654Z] echo "Nothing to be done for setup."; \
[2025-08-21T00:32:14.654Z] mkdir -p "/home/jenkins/workspace/Test_openjdk21_hs_extended.openjdk_riscv64_linux_testList_7/aqa-tests/TKG/../TKG/output_17557317124199/jdk_net_0"; \
[2025-08-21T00:32:14.654Z] cd "/home/jenkins/workspace/Test_openjdk21_hs_extended.openjdk_riscv64_linux_testList_7/aqa-tests/TKG/../TKG/output_17557317124199/jdk_net_0"; \
[2025-08-21T00:32:14.654Z] echo ""; echo "TESTING:"; \
[2025-08-21T00:32:14.654Z] "/home/jenkins/workspace/Test_openjdk21_hs_extended.openjdk_riscv64_linux_testList_7/jdkbinary/j2sdk-image/bin/java" -Xmx512m -jar "/home/jenkins/workspace/Test_openjdk21_hs_extended.openjdk_riscv64_linux_testList_7/aqa-tests/TKG/../../jvmtest/openjdk/jtreg/lib/jtreg.jar" \
[2025-08-21T00:32:14.654Z] -agentvm -a -ea -esa -v:fail,error,time,nopass -retain:fail,error,*.dmp,javacore.*,heapdump.*,*.trc -ignore:quiet -timeoutFactor:16 -xml:verify -k:'!headful' -concurrency:3 -nativepath:"/home/jenkins/workspace/Test_openjdk21_hs_extended.openjdk_riscv64_linux_testList_7/jdkbinary/openjdk-test-image/jdk/jtreg/native" -vmoptions:"-Xmx512m -XX:+UseCompressedOops -Djava.awt.headless=true" \
[2025-08-21T00:32:14.654Z] -w ""/home/jenkins/workspace/Test_openjdk21_hs_extended.openjdk_riscv64_linux_testList_7/aqa-tests/TKG/../TKG/output_17557317124199/jdk_net_0"/work" \
[2025-08-21T00:32:14.654Z] -r ""/home/jenkins/workspace/Test_openjdk21_hs_extended.openjdk_riscv64_linux_testList_7/aqa-tests/TKG/../TKG/output_17557317124199/jdk_net_0"/report" \
[2025-08-21T00:32:14.654Z] -jdk:"/home/jenkins/workspace/Test_openjdk21_hs_extended.openjdk_riscv64_linux_testList_7/jdkbinary/j2sdk-image" \
[2025-08-21T00:32:14.654Z] -exclude:"/home/jenkins/workspace/Test_openjdk21_hs_extended.openjdk_riscv64_linux_testList_7/aqa-tests/TKG/../openjdk/openjdk-jdk/test/jdk/ProblemList.txt" \
[2025-08-21T00:32:14.654Z] -exclude:"/home/jenkins/workspace/Test_openjdk21_hs_extended.openjdk_riscv64_linux_testList_7/aqa-tests/TKG/../../jvmtest/openjdk/excludes/ProblemList_openjdk21.txt" \
[2025-08-21T00:32:14.654Z] \
[2025-08-21T00:32:14.654Z] -exclude:"/home/jenkins/workspace/Test_openjdk21_hs_extended.openjdk_riscv64_linux_testList_7/aqa-tests/TKG/../openjdk/excludes/vendors/eclipse/ProblemList_openjdk21.txt" \
[2025-08-21T00:32:14.654Z] "/home/jenkins/workspace/Test_openjdk21_hs_extended.openjdk_riscv64_linux_testList_7/aqa-tests/TKG/../openjdk/openjdk-jdk/test/jdk:jdk_net"; \
[2025-08-21T00:32:14.654Z] if [ $? -eq 0 ]; then echo "-----------------------------------"; echo "jdk_net_0""_PASSED"; echo "-----------------------------------"; cd /home/jenkins/workspace/Test_openjdk21_hs_extended.openjdk_riscv64_linux_testList_7/aqa-tests/TKG/..; else echo "-----------------------------------"; echo "jdk_net_0""_FAILED"; echo "-----------------------------------"; fi; \
[2025-08-21T00:32:14.654Z] echo ""; echo "TEST TEARDOWN:"; \
[2025-08-21T00:32:14.654Z] echo "Nothing to be done for teardown."; \
[2025-08-21T00:32:14.655Z] } 2>&1 | tee -a "/home/jenkins/workspace/Test_openjdk21_hs_extended.openjdk_riscv64_linux_testList_7/aqa-tests/TKG/../TKG/output_17557317124199/TestTargetResult";
[2025-08-21T00:32:14.655Z]
[2025-08-21T00:32:14.655Z] TEST SETUP:
[2025-08-21T00:32:14.655Z] Nothing to be done for setup.
[2025-08-21T00:32:14.655Z]
[2025-08-21T00:32:14.655Z] TESTING:
[2025-08-21T00:32:14.655Z] Directory "/home/jenkins/workspace/Test_openjdk21_hs_extended.openjdk_riscv64_linux_testList_7/aqa-tests/TKG/../TKG/output_17557317124199/jdk_net_0/work" not found: creating
[2025-08-21T00:32:14.655Z] Directory "/home/jenkins/workspace/Test_openjdk21_hs_extended.openjdk_riscv64_linux_testList_7/aqa-tests/TKG/../TKG/output_17557317124199/jdk_net_0/report" not found: creating
[2025-08-21T00:32:37.803Z] XML output with verification to /home/jenkins/workspace/Test_openjdk21_hs_extended.openjdk_riscv64_linux_testList_7/aqa-tests/TKG/output_17557317124199/jdk_net_0/work
[2025-08-21T00:45:50.283Z] --------------------------------------------------
[2025-08-21T00:45:50.283Z] TEST: java/net/CookieHandler/B6644726.java
[2025-08-21T00:45:50.283Z] TEST JDK: /home/jenkins/workspace/Test_openjdk21_hs_extended.openjdk_riscv64_linux_testList_7/jdkbinary/j2sdk-image
[2025-08-21T00:45:50.283Z]
[2025-08-21T00:45:50.283Z] ACTION: build -- Passed. Build successful
[2025-08-21T00:45:50.283Z] REASON: Named class compiled on demand
[2025-08-21T00:45:50.283Z] TIME: 0.156 seconds
[2025-08-21T00:45:50.283Z] messages:
[2025-08-21T00:45:50.283Z] command: build B6644726
[2025-08-21T00:45:50.283Z] reason: Named class compiled on demand
[2025-08-21T00:45:50.283Z] started: Thu Aug 21 00:45:38 UTC 2025
[2025-08-21T00:45:50.283Z] Test directory:
[2025-08-21T00:45:50.283Z] compile: B6644726
[2025-08-21T00:45:50.283Z] finished: Thu Aug 21 00:45:39 UTC 2025
[2025-08-21T00:45:50.283Z] elapsed time (seconds): 0.156
[2025-08-21T00:45:50.283Z]
[2025-08-21T00:45:50.283Z] ACTION: compile -- Passed. Compilation successful
[2025-08-21T00:45:50.283Z] REASON: .class file out of date or does not exist
[2025-08-21T00:45:50.283Z] TIME: 0.155 seconds
[2025-08-21T00:45:50.283Z] messages:
[2025-08-21T00:45:50.283Z] command: compile /home/jenkins/workspace/Test_openjdk21_hs_extended.openjdk_riscv64_linux_testList_7/aqa-tests/openjdk/openjdk-jdk/test/jdk/java/net/CookieHandler/B6644726.java
[2025-08-21T00:45:50.283Z] reason: .class file out of date or does not exist
[2025-08-21T00:45:50.283Z] started: Thu Aug 21 00:45:38 UTC 2025
[2025-08-21T00:45:50.283Z] Mode: agentvm
[2025-08-21T00:45:50.283Z] Agent id: 3
[2025-08-21T00:45:50.283Z] finished: Thu Aug 21 00:45:39 UTC 2025
[2025-08-21T00:45:50.283Z] elapsed time (seconds): 0.155
[2025-08-21T00:45:50.283Z] configuration:
[2025-08-21T00:45:50.283Z] Boot Layer (javac runtime environment)
[2025-08-21T00:45:50.283Z] class path: /home/jenkins/workspace/Test_openjdk21_hs_extended.openjdk_riscv64_linux_testList_7/jvmtest/openjdk/jtreg/lib/javatest.jar
[2025-08-21T00:45:50.283Z] /home/jenkins/workspace/Test_openjdk21_hs_extended.openjdk_riscv64_linux_testList_7/jvmtest/openjdk/jtreg/lib/jtreg.jar
[2025-08-21T00:45:50.283Z] patch: java.base /home/jenkins/workspace/Test_openjdk21_hs_extended.openjdk_riscv64_linux_testList_7/aqa-tests/TKG/output_17557317124199/jdk_net_0/work/patches/java.base
[2025-08-21T00:45:50.283Z]
[2025-08-21T00:45:50.283Z] javac compilation environment
[2025-08-21T00:45:50.283Z] source path: /home/jenkins/workspace/Test_openjdk21_hs_extended.openjdk_riscv64_linux_testList_7/aqa-tests/openjdk/openjdk-jdk/test/jdk/java/net/CookieHandler
[2025-08-21T00:45:50.283Z] class path: /home/jenkins/workspace/Test_openjdk21_hs_extended.openjdk_riscv64_linux_testList_7/aqa-tests/openjdk/openjdk-jdk/test/jdk/java/net/CookieHandler
[2025-08-21T00:45:50.283Z] /home/jenkins/workspace/Test_openjdk21_hs_extended.openjdk_riscv64_linux_testList_7/aqa-tests/TKG/output_17557317124199/jdk_net_0/work/classes/0/java/net/CookieHandler/B6644726.d
[2025-08-21T00:45:50.283Z]
[2025-08-21T00:45:50.283Z] rerun:
[2025-08-21T00:45:50.283Z] cd /home/jenkins/workspace/Test_openjdk21_hs_extended.openjdk_riscv64_linux_testList_7/aqa-tests/TKG/output_17557317124199/jdk_net_0/work/scratch/1 && \
[2025-08-21T00:45:50.283Z] DBUS_SESSION_BUS_ADDRESS=unix:path=/run/user/1001/bus \
[2025-08-21T00:45:50.283Z] DISPLAY=:0 \
[2025-08-21T00:45:50.283Z] HOME=/home/jenkins \
[2025-08-21T00:45:50.283Z] LANG=en_US.UTF-8 \
[2025-08-21T00:45:50.283Z] PATH=/bin:/usr/bin:/usr/sbin \
[2025-08-21T00:45:50.283Z] XDG_RUNTIME_DIR=/run/user/1001 \
[2025-08-21T00:45:50.283Z] XDG_SESSION_CLASS=user \
[2025-08-21T00:45:50.283Z] XDG_SESSION_ID=71123 \
[2025-08-21T00:45:50.283Z] XDG_SESSION_TYPE=tty \
[2025-08-21T00:45:50.284Z] /home/jenkins/workspace/Test_openjdk21_hs_extended.openjdk_riscv64_linux_testList_7/jdkbinary/j2sdk-image/bin/javac \
[2025-08-21T00:45:50.284Z] -J-ea \
[2025-08-21T00:45:50.284Z] -J-esa \
[2025-08-21T00:45:50.284Z] -J-Xmx512m \
[2025-08-21T00:45:50.284Z] -J-XX:+UseCompressedOops \
[2025-08-21T00:45:50.284Z] -J-Djava.awt.headless=true \
[2025-08-21T00:45:50.284Z] -J-Dtest.vm.opts='-ea -esa -Xmx512m -XX:+UseCompressedOops -Djava.awt.headless=true' \
[2025-08-21T00:45:50.284Z] -J-Dtest.tool.vm.opts='-J-ea -J-esa -J-Xmx512m -J-XX:+UseCompressedOops -J-Djava.awt.headless=true' \
[2025-08-21T00:45:50.284Z] -J-Dtest.compiler.opts= \
[2025-08-21T00:45:50.284Z] -J-Dtest.java.opts= \
[2025-08-21T00:45:50.284Z] -J-Dtest.jdk=/home/jenkins/workspace/Test_openjdk21_hs_extended.openjdk_riscv64_linux_testList_7/jdkbinary/j2sdk-image \
[2025-08-21T00:45:50.284Z] -J-Dcompile.jdk=/home/jenkins/workspace/Test_openjdk21_hs_extended.openjdk_riscv64_linux_testList_7/jdkbinary/j2sdk-image \
[2025-08-21T00:45:50.284Z] -J-Dtest.timeout.factor=16.0 \
[2025-08-21T00:45:50.284Z] -J-Dtest.nativepath=/home/jenkins/workspace/Test_openjdk21_hs_extended.openjdk_riscv64_linux_testList_7/jdkbinary/openjdk-test-image/jdk/jtreg/native \
[2025-08-21T00:45:50.284Z] -J-Dtest.root=/home/jenkins/workspace/Test_openjdk21_hs_extended.openjdk_riscv64_linux_testList_7/aqa-tests/openjdk/openjdk-jdk/test/jdk \
[2025-08-21T00:45:50.284Z] -J-Dtest.name=java/net/CookieHandler/B6644726.java \
[2025-08-21T00:45:50.284Z] -J-Dtest.file=/home/jenkins/workspace/Test_openjdk21_hs_extended.openjdk_riscv64_linux_testList_7/aqa-tests/openjdk/openjdk-jdk/test/jdk/java/net/CookieHandler/B6644726.java \
[2025-08-21T00:45:50.284Z] -J-Dtest.src=/home/jenkins/workspace/Test_openjdk21_hs_extended.openjdk_riscv64_linux_testList_7/aqa-tests/openjdk/openjdk-jdk/test/jdk/java/net/CookieHandler \
[2025-08-21T00:45:50.284Z] -J-Dtest.src.path=/home/jenkins/workspace/Test_openjdk21_hs_extended.openjdk_riscv64_linux_testList_7/aqa-tests/openjdk/openjdk-jdk/test/jdk/java/net/CookieHandler \
[2025-08-21T00:45:50.284Z] -J-Dtest.classes=/home/jenkins/workspace/Test_openjdk21_hs_extended.openjdk_riscv64_linux_testList_7/aqa-tests/TKG/output_17557317124199/jdk_net_0/work/classes/0/java/net/CookieHandler/B6644726.d \
[2025-08-21T00:45:50.284Z] -J-Dtest.class.path=/home/jenkins/workspace/Test_openjdk21_hs_extended.openjdk_riscv64_linux_testList_7/aqa-tests/TKG/output_17557317124199/jdk_net_0/work/classes/0/java/net/CookieHandler/B6644726.d \
[2025-08-21T00:45:50.284Z] -J-Dtest.class.path.prefix=/home/jenkins/workspace/Test_openjdk21_hs_extended.openjdk_riscv64_linux_testList_7/aqa-tests/TKG/output_17557317124199/jdk_net_0/work/classes/0/java/net/CookieHandler/B6644726.d:/home/jenkins/workspace/Test_openjdk21_hs_extended.openjdk_riscv64_linux_testList_7/aqa-tests/openjdk/openjdk-jdk/test/jdk/java/net/CookieHandler \
[2025-08-21T00:45:50.284Z] -d /home/jenkins/workspace/Test_openjdk21_hs_extended.openjdk_riscv64_linux_testList_7/aqa-tests/TKG/output_17557317124199/jdk_net_0/work/classes/0/java/net/CookieHandler/B6644726.d \
[2025-08-21T00:45:50.284Z] -sourcepath /home/jenkins/workspace/Test_openjdk21_hs_extended.openjdk_riscv64_linux_testList_7/aqa-tests/openjdk/openjdk-jdk/test/jdk/java/net/CookieHandler \
[2025-08-21T00:45:50.284Z] -classpath /home/jenkins/workspace/Test_openjdk21_hs_extended.openjdk_riscv64_linux_testList_7/aqa-tests/openjdk/openjdk-jdk/test/jdk/java/net/CookieHandler:/home/jenkins/workspace/Test_openjdk21_hs_extended.openjdk_riscv64_linux_testList_7/aqa-tests/TKG/output_17557317124199/jdk_net_0/work/classes/0/java/net/CookieHandler/B6644726.d /home/jenkins/workspace/Test_openjdk21_hs_extended.openjdk_riscv64_linux_testList_7/aqa-tests/openjdk/openjdk-jdk/test/jdk/java/net/CookieHandler/B6644726.java
[2025-08-21T00:45:50.284Z]
[2025-08-21T00:45:50.284Z] ACTION: main -- Failed. Execution failed: `main' threw exception: java.lang.RuntimeException: Should have 5 cookies. Got only 3, expires probably didn't parse correctly
[2025-08-21T00:45:50.284Z] REASON: Assumed action based on file name: run main B6644726
[2025-08-21T00:45:50.284Z] TIME: 0.08 seconds
[2025-08-21T00:45:50.284Z] messages:
[2025-08-21T00:45:50.284Z] command: main B6644726
[2025-08-21T00:45:50.284Z] reason: Assumed action based on file name: run main B6644726
[2025-08-21T00:45:50.284Z] started: Thu Aug 21 00:45:39 UTC 2025
[2025-08-21T00:45:50.284Z] Mode: agentvm
[2025-08-21T00:45:50.284Z] Agent id: 15
[2025-08-21T00:45:50.284Z] finished: Thu Aug 21 00:45:39 UTC 2025
[2025-08-21T00:45:50.284Z] elapsed time (seconds): 0.08
[2025-08-21T00:45:50.284Z] configuration:
[2025-08-21T00:45:50.284Z] Boot Layer
[2025-08-21T00:45:50.284Z] class path: /home/jenkins/workspace/Test_openjdk21_hs_extended.openjdk_riscv64_linux_testList_7/jvmtest/openjdk/jtreg/lib/javatest.jar
[2025-08-21T00:45:50.284Z] /home/jenkins/workspace/Test_openjdk21_hs_extended.openjdk_riscv64_linux_testList_7/jvmtest/openjdk/jtreg/lib/jtreg.jar
[2025-08-21T00:45:50.284Z] /home/jenkins/workspace/Test_openjdk21_hs_extended.openjdk_riscv64_linux_testList_7/jvmtest/openjdk/jtreg/lib/junit-platform-console-standalone-1.9.2.jar
[2025-08-21T00:45:50.284Z] /home/jenkins/workspace/Test_openjdk21_hs_extended.openjdk_riscv64_linux_testList_7/jvmtest/openjdk/jtreg/lib/testng-7.3.0.jar
[2025-08-21T00:45:50.284Z] /home/jenkins/workspace/Test_openjdk21_hs_extended.openjdk_riscv64_linux_testList_7/jvmtest/openjdk/jtreg/lib/guice-5.1.0.jar
[2025-08-21T00:45:50.284Z] /home/jenkins/workspace/Test_openjdk21_hs_extended.openjdk_riscv64_linux_testList_7/jvmtest/openjdk/jtreg/lib/jcommander-1.82.jar
[2025-08-21T00:45:50.284Z] patch: java.base /home/jenkins/workspace/Test_openjdk21_hs_extended.openjdk_riscv64_linux_testList_7/aqa-tests/TKG/output_17557317124199/jdk_net_0/work/patches/java.base
[2025-08-21T00:45:50.284Z]
[2025-08-21T00:45:50.284Z] Test Layer
[2025-08-21T00:45:50.284Z] class path: /home/jenkins/workspace/Test_openjdk21_hs_extended.openjdk_riscv64_linux_testList_7/aqa-tests/TKG/output_17557317124199/jdk_net_0/work/classes/0/java/net/CookieHandler/B6644726.d
[2025-08-21T00:45:50.284Z] /home/jenkins/workspace/Test_openjdk21_hs_extended.openjdk_riscv64_linux_testList_7/aqa-tests/openjdk/openjdk-jdk/test/jdk/java/net/CookieHandler
[2025-08-21T00:45:50.284Z]
[2025-08-21T00:45:50.284Z] rerun:
[2025-08-21T00:45:50.284Z] cd /home/jenkins/workspace/Test_openjdk21_hs_extended.openjdk_riscv64_linux_testList_7/aqa-tests/TKG/output_17557317124199/jdk_net_0/work/scratch/1 && \
[2025-08-21T00:45:50.284Z] DBUS_SESSION_BUS_ADDRESS=unix:path=/run/user/1001/bus \
[2025-08-21T00:45:50.284Z] DISPLAY=:0 \
[2025-08-21T00:45:50.284Z] HOME=/home/jenkins \
[2025-08-21T00:45:50.284Z] LANG=en_US.UTF-8 \
[2025-08-21T00:45:50.284Z] PATH=/bin:/usr/bin:/usr/sbin \
[2025-08-21T00:45:50.284Z] XDG_RUNTIME_DIR=/run/user/1001 \
[2025-08-21T00:45:50.284Z] XDG_SESSION_CLASS=user \
[2025-08-21T00:45:50.284Z] XDG_SESSION_ID=71123 \
[2025-08-21T00:45:50.284Z] XDG_SESSION_TYPE=tty \
[2025-08-21T00:45:50.284Z] /home/jenkins/workspace/Test_openjdk21_hs_extended.openjdk_riscv64_linux_testList_7/jdkbinary/j2sdk-image/bin/java \
[2025-08-21T00:45:50.284Z] -Dtest.vm.opts='-ea -esa -Xmx512m -XX:+UseCompressedOops -Djava.awt.headless=true' \
[2025-08-21T00:45:50.284Z] -Dtest.tool.vm.opts='-J-ea -J-esa -J-Xmx512m -J-XX:+UseCompressedOops -J-Djava.awt.headless=true' \
[2025-08-21T00:45:50.284Z] -Dtest.compiler.opts= \
[2025-08-21T00:45:50.284Z] -Dtest.java.opts= \
[2025-08-21T00:45:50.284Z] -Dtest.jdk=/home/jenkins/workspace/Test_openjdk21_hs_extended.openjdk_riscv64_linux_testList_7/jdkbinary/j2sdk-image \
[2025-08-21T00:45:50.284Z] -Dcompile.jdk=/home/jenkins/workspace/Test_openjdk21_hs_extended.openjdk_riscv64_linux_testList_7/jdkbinary/j2sdk-image \
[2025-08-21T00:45:50.284Z] -Dtest.timeout.factor=16.0 \
[2025-08-21T00:45:50.284Z] -Dtest.nativepath=/home/jenkins/workspace/Test_openjdk21_hs_extended.openjdk_riscv64_linux_testList_7/jdkbinary/openjdk-test-image/jdk/jtreg/native \
[2025-08-21T00:45:50.284Z] -Dtest.root=/home/jenkins/workspace/Test_openjdk21_hs_extended.openjdk_riscv64_linux_testList_7/aqa-tests/openjdk/openjdk-jdk/test/jdk \
[2025-08-21T00:45:50.284Z] -Dtest.name=java/net/CookieHandler/B6644726.java \
[2025-08-21T00:45:50.284Z] -Dtest.file=/home/jenkins/workspace/Test_openjdk21_hs_extended.openjdk_riscv64_linux_testList_7/aqa-tests/openjdk/openjdk-jdk/test/jdk/java/net/CookieHandler/B6644726.java \
[2025-08-21T00:45:50.284Z] -Dtest.src=/home/jenkins/workspace/Test_openjdk21_hs_extended.openjdk_riscv64_linux_testList_7/aqa-tests/openjdk/openjdk-jdk/test/jdk/java/net/CookieHandler \
[2025-08-21T00:45:50.284Z] -Dtest.src.path=/home/jenkins/workspace/Test_openjdk21_hs_extended.openjdk_riscv64_linux_testList_7/aqa-tests/openjdk/openjdk-jdk/test/jdk/java/net/CookieHandler \
[2025-08-21T00:45:50.284Z] -Dtest.classes=/home/jenkins/workspace/Test_openjdk21_hs_extended.openjdk_riscv64_linux_testList_7/aqa-tests/TKG/output_17557317124199/jdk_net_0/work/classes/0/java/net/CookieHandler/B6644726.d \
[2025-08-21T00:45:50.284Z] -Dtest.class.path=/home/jenkins/workspace/Test_openjdk21_hs_extended.openjdk_riscv64_linux_testList_7/aqa-tests/TKG/output_17557317124199/jdk_net_0/work/classes/0/java/net/CookieHandler/B6644726.d \
[2025-08-21T00:45:50.284Z] -Dtest.class.path.prefix=/home/jenkins/workspace/Test_openjdk21_hs_extended.openjdk_riscv64_linux_testList_7/aqa-tests/TKG/output_17557317124199/jdk_net_0/work/classes/0/java/net/CookieHandler/B6644726.d:/home/jenkins/workspace/Test_openjdk21_hs_extended.openjdk_riscv64_linux_testList_7/aqa-tests/openjdk/openjdk-jdk/test/jdk/java/net/CookieHandler \
[2025-08-21T00:45:50.285Z] -classpath /home/jenkins/workspace/Test_openjdk21_hs_extended.openjdk_riscv64_linux_testList_7/aqa-tests/TKG/output_17557317124199/jdk_net_0/work/classes/0/java/net/CookieHandler/B6644726.d:/home/jenkins/workspace/Test_openjdk21_hs_extended.openjdk_riscv64_linux_testList_7/aqa-tests/openjdk/openjdk-jdk/test/jdk/java/net/CookieHandler:/home/jenkins/workspace/Test_openjdk21_hs_extended.openjdk_riscv64_linux_testList_7/jvmtest/openjdk/jtreg/lib/javatest.jar:/home/jenkins/workspace/Test_openjdk21_hs_extended.openjdk_riscv64_linux_testList_7/jvmtest/openjdk/jtreg/lib/jtreg.jar \
[2025-08-21T00:45:50.285Z] B6644726
[2025-08-21T00:45:50.285Z] STDERR:
[2025-08-21T00:45:50.285Z] java.lang.RuntimeException: Should have 5 cookies. Got only 3, expires probably didn't parse correctly
[2025-08-21T00:45:50.285Z] at B6644726.fail(B6644726.java:209)
[2025-08-21T00:45:50.285Z] at B6644726.testCookieStore(B6644726.java:67)
[2025-08-21T00:45:50.285Z] at B6644726.main(B6644726.java:35)
[2025-08-21T00:45:50.285Z] at java.base/jdk.internal.reflect.DirectMethodHandleAccessor.invoke(DirectMethodHandleAccessor.java:103)
[2025-08-21T00:45:50.285Z] at java.base/java.lang.reflect.Method.invoke(Method.java:580)
[2025-08-21T00:45:50.285Z] at com.sun.javatest.regtest.agent.MainActionHelper$AgentVMRunnable.run(MainActionHelper.java:333)
[2025-08-21T00:45:50.285Z] at java.base/java.lang.Thread.run(Thread.java:1583)
[2025-08-21T00:45:50.285Z]
[2025-08-21T00:45:50.285Z] JavaTest Message: Test threw exception: java.lang.RuntimeException
[2025-08-21T00:45:50.285Z] JavaTest Message: shutting down test
[2025-08-21T00:45:50.285Z]
[2025-08-21T00:45:50.285Z]
[2025-08-21T00:45:50.285Z] TEST RESULT: Failed. Execution failed: `main' threw exception: java.lang.RuntimeException: Should have 5 cookies. Got only 3, expires probably didn't parse correctly
[2025-08-21T00:45:50.285Z] --------------------------------------------------
[2025-08-21T02:00:09.207Z] Test results: passed: 885; failed: 1
[2025-08-21T02:00:49.191Z] Report written to /home/jenkins/workspace/Test_openjdk21_hs_extended.openjdk_riscv64_linux_testList_7/aqa-tests/TKG/output_17557317124199/jdk_net_0/report/html/report.html
[2025-08-21T02:00:49.191Z] Results written to /home/jenkins/workspace/Test_openjdk21_hs_extended.openjdk_riscv64_linux_testList_7/aqa-tests/TKG/output_17557317124199/jdk_net_0/work
[2025-08-21T02:00:49.191Z] Error: Some tests failed or other problems occurred.
[2025-08-21T02:00:49.191Z] -----------------------------------
[2025-08-21T02:00:49.191Z] jdk_net_0_FAILED
[2025-08-21T02:00:49.191Z] -----------------------------------
[2025-08-21T02:00:49.191Z]
[2025-08-21T02:00:49.191Z] TEST TEARDOWN:
[2025-08-21T02:00:49.191Z] Nothing to be done for teardown.
[2025-08-21T02:00:49.191Z] jdk_net_0 Finish Time: Thu Aug 21 02:00:48 2025 Epoch Time (ms): 1755741648716