jdk_net_0
[2025-08-21T03:04:48.165Z] Running test jdk_net_0 ...
[2025-08-21T03:04:48.165Z] ===============================================
[2025-08-21T03:04:48.165Z] jdk_net_0 Start Time: Thu Aug 21 03:04:47 2025 Epoch Time (ms): 1755745487415
[2025-08-21T03:04:48.165Z] variation: Mode150
[2025-08-21T03:04:48.165Z] JVM_OPTIONS: -XX:+UseCompressedOops
[2025-08-21T03:04:48.165Z] { \
[2025-08-21T03:04:48.165Z] echo ""; echo "TEST SETUP:"; \
[2025-08-21T03:04:48.165Z] echo "Nothing to be done for setup."; \
[2025-08-21T03:04:48.165Z] mkdir -p "/home/jenkins/workspace/Test_openjdk21_hs_extended.openjdk_aarch64_alpine-linux/aqa-tests/TKG/../TKG/output_17557274143329/jdk_net_0"; \
[2025-08-21T03:04:48.165Z] cd "/home/jenkins/workspace/Test_openjdk21_hs_extended.openjdk_aarch64_alpine-linux/aqa-tests/TKG/../TKG/output_17557274143329/jdk_net_0"; \
[2025-08-21T03:04:48.165Z] echo ""; echo "TESTING:"; \
[2025-08-21T03:04:48.165Z] "/home/jenkins/workspace/Test_openjdk21_hs_extended.openjdk_aarch64_alpine-linux/jdkbinary/j2sdk-image/bin/java" -Xmx512m -jar "/home/jenkins/workspace/Test_openjdk21_hs_extended.openjdk_aarch64_alpine-linux/aqa-tests/TKG/../../jvmtest/openjdk/jtreg/lib/jtreg.jar" \
[2025-08-21T03:04:48.165Z] -agentvm -a -ea -esa -v:fail,error,time,nopass -retain:fail,error,*.dmp,javacore.*,heapdump.*,*.trc -ignore:quiet -timeoutFactor:8 -xml:verify -k:'!headful' -concurrency:3 -nativepath:"/home/jenkins/workspace/Test_openjdk21_hs_extended.openjdk_aarch64_alpine-linux/jdkbinary/openjdk-test-image/jdk/jtreg/native" -vmoptions:"-Xmx512m -XX:+UseCompressedOops -Djava.awt.headless=true" \
[2025-08-21T03:04:48.165Z] -w ""/home/jenkins/workspace/Test_openjdk21_hs_extended.openjdk_aarch64_alpine-linux/aqa-tests/TKG/../TKG/output_17557274143329/jdk_net_0"/work" \
[2025-08-21T03:04:48.165Z] -r ""/home/jenkins/workspace/Test_openjdk21_hs_extended.openjdk_aarch64_alpine-linux/aqa-tests/TKG/../TKG/output_17557274143329/jdk_net_0"/report" \
[2025-08-21T03:04:48.165Z] -jdk:"/home/jenkins/workspace/Test_openjdk21_hs_extended.openjdk_aarch64_alpine-linux/jdkbinary/j2sdk-image" \
[2025-08-21T03:04:48.165Z] -exclude:"/home/jenkins/workspace/Test_openjdk21_hs_extended.openjdk_aarch64_alpine-linux/aqa-tests/TKG/../openjdk/openjdk-jdk/test/jdk/ProblemList.txt" \
[2025-08-21T03:04:48.165Z] -exclude:"/home/jenkins/workspace/Test_openjdk21_hs_extended.openjdk_aarch64_alpine-linux/aqa-tests/TKG/../../jvmtest/openjdk/excludes/ProblemList_openjdk21.txt" \
[2025-08-21T03:04:48.165Z] -exclude:"/home/jenkins/workspace/Test_openjdk21_hs_extended.openjdk_aarch64_alpine-linux/aqa-tests/TKG/../openjdk/excludes/alpine/ProblemList_openjdk21_alpine.txt" \
[2025-08-21T03:04:48.165Z] -exclude:"/home/jenkins/workspace/Test_openjdk21_hs_extended.openjdk_aarch64_alpine-linux/aqa-tests/TKG/../openjdk/excludes/vendors/eclipse/ProblemList_openjdk21.txt" \
[2025-08-21T03:04:48.165Z] "/home/jenkins/workspace/Test_openjdk21_hs_extended.openjdk_aarch64_alpine-linux/aqa-tests/TKG/../openjdk/openjdk-jdk/test/jdk:jdk_net"; \
[2025-08-21T03:04:48.165Z] if [ $? -eq 0 ]; then echo "-----------------------------------"; echo "jdk_net_0""_PASSED"; echo "-----------------------------------"; cd /home/jenkins/workspace/Test_openjdk21_hs_extended.openjdk_aarch64_alpine-linux/aqa-tests/TKG/..; else echo "-----------------------------------"; echo "jdk_net_0""_FAILED"; echo "-----------------------------------"; fi; \
[2025-08-21T03:04:48.165Z] echo ""; echo "TEST TEARDOWN:"; \
[2025-08-21T03:04:48.165Z] echo "Nothing to be done for teardown."; \
[2025-08-21T03:04:48.165Z] } 2>&1 | tee -a "/home/jenkins/workspace/Test_openjdk21_hs_extended.openjdk_aarch64_alpine-linux/aqa-tests/TKG/../TKG/output_17557274143329/TestTargetResult";
[2025-08-21T03:04:48.165Z]
[2025-08-21T03:04:48.165Z] TEST SETUP:
[2025-08-21T03:04:48.165Z] Nothing to be done for setup.
[2025-08-21T03:04:48.165Z]
[2025-08-21T03:04:48.165Z] TESTING:
[2025-08-21T03:04:49.110Z] Directory "/home/jenkins/workspace/Test_openjdk21_hs_extended.openjdk_aarch64_alpine-linux/aqa-tests/TKG/../TKG/output_17557274143329/jdk_net_0/work" not found: creating
[2025-08-21T03:04:49.110Z] Directory "/home/jenkins/workspace/Test_openjdk21_hs_extended.openjdk_aarch64_alpine-linux/aqa-tests/TKG/../TKG/output_17557274143329/jdk_net_0/report" not found: creating
[2025-08-21T03:04:55.763Z] XML output with verification to /home/jenkins/workspace/Test_openjdk21_hs_extended.openjdk_aarch64_alpine-linux/aqa-tests/TKG/output_17557274143329/jdk_net_0/work
[2025-08-21T03:11:01.082Z] --------------------------------------------------
[2025-08-21T03:11:01.082Z] TEST: java/net/CookieHandler/B6644726.java
[2025-08-21T03:11:01.082Z] TEST JDK: /home/jenkins/workspace/Test_openjdk21_hs_extended.openjdk_aarch64_alpine-linux/jdkbinary/j2sdk-image
[2025-08-21T03:11:01.082Z]
[2025-08-21T03:11:01.082Z] ACTION: build -- Passed. Build successful
[2025-08-21T03:11:01.082Z] REASON: Named class compiled on demand
[2025-08-21T03:11:01.082Z] TIME: 0.06 seconds
[2025-08-21T03:11:01.082Z] messages:
[2025-08-21T03:11:01.082Z] command: build B6644726
[2025-08-21T03:11:01.082Z] reason: Named class compiled on demand
[2025-08-21T03:11:01.082Z] started: Thu Aug 21 03:10:50 GMT 2025
[2025-08-21T03:11:01.082Z] Test directory:
[2025-08-21T03:11:01.082Z] compile: B6644726
[2025-08-21T03:11:01.082Z] finished: Thu Aug 21 03:10:51 GMT 2025
[2025-08-21T03:11:01.082Z] elapsed time (seconds): 0.06
[2025-08-21T03:11:01.082Z]
[2025-08-21T03:11:01.082Z] ACTION: compile -- Passed. Compilation successful
[2025-08-21T03:11:01.082Z] REASON: .class file out of date or does not exist
[2025-08-21T03:11:01.082Z] TIME: 0.06 seconds
[2025-08-21T03:11:01.082Z] messages:
[2025-08-21T03:11:01.082Z] command: compile /home/jenkins/workspace/Test_openjdk21_hs_extended.openjdk_aarch64_alpine-linux/aqa-tests/openjdk/openjdk-jdk/test/jdk/java/net/CookieHandler/B6644726.java
[2025-08-21T03:11:01.082Z] reason: .class file out of date or does not exist
[2025-08-21T03:11:01.082Z] started: Thu Aug 21 03:10:50 GMT 2025
[2025-08-21T03:11:01.082Z] Mode: agentvm
[2025-08-21T03:11:01.082Z] Agent id: 1
[2025-08-21T03:11:01.082Z] finished: Thu Aug 21 03:10:51 GMT 2025
[2025-08-21T03:11:01.082Z] elapsed time (seconds): 0.06
[2025-08-21T03:11:01.082Z] configuration:
[2025-08-21T03:11:01.082Z] Boot Layer (javac runtime environment)
[2025-08-21T03:11:01.082Z] class path: /home/jenkins/workspace/Test_openjdk21_hs_extended.openjdk_aarch64_alpine-linux/jvmtest/openjdk/jtreg/lib/javatest.jar
[2025-08-21T03:11:01.082Z] /home/jenkins/workspace/Test_openjdk21_hs_extended.openjdk_aarch64_alpine-linux/jvmtest/openjdk/jtreg/lib/jtreg.jar
[2025-08-21T03:11:01.082Z] patch: java.base /home/jenkins/workspace/Test_openjdk21_hs_extended.openjdk_aarch64_alpine-linux/aqa-tests/TKG/output_17557274143329/jdk_net_0/work/patches/java.base
[2025-08-21T03:11:01.082Z]
[2025-08-21T03:11:01.082Z] javac compilation environment
[2025-08-21T03:11:01.082Z] source path: /home/jenkins/workspace/Test_openjdk21_hs_extended.openjdk_aarch64_alpine-linux/aqa-tests/openjdk/openjdk-jdk/test/jdk/java/net/CookieHandler
[2025-08-21T03:11:01.082Z] class path: /home/jenkins/workspace/Test_openjdk21_hs_extended.openjdk_aarch64_alpine-linux/aqa-tests/openjdk/openjdk-jdk/test/jdk/java/net/CookieHandler
[2025-08-21T03:11:01.082Z] /home/jenkins/workspace/Test_openjdk21_hs_extended.openjdk_aarch64_alpine-linux/aqa-tests/TKG/output_17557274143329/jdk_net_0/work/classes/0/java/net/CookieHandler/B6644726.d
[2025-08-21T03:11:01.082Z]
[2025-08-21T03:11:01.082Z] rerun:
[2025-08-21T03:11:01.083Z] cd /home/jenkins/workspace/Test_openjdk21_hs_extended.openjdk_aarch64_alpine-linux/aqa-tests/TKG/output_17557274143329/jdk_net_0/work/scratch/2 && \
[2025-08-21T03:11:01.083Z] DISPLAY=:0 \
[2025-08-21T03:11:01.083Z] HOME=/home/jenkins \
[2025-08-21T03:11:01.083Z] PATH=/bin:/usr/bin:/usr/sbin \
[2025-08-21T03:11:01.083Z] /home/jenkins/workspace/Test_openjdk21_hs_extended.openjdk_aarch64_alpine-linux/jdkbinary/j2sdk-image/bin/javac \
[2025-08-21T03:11:01.083Z] -J-ea \
[2025-08-21T03:11:01.083Z] -J-esa \
[2025-08-21T03:11:01.083Z] -J-Xmx512m \
[2025-08-21T03:11:01.083Z] -J-XX:+UseCompressedOops \
[2025-08-21T03:11:01.083Z] -J-Djava.awt.headless=true \
[2025-08-21T03:11:01.083Z] -J-Dtest.vm.opts='-ea -esa -Xmx512m -XX:+UseCompressedOops -Djava.awt.headless=true' \
[2025-08-21T03:11:01.083Z] -J-Dtest.tool.vm.opts='-J-ea -J-esa -J-Xmx512m -J-XX:+UseCompressedOops -J-Djava.awt.headless=true' \
[2025-08-21T03:11:01.083Z] -J-Dtest.compiler.opts= \
[2025-08-21T03:11:01.083Z] -J-Dtest.java.opts= \
[2025-08-21T03:11:01.083Z] -J-Dtest.jdk=/home/jenkins/workspace/Test_openjdk21_hs_extended.openjdk_aarch64_alpine-linux/jdkbinary/j2sdk-image \
[2025-08-21T03:11:01.083Z] -J-Dcompile.jdk=/home/jenkins/workspace/Test_openjdk21_hs_extended.openjdk_aarch64_alpine-linux/jdkbinary/j2sdk-image \
[2025-08-21T03:11:01.083Z] -J-Dtest.timeout.factor=8.0 \
[2025-08-21T03:11:01.083Z] -J-Dtest.nativepath=/home/jenkins/workspace/Test_openjdk21_hs_extended.openjdk_aarch64_alpine-linux/jdkbinary/openjdk-test-image/jdk/jtreg/native \
[2025-08-21T03:11:01.083Z] -J-Dtest.root=/home/jenkins/workspace/Test_openjdk21_hs_extended.openjdk_aarch64_alpine-linux/aqa-tests/openjdk/openjdk-jdk/test/jdk \
[2025-08-21T03:11:01.083Z] -J-Dtest.name=java/net/CookieHandler/B6644726.java \
[2025-08-21T03:11:01.083Z] -J-Dtest.file=/home/jenkins/workspace/Test_openjdk21_hs_extended.openjdk_aarch64_alpine-linux/aqa-tests/openjdk/openjdk-jdk/test/jdk/java/net/CookieHandler/B6644726.java \
[2025-08-21T03:11:01.083Z] -J-Dtest.src=/home/jenkins/workspace/Test_openjdk21_hs_extended.openjdk_aarch64_alpine-linux/aqa-tests/openjdk/openjdk-jdk/test/jdk/java/net/CookieHandler \
[2025-08-21T03:11:01.083Z] -J-Dtest.src.path=/home/jenkins/workspace/Test_openjdk21_hs_extended.openjdk_aarch64_alpine-linux/aqa-tests/openjdk/openjdk-jdk/test/jdk/java/net/CookieHandler \
[2025-08-21T03:11:01.083Z] -J-Dtest.classes=/home/jenkins/workspace/Test_openjdk21_hs_extended.openjdk_aarch64_alpine-linux/aqa-tests/TKG/output_17557274143329/jdk_net_0/work/classes/0/java/net/CookieHandler/B6644726.d \
[2025-08-21T03:11:01.083Z] -J-Dtest.class.path=/home/jenkins/workspace/Test_openjdk21_hs_extended.openjdk_aarch64_alpine-linux/aqa-tests/TKG/output_17557274143329/jdk_net_0/work/classes/0/java/net/CookieHandler/B6644726.d \
[2025-08-21T03:11:01.083Z] -J-Dtest.class.path.prefix=/home/jenkins/workspace/Test_openjdk21_hs_extended.openjdk_aarch64_alpine-linux/aqa-tests/TKG/output_17557274143329/jdk_net_0/work/classes/0/java/net/CookieHandler/B6644726.d:/home/jenkins/workspace/Test_openjdk21_hs_extended.openjdk_aarch64_alpine-linux/aqa-tests/openjdk/openjdk-jdk/test/jdk/java/net/CookieHandler \
[2025-08-21T03:11:01.083Z] -d /home/jenkins/workspace/Test_openjdk21_hs_extended.openjdk_aarch64_alpine-linux/aqa-tests/TKG/output_17557274143329/jdk_net_0/work/classes/0/java/net/CookieHandler/B6644726.d \
[2025-08-21T03:11:01.083Z] -sourcepath /home/jenkins/workspace/Test_openjdk21_hs_extended.openjdk_aarch64_alpine-linux/aqa-tests/openjdk/openjdk-jdk/test/jdk/java/net/CookieHandler \
[2025-08-21T03:11:01.083Z] -classpath /home/jenkins/workspace/Test_openjdk21_hs_extended.openjdk_aarch64_alpine-linux/aqa-tests/openjdk/openjdk-jdk/test/jdk/java/net/CookieHandler:/home/jenkins/workspace/Test_openjdk21_hs_extended.openjdk_aarch64_alpine-linux/aqa-tests/TKG/output_17557274143329/jdk_net_0/work/classes/0/java/net/CookieHandler/B6644726.d /home/jenkins/workspace/Test_openjdk21_hs_extended.openjdk_aarch64_alpine-linux/aqa-tests/openjdk/openjdk-jdk/test/jdk/java/net/CookieHandler/B6644726.java
[2025-08-21T03:11:01.083Z]
[2025-08-21T03:11:01.083Z] ACTION: main -- Failed. Execution failed: `main' threw exception: java.lang.RuntimeException: Should have 5 cookies. Got only 3, expires probably didn't parse correctly
[2025-08-21T03:11:01.083Z] REASON: Assumed action based on file name: run main B6644726
[2025-08-21T03:11:01.083Z] TIME: 0.038 seconds
[2025-08-21T03:11:01.083Z] messages:
[2025-08-21T03:11:01.083Z] command: main B6644726
[2025-08-21T03:11:01.083Z] reason: Assumed action based on file name: run main B6644726
[2025-08-21T03:11:01.083Z] started: Thu Aug 21 03:10:51 GMT 2025
[2025-08-21T03:11:01.083Z] Mode: agentvm
[2025-08-21T03:11:01.083Z] Agent id: 14
[2025-08-21T03:11:01.083Z] finished: Thu Aug 21 03:10:51 GMT 2025
[2025-08-21T03:11:01.083Z] elapsed time (seconds): 0.038
[2025-08-21T03:11:01.083Z] configuration:
[2025-08-21T03:11:01.083Z] Boot Layer
[2025-08-21T03:11:01.083Z] class path: /home/jenkins/workspace/Test_openjdk21_hs_extended.openjdk_aarch64_alpine-linux/jvmtest/openjdk/jtreg/lib/javatest.jar
[2025-08-21T03:11:01.083Z] /home/jenkins/workspace/Test_openjdk21_hs_extended.openjdk_aarch64_alpine-linux/jvmtest/openjdk/jtreg/lib/jtreg.jar
[2025-08-21T03:11:01.083Z] /home/jenkins/workspace/Test_openjdk21_hs_extended.openjdk_aarch64_alpine-linux/jvmtest/openjdk/jtreg/lib/junit-platform-console-standalone-1.9.2.jar
[2025-08-21T03:11:01.083Z] /home/jenkins/workspace/Test_openjdk21_hs_extended.openjdk_aarch64_alpine-linux/jvmtest/openjdk/jtreg/lib/testng-7.3.0.jar
[2025-08-21T03:11:01.083Z] /home/jenkins/workspace/Test_openjdk21_hs_extended.openjdk_aarch64_alpine-linux/jvmtest/openjdk/jtreg/lib/guice-5.1.0.jar
[2025-08-21T03:11:01.083Z] /home/jenkins/workspace/Test_openjdk21_hs_extended.openjdk_aarch64_alpine-linux/jvmtest/openjdk/jtreg/lib/jcommander-1.82.jar
[2025-08-21T03:11:01.083Z] patch: java.base /home/jenkins/workspace/Test_openjdk21_hs_extended.openjdk_aarch64_alpine-linux/aqa-tests/TKG/output_17557274143329/jdk_net_0/work/patches/java.base
[2025-08-21T03:11:01.083Z]
[2025-08-21T03:11:01.083Z] Test Layer
[2025-08-21T03:11:01.083Z] class path: /home/jenkins/workspace/Test_openjdk21_hs_extended.openjdk_aarch64_alpine-linux/aqa-tests/TKG/output_17557274143329/jdk_net_0/work/classes/0/java/net/CookieHandler/B6644726.d
[2025-08-21T03:11:01.083Z] /home/jenkins/workspace/Test_openjdk21_hs_extended.openjdk_aarch64_alpine-linux/aqa-tests/openjdk/openjdk-jdk/test/jdk/java/net/CookieHandler
[2025-08-21T03:11:01.083Z]
[2025-08-21T03:11:01.083Z] rerun:
[2025-08-21T03:11:01.083Z] cd /home/jenkins/workspace/Test_openjdk21_hs_extended.openjdk_aarch64_alpine-linux/aqa-tests/TKG/output_17557274143329/jdk_net_0/work/scratch/2 && \
[2025-08-21T03:11:01.083Z] DISPLAY=:0 \
[2025-08-21T03:11:01.083Z] HOME=/home/jenkins \
[2025-08-21T03:11:01.083Z] PATH=/bin:/usr/bin:/usr/sbin \
[2025-08-21T03:11:01.083Z] /home/jenkins/workspace/Test_openjdk21_hs_extended.openjdk_aarch64_alpine-linux/jdkbinary/j2sdk-image/bin/java \
[2025-08-21T03:11:01.083Z] -Dtest.vm.opts='-ea -esa -Xmx512m -XX:+UseCompressedOops -Djava.awt.headless=true' \
[2025-08-21T03:11:01.083Z] -Dtest.tool.vm.opts='-J-ea -J-esa -J-Xmx512m -J-XX:+UseCompressedOops -J-Djava.awt.headless=true' \
[2025-08-21T03:11:01.083Z] -Dtest.compiler.opts= \
[2025-08-21T03:11:01.083Z] -Dtest.java.opts= \
[2025-08-21T03:11:01.083Z] -Dtest.jdk=/home/jenkins/workspace/Test_openjdk21_hs_extended.openjdk_aarch64_alpine-linux/jdkbinary/j2sdk-image \
[2025-08-21T03:11:01.083Z] -Dcompile.jdk=/home/jenkins/workspace/Test_openjdk21_hs_extended.openjdk_aarch64_alpine-linux/jdkbinary/j2sdk-image \
[2025-08-21T03:11:01.083Z] -Dtest.timeout.factor=8.0 \
[2025-08-21T03:11:01.083Z] -Dtest.nativepath=/home/jenkins/workspace/Test_openjdk21_hs_extended.openjdk_aarch64_alpine-linux/jdkbinary/openjdk-test-image/jdk/jtreg/native \
[2025-08-21T03:11:01.083Z] -Dtest.root=/home/jenkins/workspace/Test_openjdk21_hs_extended.openjdk_aarch64_alpine-linux/aqa-tests/openjdk/openjdk-jdk/test/jdk \
[2025-08-21T03:11:01.083Z] -Dtest.name=java/net/CookieHandler/B6644726.java \
[2025-08-21T03:11:01.083Z] -Dtest.file=/home/jenkins/workspace/Test_openjdk21_hs_extended.openjdk_aarch64_alpine-linux/aqa-tests/openjdk/openjdk-jdk/test/jdk/java/net/CookieHandler/B6644726.java \
[2025-08-21T03:11:01.083Z] -Dtest.src=/home/jenkins/workspace/Test_openjdk21_hs_extended.openjdk_aarch64_alpine-linux/aqa-tests/openjdk/openjdk-jdk/test/jdk/java/net/CookieHandler \
[2025-08-21T03:11:01.083Z] -Dtest.src.path=/home/jenkins/workspace/Test_openjdk21_hs_extended.openjdk_aarch64_alpine-linux/aqa-tests/openjdk/openjdk-jdk/test/jdk/java/net/CookieHandler \
[2025-08-21T03:11:01.083Z] -Dtest.classes=/home/jenkins/workspace/Test_openjdk21_hs_extended.openjdk_aarch64_alpine-linux/aqa-tests/TKG/output_17557274143329/jdk_net_0/work/classes/0/java/net/CookieHandler/B6644726.d \
[2025-08-21T03:11:01.083Z] -Dtest.class.path=/home/jenkins/workspace/Test_openjdk21_hs_extended.openjdk_aarch64_alpine-linux/aqa-tests/TKG/output_17557274143329/jdk_net_0/work/classes/0/java/net/CookieHandler/B6644726.d \
[2025-08-21T03:11:01.083Z] -Dtest.class.path.prefix=/home/jenkins/workspace/Test_openjdk21_hs_extended.openjdk_aarch64_alpine-linux/aqa-tests/TKG/output_17557274143329/jdk_net_0/work/classes/0/java/net/CookieHandler/B6644726.d:/home/jenkins/workspace/Test_openjdk21_hs_extended.openjdk_aarch64_alpine-linux/aqa-tests/openjdk/openjdk-jdk/test/jdk/java/net/CookieHandler \
[2025-08-21T03:11:01.083Z] -classpath /home/jenkins/workspace/Test_openjdk21_hs_extended.openjdk_aarch64_alpine-linux/aqa-tests/TKG/output_17557274143329/jdk_net_0/work/classes/0/java/net/CookieHandler/B6644726.d:/home/jenkins/workspace/Test_openjdk21_hs_extended.openjdk_aarch64_alpine-linux/aqa-tests/openjdk/openjdk-jdk/test/jdk/java/net/CookieHandler:/home/jenkins/workspace/Test_openjdk21_hs_extended.openjdk_aarch64_alpine-linux/jvmtest/openjdk/jtreg/lib/javatest.jar:/home/jenkins/workspace/Test_openjdk21_hs_extended.openjdk_aarch64_alpine-linux/jvmtest/openjdk/jtreg/lib/jtreg.jar \
[2025-08-21T03:11:01.083Z] B6644726
[2025-08-21T03:11:01.083Z] STDERR:
[2025-08-21T03:11:01.083Z] java.lang.RuntimeException: Should have 5 cookies. Got only 3, expires probably didn't parse correctly
[2025-08-21T03:11:01.083Z] at B6644726.fail(B6644726.java:209)
[2025-08-21T03:11:01.083Z] at B6644726.testCookieStore(B6644726.java:67)
[2025-08-21T03:11:01.083Z] at B6644726.main(B6644726.java:35)
[2025-08-21T03:11:01.083Z] at java.base/jdk.internal.reflect.DirectMethodHandleAccessor.invoke(DirectMethodHandleAccessor.java:103)
[2025-08-21T03:11:01.083Z] at java.base/java.lang.reflect.Method.invoke(Method.java:580)
[2025-08-21T03:11:01.083Z] at com.sun.javatest.regtest.agent.MainActionHelper$AgentVMRunnable.run(MainActionHelper.java:333)
[2025-08-21T03:11:01.083Z] at java.base/java.lang.Thread.run(Thread.java:1583)
[2025-08-21T03:11:01.083Z]
[2025-08-21T03:11:01.083Z] JavaTest Message: Test threw exception: java.lang.RuntimeException
[2025-08-21T03:11:01.083Z] JavaTest Message: shutting down test
[2025-08-21T03:11:01.083Z]
[2025-08-21T03:11:01.083Z]
[2025-08-21T03:11:01.083Z] TEST RESULT: Failed. Execution failed: `main' threw exception: java.lang.RuntimeException: Should have 5 cookies. Got only 3, expires probably didn't parse correctly
[2025-08-21T03:11:01.083Z] --------------------------------------------------
[2025-08-21T03:43:51.295Z] Test results: passed: 885; failed: 1
[2025-08-21T03:44:06.988Z] Report written to /home/jenkins/workspace/Test_openjdk21_hs_extended.openjdk_aarch64_alpine-linux/aqa-tests/TKG/output_17557274143329/jdk_net_0/report/html/report.html
[2025-08-21T03:44:06.988Z] Results written to /home/jenkins/workspace/Test_openjdk21_hs_extended.openjdk_aarch64_alpine-linux/aqa-tests/TKG/output_17557274143329/jdk_net_0/work
[2025-08-21T03:44:06.988Z] Error: Some tests failed or other problems occurred.
[2025-08-21T03:44:06.988Z] -----------------------------------
[2025-08-21T03:44:06.988Z] jdk_net_0_FAILED
[2025-08-21T03:44:06.988Z] -----------------------------------
[2025-08-21T03:44:06.988Z]
[2025-08-21T03:44:06.988Z] TEST TEARDOWN:
[2025-08-21T03:44:06.988Z] Nothing to be done for teardown.
[2025-08-21T03:44:06.988Z] jdk_net_0 Finish Time: Thu Aug 21 03:44:05 2025 Epoch Time (ms): 1755747845231