Post Test
[2025-06-30T17:32:02.155Z] make[4]: Leaving directory '/home/jenkins/workspace/Test_openjdk21_hs_dev.functional_x86-64_alpine-linux/aqa-tests/functional/testHeadlessComponents'
[2025-06-30T17:32:02.155Z] make[3]: Leaving directory '/home/jenkins/workspace/Test_openjdk21_hs_dev.functional_x86-64_alpine-linux/aqa-tests/functional'
[2025-06-30T17:32:02.155Z] make[2]: Leaving directory '/home/jenkins/workspace/Test_openjdk21_hs_dev.functional_x86-64_alpine-linux/aqa-tests'
[2025-06-30T17:32:02.155Z]
[2025-06-30T17:32:02.155Z]
[2025-06-30T17:32:02.155Z] All tests finished, run result summary:
[2025-06-30T17:32:02.155Z] cd "/home/jenkins/workspace/Test_openjdk21_hs_dev.functional_x86-64_alpine-linux/aqa-tests/TKG/../TKG/scripts"; \
[2025-06-30T17:32:02.155Z] perl "resultsSum.pl" --failuremk="/home/jenkins/workspace/Test_openjdk21_hs_dev.functional_x86-64_alpine-linux/aqa-tests/TKG/../TKG/failedtargets.mk" --resultFile="/home/jenkins/workspace/Test_openjdk21_hs_dev.functional_x86-64_alpine-linux/aqa-tests/TKG/../TKG/output_17513039761568/TestTargetResult" --platFile="/home/jenkins/workspace/Test_openjdk21_hs_dev.functional_x86-64_alpine-linux/aqa-tests/TKG/../TKG/resources/buildPlatformMap.properties" --diagnostic=failure --jdkVersion=21 --jdkImpl=hotspot --jdkVendor="eclipse" --spec=alpine-linux_x86-64 --buildList=functional --customTarget="" --testTarget=dev.functional --tapPath=/home/jenkins/workspace/Test_openjdk21_hs_dev.functional_x86-64_alpine-linux/aqa-tests/TKG/../TKG/output_17513039761568/ --tapName=Test_openjdk21_hs_dev.functional_x86-64_alpine-linux.tap --comment=""
[2025-06-30T17:32:02.941Z]
[2025-06-30T17:32:02.941Z]
[2025-06-30T17:32:02.941Z] TEST TARGETS SUMMARY
[2025-06-30T17:32:02.941Z] ++++++++++++++++++++++++++++++++++++++++++++++++++++++++++++++++++++++++++
[2025-06-30T17:32:02.941Z] PASSED test targets:
[2025-06-30T17:32:02.941Z] ssl-tests_0 - Test results: passed: 5
[2025-06-30T17:32:02.941Z]
[2025-06-30T17:32:02.941Z] FAILED test targets:
[2025-06-30T17:32:02.941Z] TestHeadlessComponents_0
[2025-06-30T17:32:02.941Z]
[2025-06-30T17:32:02.941Z] TOTAL: 2 EXECUTED: 2 PASSED: 1 FAILED: 1 DISABLED: 0 SKIPPED: 0
[2025-06-30T17:32:02.941Z] ++++++++++++++++++++++++++++++++++++++++++++++++++++++++++++++++++++++++++
[2025-06-30T17:32:02.941Z]
[2025-06-30T17:32:02.941Z] make[1]: *** [settings.mk:454: resultsSummary] Error 2
[2025-06-30T17:32:02.941Z] make[1]: Leaving directory '/home/jenkins/workspace/Test_openjdk21_hs_dev.functional_x86-64_alpine-linux/aqa-tests/TKG'
[2025-06-30T17:32:02.941Z] make: *** [makefile:66: _dev.functional] Error 2
[Pipeline] sh
[2025-06-30T17:32:05.433Z] + uname
[2025-06-30T17:32:05.433Z] + '[' Linux '=' AIX ]
[2025-06-30T17:32:05.433Z] + uname
[2025-06-30T17:32:05.433Z] + '[' Linux '=' SunOS ]
[2025-06-30T17:32:05.433Z] + uname
[2025-06-30T17:32:05.433Z] + '[' Linux '=' '*BSD' ]
[2025-06-30T17:32:05.433Z] + MAKE=make
[2025-06-30T17:32:05.433Z] + make -f ./aqa-tests/TKG/testEnv.mk testEnvTeardown
[2025-06-30T17:32:05.433Z] make: Nothing to be done for 'testEnvTeardown'.
[Pipeline] }
[2025-06-30T17:32:05.904Z] $ ssh-agent -k
[2025-06-30T17:32:06.099Z] unset SSH_AUTH_SOCK;
[2025-06-30T17:32:06.100Z] unset SSH_AGENT_PID;
[2025-06-30T17:32:06.100Z] echo Agent pid 1543936 killed;
[2025-06-30T17:32:06.521Z] [ssh-agent] Stopped.
[Pipeline] // sshagent
[Pipeline] }
[2025-06-30T17:32:06.547Z] Xvfb stopping
[Pipeline] // wrap
[Pipeline] echo
[2025-06-30T17:32:07.641Z] There were test failures, set build result to UNSTABLE.
[Pipeline] }
[Pipeline] // stage
[Pipeline] stage
[Pipeline] { (Post)
[Pipeline] step
[2025-06-30T17:32:07.870Z] TAP Reports Processing: START
[2025-06-30T17:32:07.871Z] Looking for TAP results report in workspace using pattern: aqa-tests/TKG/**/*.tap
[2025-06-30T17:32:08.925Z] Saving reports...
[2025-06-30T17:32:09.198Z] Processing '/home/jenkins/.jenkins/jobs/Test_openjdk21_hs_dev.functional_x86-64_alpine-linux/builds/47/tap-master-files/aqa-tests/TKG/output_17513039761568/Test_openjdk21_hs_dev.functional_x86-64_alpine-linux.tap'
[2025-06-30T17:32:09.198Z] Parsing TAP test result [/home/jenkins/.jenkins/jobs/Test_openjdk21_hs_dev.functional_x86-64_alpine-linux/builds/47/tap-master-files/aqa-tests/TKG/output_17513039761568/Test_openjdk21_hs_dev.functional_x86-64_alpine-linux.tap].
[2025-06-30T17:32:09.200Z] There are failed test cases. Marking build as UNSTABLE
[2025-06-30T17:32:09.200Z] TAP Reports Processing: FINISH
[Pipeline] echo
[2025-06-30T17:32:09.208Z] Saving aqa-tests/testenv/testenv.properties file on jenkins.
[Pipeline] archiveArtifacts
[2025-06-30T17:32:09.350Z] Archiving artifacts
[2025-06-30T17:32:09.642Z] Recording fingerprints
[Pipeline] echo
[2025-06-30T17:32:09.809Z] Saving aqa-tests/TKG/**/*.tap file on jenkins.
[Pipeline] archiveArtifacts
[2025-06-30T17:32:09.956Z] Archiving artifacts
[2025-06-30T17:32:10.281Z] Recording fingerprints
[Pipeline] sh
[2025-06-30T17:32:12.092Z] + tar -cf - ./aqa-tests/TKG/output_17513039761568
[2025-06-30T17:32:12.092Z] + pigz -9
[2025-06-30T17:32:12.092Z] + gzip -9
[Pipeline] echo
[2025-06-30T17:32:12.500Z] ARTIFACTORY_SERVER is not set. Saving artifacts on jenkins.
[Pipeline] archiveArtifacts
[2025-06-30T17:32:12.643Z] Archiving artifacts
[2025-06-30T17:32:13.322Z] Recording fingerprints
[Pipeline] findFiles
[Pipeline] echo
[2025-06-30T17:32:16.814Z] Tap file found: aqa-tests/TKG/output_17513039761568/Test_openjdk21_hs_dev.functional_x86-64_alpine-linux.tap...
[Pipeline] readFile
[Pipeline] echo
[2025-06-30T17:32:17.002Z] Rerun in Grinder with failed test targets: https://ci.adoptium.net/job/Grinder/parambuild/?SDK_RESOURCE=upstream&TARGET=testList+TESTLIST=TestHeadlessComponents_0&BASE_DOCKER_REGISTRY_CREDENTIAL_ID=&TEST_FLAG=&UPSTREAM_TEST_JOB_NAME=&DOCKER_REQUIRED=false&ACTIVE_NODE_TIMEOUT=5&VENDOR_TEST_DIRS=&EXTRA_DOCKER_ARGS=&TKG_OWNER_BRANCH=adoptium%3Amaster&OPENJ9_SYSTEMTEST_OWNER_BRANCH=eclipse%3Amaster&PLATFORM=x86-64_alpine-linux&GENERATE_JOBS=false&KEEP_REPORTDIR=true&PERSONAL_BUILD=false&DOCKER_REGISTRY_DIR=&RERUN_ITERATIONS=0&ADOPTOPENJDK_REPO=https%3A%2F%2Fgithub.com%2Fadoptium%2Faqa-tests.git&SETUP_JCK_RUN=false&DOCKER_REGISTRY_URL_CREDENTIAL_ID=&LABEL=&EXTRA_OPTIONS=&CUSTOMIZED_SDK_URL=&BUILD_IDENTIFIER=&JENKINS_KEY=&ADOPTOPENJDK_BRANCH=master&LIGHT_WEIGHT_CHECKOUT=false&USE_JRE=false&ARTIFACTORY_SERVER=&KEEP_WORKSPACE=false&USER_CREDENTIALS_ID=&JDK_VERSION=21&DOCKER_REGISTRY_URL=&ITERATIONS=1&VENDOR_TEST_REPOS=&JDK_REPO=https%3A%2F%2Fgithub.com%2Fadoptium%2Fjdk21u&JCK_GIT_BRANCH=master&OPENJ9_BRANCH=master&OPENJ9_SHA=&JCK_GIT_REPO=&VENDOR_TEST_BRANCHES=&UPSTREAM_JOB_NAME=build-scripts%2Fjobs%2Fjdk21u%2Fjdk21u-alpine-linux-x64-temurin&OPENJ9_REPO=https%3A%2F%2Fgithub.com%2Feclipse-openj9%2Fopenj9.git&CLOUD_PROVIDER=&CUSTOM_TARGET=&VENDOR_TEST_SHAS=&JDK_BRANCH=dev&LABEL_ADDITION=&ARTIFACTORY_REPO=&ARTIFACTORY_ROOT_DIR=&UPSTREAM_TEST_JOB_NUMBER=&DOCKERIMAGE_TAG=&TEST_TIME=120&JDK_IMPL=hotspot&SSH_AGENT_CREDENTIAL=&AUTO_DETECT=true&SLACK_CHANNEL=aqavit-bot&DYNAMIC_COMPILE=true&RELATED_NODES=&ADOPTOPENJDK_SYSTEMTEST_OWNER_BRANCH=adoptium%3Amaster&APPLICATION_OPTIONS=&CUSTOMIZED_SDK_URL_CREDENTIAL_ID=eclipse_temurin_bot_email_and_token&ARCHIVE_TEST_RESULTS=false&NUM_MACHINES=&OPENJDK_SHA=&TRSS_URL=&RERUN_FAILURE=false&USE_TESTENV_PROPERTIES=false&BUILD_LIST=functional&ADDITIONAL_ARTIFACTS_REQUIRED=&UPSTREAM_JOB_NUMBER=128&STF_OWNER_BRANCH=adoptium%3Amaster&TIME_LIMIT=25&JVM_OPTIONS=&PARALLEL=None
[Pipeline] junit
[2025-06-30T17:32:17.154Z] Recording test results
[2025-06-30T17:32:18.737Z] [Checks API] No suitable checks publisher found.
[Pipeline] }
[Pipeline] // stage
[Pipeline] echo
[2025-06-30T17:32:18.792Z] PROCESSCATCH: Terminating any hung/left over test processes:
[Pipeline] sh
[2025-06-30T17:32:20.349Z] + aqa-tests/terminateTestProcesses.sh jenkins
[2025-06-30T17:32:20.349Z] Unix type machine..
[2025-06-30T17:32:20.349Z] Running on a Linux host
[2025-06-30T17:32:20.349Z] Woohoo - no rogue processes detected!
[Pipeline] cleanWs
[2025-06-30T17:32:21.041Z] [WS-CLEANUP] Deleting project workspace...
[2025-06-30T17:32:21.041Z] [WS-CLEANUP] Deferred wipeout is disabled by the job configuration...
[2025-06-30T17:32:23.576Z] [WS-CLEANUP] done
[Pipeline] sh
[2025-06-30T17:32:25.210Z] + find /tmp -name '*core*' -print -exec rm -f '{}' ';'
[Pipeline] }
[Pipeline] // timeout
[Pipeline] timeout
[2025-06-30T17:32:28.208Z] Timeout set to expire in 5 min 0 sec
[Pipeline] {
[Pipeline] }
[Pipeline] // timeout
[Pipeline] }
[Pipeline] // node
[Pipeline] }
[Pipeline] // stage
[Pipeline] echo
[2025-06-30T17:32:28.370Z] SETUP_LABEL: ci.role.test
[Pipeline] stage
[Pipeline] { (Parallel Tests)
[Pipeline] parallel
[2025-06-30T17:32:28.421Z] No branches to run
[Pipeline] // parallel
[Pipeline] node
[2025-06-30T17:32:28.499Z] Running on test-osuosl-centos74-ppc64le-1 in /home/jenkins/workspace/Test_openjdk21_hs_dev.functional_x86-64_alpine-linux
[Pipeline] {
[Pipeline] cleanWs
[2025-06-30T17:32:28.889Z] [WS-CLEANUP] Deleting project workspace...
[2025-06-30T17:32:28.889Z] [WS-CLEANUP] Deferred wipeout is disabled by the job configuration...
[2025-06-30T17:32:29.067Z] [WS-CLEANUP] done
[Pipeline] findFiles
[Pipeline] cleanWs
[2025-06-30T17:32:29.620Z] [WS-CLEANUP] Deleting project workspace...
[2025-06-30T17:32:29.620Z] [WS-CLEANUP] Deferred wipeout is disabled by the job configuration...
[2025-06-30T17:32:29.798Z] [WS-CLEANUP] done
[Pipeline] }
[Pipeline] // node
[Pipeline] }
[Pipeline] // stage
[Pipeline] }
[Pipeline] // timestamps
[Pipeline] End of Pipeline
Finished: UNSTABLE