renaissance-future-genetic_0
[2025-06-26T17:37:12.927Z] Running test renaissance-future-genetic_0 ...
[2025-06-26T17:37:12.927Z] ===============================================
[2025-06-26T17:37:12.927Z] renaissance-future-genetic_0 Start Time: Thu Jun 26 17:37:11 2025 Epoch Time (ms): 1750959431010
[2025-06-26T17:37:12.927Z] variation: NoOptions
[2025-06-26T17:37:12.927Z] JVM_OPTIONS:
[2025-06-26T17:37:12.927Z] { \
[2025-06-26T17:37:12.927Z] echo ""; echo "TEST SETUP:"; \
[2025-06-26T17:37:12.927Z] echo "Nothing to be done for setup."; \
[2025-06-26T17:37:12.927Z] mkdir -p "/home/jenkins/workspace/Test_openjdk21_hs_sanity.perf_x86-64_linux/aqa-tests/TKG/../TKG/output_17509578438446/renaissance-future-genetic_0"; \
[2025-06-26T17:37:12.927Z] cd "/home/jenkins/workspace/Test_openjdk21_hs_sanity.perf_x86-64_linux/aqa-tests/TKG/../TKG/output_17509578438446/renaissance-future-genetic_0"; \
[2025-06-26T17:37:12.927Z] echo ""; echo "TESTING:"; \
[2025-06-26T17:37:12.927Z] "/home/jenkins/workspace/Test_openjdk21_hs_sanity.perf_x86-64_linux/jdkbinary/j2sdk-image/bin/java" -jar "/home/jenkins/workspace/Test_openjdk21_hs_sanity.perf_x86-64_linux/aqa-tests/TKG/../../jvmtest/perf/renaissance/renaissance.jar" --json ""/home/jenkins/workspace/Test_openjdk21_hs_sanity.perf_x86-64_linux/aqa-tests/TKG/../TKG/output_17509578438446/renaissance-future-genetic_0"/future-genetic.json" future-genetic; \
[2025-06-26T17:37:12.927Z] if [ $? -eq 0 ]; then echo "-----------------------------------"; echo "renaissance-future-genetic_0""_PASSED"; echo "-----------------------------------"; cd /home/jenkins/workspace/Test_openjdk21_hs_sanity.perf_x86-64_linux/aqa-tests/TKG/..; rm -f -r "/home/jenkins/workspace/Test_openjdk21_hs_sanity.perf_x86-64_linux/aqa-tests/TKG/../TKG/output_17509578438446/renaissance-future-genetic_0"; else echo "-----------------------------------"; echo "renaissance-future-genetic_0""_FAILED"; echo "-----------------------------------"; fi; \
[2025-06-26T17:37:12.927Z] echo ""; echo "TEST TEARDOWN:"; \
[2025-06-26T17:37:12.927Z] echo "Nothing to be done for teardown."; \
[2025-06-26T17:37:12.927Z] } 2>&1 | tee -a "/home/jenkins/workspace/Test_openjdk21_hs_sanity.perf_x86-64_linux/aqa-tests/TKG/../TKG/output_17509578438446/TestTargetResult";
[2025-06-26T17:37:12.927Z]
[2025-06-26T17:37:12.927Z] TEST SETUP:
[2025-06-26T17:37:12.927Z] Nothing to be done for setup.
[2025-06-26T17:37:12.927Z]
[2025-06-26T17:37:12.927Z] TESTING:
[2025-06-26T17:37:12.927Z] ====== future-genetic (functional) [default], iteration 0 started ======
[2025-06-26T17:37:12.927Z] GC before operation: completed in 15.022 ms, heap usage 14.149 MB -> 3.821 MB.
[2025-06-26T17:37:23.675Z] ====== future-genetic (functional) [default], iteration 0 completed (11230.971 ms) ======
[2025-06-26T17:37:23.675Z] ====== future-genetic (functional) [default], iteration 1 started ======
[2025-06-26T17:37:23.675Z] GC before operation: completed in 25.368 ms, heap usage 82.064 MB -> 4.994 MB.
[2025-06-26T17:37:34.418Z] ====== future-genetic (functional) [default], iteration 1 completed (10062.370 ms) ======
[2025-06-26T17:37:34.418Z] ====== future-genetic (functional) [default], iteration 2 started ======
[2025-06-26T17:37:34.418Z] GC before operation: completed in 21.334 ms, heap usage 181.970 MB -> 4.992 MB.
[2025-06-26T17:37:43.228Z] ====== future-genetic (functional) [default], iteration 2 completed (9870.324 ms) ======
[2025-06-26T17:37:43.228Z] ====== future-genetic (functional) [default], iteration 3 started ======
[2025-06-26T17:37:43.228Z] GC before operation: completed in 21.399 ms, heap usage 181.456 MB -> 4.992 MB.
[2025-06-26T17:37:53.961Z] ====== future-genetic (functional) [default], iteration 3 completed (9648.621 ms) ======
[2025-06-26T17:37:53.961Z] ====== future-genetic (functional) [default], iteration 4 started ======
[2025-06-26T17:37:53.961Z] GC before operation: completed in 19.634 ms, heap usage 129.228 MB -> 4.992 MB.
[2025-06-26T17:38:02.773Z] ====== future-genetic (functional) [default], iteration 4 completed (9615.675 ms) ======
[2025-06-26T17:38:02.773Z] ====== future-genetic (functional) [default], iteration 5 started ======
[2025-06-26T17:38:02.773Z] GC before operation: completed in 18.160 ms, heap usage 30.200 MB -> 4.992 MB.
[2025-06-26T17:38:13.578Z] ====== future-genetic (functional) [default], iteration 5 completed (9529.088 ms) ======
[2025-06-26T17:38:13.578Z] ====== future-genetic (functional) [default], iteration 6 started ======
[2025-06-26T17:38:13.578Z] GC before operation: completed in 21.067 ms, heap usage 229.407 MB -> 4.993 MB.
[2025-06-26T17:38:22.383Z] ====== future-genetic (functional) [default], iteration 6 completed (9340.134 ms) ======
[2025-06-26T17:38:22.383Z] ====== future-genetic (functional) [default], iteration 7 started ======
[2025-06-26T17:38:22.383Z] GC before operation: completed in 20.291 ms, heap usage 209.369 MB -> 4.993 MB.
[2025-06-26T17:38:31.195Z] ====== future-genetic (functional) [default], iteration 7 completed (9287.865 ms) ======
[2025-06-26T17:38:31.195Z] ====== future-genetic (functional) [default], iteration 8 started ======
[2025-06-26T17:38:31.195Z] GC before operation: completed in 18.902 ms, heap usage 142.847 MB -> 4.993 MB.
[2025-06-26T17:38:40.013Z] ====== future-genetic (functional) [default], iteration 8 completed (9234.516 ms) ======
[2025-06-26T17:38:40.013Z] ====== future-genetic (functional) [default], iteration 9 started ======
[2025-06-26T17:38:40.013Z] GC before operation: completed in 20.567 ms, heap usage 232.818 MB -> 4.993 MB.
[2025-06-26T17:38:50.750Z] ====== future-genetic (functional) [default], iteration 9 completed (9217.459 ms) ======
[2025-06-26T17:38:50.750Z] ====== future-genetic (functional) [default], iteration 10 started ======
[2025-06-26T17:38:50.750Z] GC before operation: completed in 17.695 ms, heap usage 109.824 MB -> 4.993 MB.
[2025-06-26T17:38:59.636Z] ====== future-genetic (functional) [default], iteration 10 completed (9482.956 ms) ======
[2025-06-26T17:38:59.636Z] ====== future-genetic (functional) [default], iteration 11 started ======
[2025-06-26T17:38:59.636Z] GC before operation: completed in 20.776 ms, heap usage 179.770 MB -> 4.993 MB.
[2025-06-26T17:39:08.455Z] ====== future-genetic (functional) [default], iteration 11 completed (9597.249 ms) ======
[2025-06-26T17:39:08.455Z] ====== future-genetic (functional) [default], iteration 12 started ======
[2025-06-26T17:39:08.455Z] GC before operation: completed in 19.499 ms, heap usage 189.805 MB -> 4.993 MB.
[2025-06-26T17:39:19.254Z] ====== future-genetic (functional) [default], iteration 12 completed (9603.335 ms) ======
[2025-06-26T17:39:19.254Z] ====== future-genetic (functional) [default], iteration 13 started ======
[2025-06-26T17:39:19.254Z] GC before operation: completed in 24.123 ms, heap usage 71.947 MB -> 4.993 MB.
[2025-06-26T17:39:28.063Z] ====== future-genetic (functional) [default], iteration 13 completed (9649.184 ms) ======
[2025-06-26T17:39:28.063Z] ====== future-genetic (functional) [default], iteration 14 started ======
[2025-06-26T17:39:28.063Z] GC before operation: completed in 19.409 ms, heap usage 78.837 MB -> 4.993 MB.
[2025-06-26T17:39:38.867Z] ====== future-genetic (functional) [default], iteration 14 completed (9549.197 ms) ======
[2025-06-26T17:39:38.867Z] ====== future-genetic (functional) [default], iteration 15 started ======
[2025-06-26T17:39:38.867Z] GC before operation: completed in 21.361 ms, heap usage 234.432 MB -> 4.993 MB.
[2025-06-26T17:39:47.678Z] ====== future-genetic (functional) [default], iteration 15 completed (9648.749 ms) ======
[2025-06-26T17:39:47.678Z] ====== future-genetic (functional) [default], iteration 16 started ======
[2025-06-26T17:39:47.678Z] GC before operation: completed in 18.880 ms, heap usage 147.017 MB -> 4.993 MB.
[2025-06-26T17:39:56.488Z] ====== future-genetic (functional) [default], iteration 16 completed (9587.697 ms) ======
[2025-06-26T17:39:56.488Z] ====== future-genetic (functional) [default], iteration 17 started ======
[2025-06-26T17:39:56.808Z] GC before operation: completed in 20.727 ms, heap usage 211.762 MB -> 4.993 MB.
Calling Pipeline was cancelled
[2025-06-26T17:40:07.089Z] Sending interrupt signal to process
[2025-06-26T17:40:07.544Z] ====== future-genetic (functional) [default], iteration 17 completed (9408.273 ms) ======
[2025-06-26T17:40:07.544Z] ====== future-genetic (functional) [default], iteration 18 started ======
[2025-06-26T17:40:07.544Z] GC before operation: completed in 17.601 ms, heap usage 93.796 MB -> 4.993 MB.
[2025-06-26T17:40:07.544Z] make[4]: *** [autoGen.mk:89: renaissance-future-genetic_0] Error 143
[2025-06-26T17:40:07.544Z] make[4]: Leaving directory '/home/jenkins/workspace/Test_openjdk21_hs_sanity.perf_x86-64_linux/aqa-tests/perf/renaissance'
[2025-06-26T17:40:07.544Z] make[3]: *** [/home/jenkins/workspace/Test_openjdk21_hs_sanity.perf_x86-64_linux/aqa-tests/TKG/../TKG/settings.mk:362: sanity.perf-renaissance] Error 2
[2025-06-26T17:40:07.544Z] make[3]: Leaving directory '/home/jenkins/workspace/Test_openjdk21_hs_sanity.perf_x86-64_linux/aqa-tests/perf'
[2025-06-26T17:40:07.544Z] make[2]: *** [/home/jenkins/workspace/Test_openjdk21_hs_sanity.perf_x86-64_linux/aqa-tests/TKG/../TKG/settings.mk:362: sanity.perf-perf] Error 2
[2025-06-26T17:40:07.544Z] make[2]: Leaving directory '/home/jenkins/workspace/Test_openjdk21_hs_sanity.perf_x86-64_linux/aqa-tests'
[2025-06-26T17:40:07.544Z] make[1]: *** [settings.mk:362: sanity.perf-..] Error 2
[2025-06-26T17:40:07.544Z] make[1]: Leaving directory '/home/jenkins/workspace/Test_openjdk21_hs_sanity.perf_x86-64_linux/aqa-tests/TKG'
[2025-06-26T17:40:07.544Z] make: *** [makefile:62: _sanity.perf] Error 2
[2025-06-26T17:40:07.601Z] script returned exit code 2
[Pipeline] sh
[2025-06-26T17:40:08.185Z] ++ uname
[2025-06-26T17:40:08.185Z] + '[' Linux = AIX ']'
[2025-06-26T17:40:08.185Z] ++ uname
[2025-06-26T17:40:08.185Z] + '[' Linux = SunOS ']'
[2025-06-26T17:40:08.185Z] ++ uname
[2025-06-26T17:40:08.185Z] + '[' Linux = '*BSD' ']'
[2025-06-26T17:40:08.185Z] + MAKE=make
[2025-06-26T17:40:08.185Z] + make -f ./aqa-tests/TKG/testEnv.mk testEnvTeardown
[2025-06-26T17:40:08.185Z] make: Nothing to be done for 'testEnvTeardown'.
[Pipeline] }
[2025-06-26T17:40:08.247Z] $ ssh-agent -k
[2025-06-26T17:40:08.252Z] unset SSH_AUTH_SOCK;
[2025-06-26T17:40:08.252Z] unset SSH_AGENT_PID;
[2025-06-26T17:40:08.252Z] echo Agent pid 392810 killed;
[2025-06-26T17:40:08.366Z] [ssh-agent] Stopped.
[Pipeline] // sshagent
[Pipeline] }
[2025-06-26T17:40:08.402Z] Xvfb stopping
[Pipeline] // wrap
[Pipeline] writeJSON
[Pipeline] archiveArtifacts
[2025-06-26T17:40:08.582Z] Archiving artifacts
[2025-06-26T17:40:08.625Z] Recording fingerprints
[Pipeline] echo
[2025-06-26T17:40:08.663Z] DaCapo-h2 metric found and archived
[Pipeline] echo
[2025-06-26T17:40:08.681Z] Could not find test result, set build result to FAILURE.
[Pipeline] }
[Pipeline] // stage
[Pipeline] stage
[Pipeline] { (Post)
[Pipeline] step
[2025-06-26T17:40:08.766Z] TAP Reports Processing: START
[2025-06-26T17:40:08.767Z] Looking for TAP results report in workspace using pattern: aqa-tests/TKG/**/*.tap
[2025-06-26T17:40:08.792Z] Did not find any matching files. Setting build result to FAILURE.
[Pipeline] echo
[2025-06-26T17:40:08.799Z] Saving aqa-tests/testenv/testenv.properties file on jenkins.
[Pipeline] archiveArtifacts
[2025-06-26T17:40:08.828Z] Archiving artifacts
[2025-06-26T17:40:08.865Z] Recording fingerprints
[Pipeline] echo
[2025-06-26T17:40:08.901Z] Saving aqa-tests/TKG/**/*.tap file on jenkins.
[Pipeline] archiveArtifacts
[2025-06-26T17:40:08.925Z] Archiving artifacts
[Pipeline] sh
[2025-06-26T17:40:09.383Z] + tar -cf benchmark_test_output.tar.gz ./aqa-tests/TKG/output_17509578438446
[Pipeline] echo
[2025-06-26T17:40:09.439Z] ARTIFACTORY_SERVER is not set. Saving artifacts on jenkins.
[Pipeline] archiveArtifacts
[2025-06-26T17:40:09.466Z] Archiving artifacts
[2025-06-26T17:40:09.504Z] Recording fingerprints
[Pipeline] findFiles
[Pipeline] junit
[2025-06-26T17:40:11.060Z] Recording test results
[2025-06-26T17:40:12.227Z] [Checks API] No suitable checks publisher found.
[Pipeline] }
[Pipeline] // stage
[Pipeline] echo
[2025-06-26T17:40:12.255Z] PROCESSCATCH: Terminating any hung/left over test processes:
[Pipeline] sh
[2025-06-26T17:40:12.696Z] + aqa-tests/terminateTestProcesses.sh jenkins
[2025-06-26T17:40:12.696Z] Unix type machine..
[2025-06-26T17:40:12.696Z] Running on a Linux host
[2025-06-26T17:40:12.696Z] Woohoo - no rogue processes detected!
[Pipeline] cleanWs
[2025-06-26T17:40:12.803Z] [WS-CLEANUP] Deleting project workspace...
[2025-06-26T17:40:12.803Z] [WS-CLEANUP] Deferred wipeout is disabled by the job configuration...
[2025-06-26T17:40:12.167Z] No test report files were found. Configuration error?
[2025-06-26T17:40:17.806Z] [WS-CLEANUP] done
[Pipeline] sh
[2025-06-26T17:40:18.247Z] + find /tmp -name '*core*' -print -exec rm -f '{}' ';'
[2025-06-26T17:40:18.247Z] + true
[Pipeline] }
[Pipeline] // timeout
[Pipeline] timeout
[2025-06-26T17:40:18.341Z] Timeout set to expire in 5 min 0 sec
[Pipeline] {
[Pipeline] echo
[2025-06-26T17:40:18.362Z] Test_openjdk21_hs_sanity.perf_x86-64_linux #259 result is FAILURE. Checking console log for specific errors...
[Pipeline] }
[Pipeline] // timeout
[Pipeline] }
[Pipeline] // node
[Pipeline] }
[Pipeline] // stage
[Pipeline] }
[Pipeline] // timestamps
[Pipeline] End of Pipeline
Finished: ABORTED