Post Test
[2025-04-04T08:25:23.202Z] make[4]: Leaving directory '/home/jenkins/workspace/Test_openjdk25_hs_extended.openjdk_ppc64le_linux_testList_1/aqa-tests/openjdk'
[2025-04-04T08:25:23.202Z] make[3]: Leaving directory '/home/jenkins/workspace/Test_openjdk25_hs_extended.openjdk_ppc64le_linux_testList_1/aqa-tests'
[2025-04-04T08:25:23.202Z]
[2025-04-04T08:25:23.202Z]
[2025-04-04T08:25:23.202Z] All tests finished, run result summary:
[2025-04-04T08:25:23.202Z] cd "/home/jenkins/workspace/Test_openjdk25_hs_extended.openjdk_ppc64le_linux_testList_1/aqa-tests/TKG/../TKG/scripts"; \
[2025-04-04T08:25:23.202Z] perl "resultsSum.pl" --failuremk="/home/jenkins/workspace/Test_openjdk25_hs_extended.openjdk_ppc64le_linux_testList_1/aqa-tests/TKG/../TKG/failedtargets.mk" --resultFile="/home/jenkins/workspace/Test_openjdk25_hs_extended.openjdk_ppc64le_linux_testList_1/aqa-tests/TKG/../TKG/output_17437332545453/TestTargetResult" --platFile="/home/jenkins/workspace/Test_openjdk25_hs_extended.openjdk_ppc64le_linux_testList_1/aqa-tests/TKG/../TKG/resources/buildPlatformMap.properties" --diagnostic=failure --jdkVersion=25 --jdkImpl=hotspot --jdkVendor="eclipse" --spec=linux_ppc-64_le --buildList=openjdk --customTarget="" --testTarget=testList --tapPath=/home/jenkins/workspace/Test_openjdk25_hs_extended.openjdk_ppc64le_linux_testList_1/aqa-tests/TKG/../TKG/output_17437332545453/ --tapName=Test_openjdk25_hs_extended.openjdk_ppc64le_linux_testList_1.tap --comment=""
[2025-04-04T08:25:24.156Z]
[2025-04-04T08:25:24.156Z]
[2025-04-04T08:25:24.156Z] TEST TARGETS SUMMARY
[2025-04-04T08:25:24.156Z] ++++++++++++++++++++++++++++++++++++++++++++++++++++++++++++++++++++++++++
[2025-04-04T08:25:24.156Z] DISABLED test targets:
[2025-04-04T08:25:24.156Z] jdk_awt_0
[2025-04-04T08:25:24.156Z] jdk_awt_2
[2025-04-04T08:25:24.156Z] jdk_sound_0
[2025-04-04T08:25:24.156Z] jdk_sound_2
[2025-04-04T08:25:24.156Z] jdk_swing_1
[2025-04-04T08:25:24.156Z] jdk_client_sanity_1
[2025-04-04T08:25:24.156Z] jdk_security_infra_0
[2025-04-04T08:25:24.156Z] jdk_security_infra_2
[2025-04-04T08:25:24.156Z] jdk_2d_1
[2025-04-04T08:25:24.156Z] jdk_jfc_demo_0
[2025-04-04T08:25:24.156Z] jdk_jfc_demo_2
[2025-04-04T08:25:24.156Z]
[2025-04-04T08:25:24.156Z] PASSED test targets:
[2025-04-04T08:25:24.156Z] hotspot_gc_0 - Test results: passed: 529; skipped: 4; excluded: 16; did not meet platform requirements: 21
[2025-04-04T08:25:24.156Z] hotspot_runtime_0 - Test results: passed: 1,079; skipped: 5; excluded: 8; did not match keywords: 7; did not meet platform requirements: 73
[2025-04-04T08:25:24.156Z] hotspot_native_sanity_0 - Test results: passed: 1
[2025-04-04T08:25:24.156Z] jdk_io_0 - Test results: passed: 424; skipped: 1; excluded: 1; did not match keywords: 2; did not meet platform requirements: 8
[2025-04-04T08:25:24.156Z] jdk_io_1 - Test results: passed: 424; skipped: 1; excluded: 1; did not match keywords: 2; did not meet platform requirements: 8
[2025-04-04T08:25:24.156Z] jdk_net_0 - Test results: passed: 862; excluded: 50; did not match keywords: 6; did not meet platform requirements: 5
[2025-04-04T08:25:24.156Z] jdk_nio_0 - Test results: passed: 479; skipped: 1; excluded: 10; did not match keywords: 4; did not meet platform requirements: 16
[2025-04-04T08:25:24.156Z] jdk_time_0 - Test results: passed: 187
[2025-04-04T08:25:24.156Z] jdk_management_0 - Test results: passed: 136; excluded: 6; did not meet platform requirements: 5
[2025-04-04T08:25:24.156Z] jdk_rmi_1 - Test results: passed: 87; excluded: 3; did not match keywords: 2
[2025-04-04T08:25:24.156Z] jdk_jdi_0 - Test results: passed: 182; excluded: 5; did not meet platform requirements: 1
[2025-04-04T08:25:24.156Z] jdk_build_0 - Test results: passed: 2; did not meet platform requirements: 1
[2025-04-04T08:25:24.156Z] jdk_native_sanity_1 - Test results: passed: 3
[2025-04-04T08:25:24.156Z]
[2025-04-04T08:25:24.156Z] FAILED test targets:
[2025-04-04T08:25:24.156Z] jdk_tools_1 - Test results: passed: 347; failed: 2; skipped: 6; excluded: 10; did not meet platform requirements: 62
[2025-04-04T08:25:24.156Z] Failed test cases:
[2025-04-04T08:25:24.156Z] TEST: tools/jpackage/share/ErrorTest.java#id0
[2025-04-04T08:25:24.156Z] TEST: tools/jpackage/share/ErrorTest.java#id1
[2025-04-04T08:25:24.156Z]
[2025-04-04T08:25:24.156Z]
[2025-04-04T08:25:24.156Z] TOTAL: 35 EXECUTED: 14 PASSED: 13 FAILED: 1 DISABLED: 11 SKIPPED: 10
[2025-04-04T08:25:24.156Z] ++++++++++++++++++++++++++++++++++++++++++++++++++++++++++++++++++++++++++
[2025-04-04T08:25:24.156Z]
[2025-04-04T08:25:24.156Z] TESTCASES RESULTS SUMMARY: passed: 4,742; failed: 2; error: 0; skipped: 18
[2025-04-04T08:25:24.156Z] ++++++++++++++++++++++++++++++++++++++++++++++++++++++++++++++++++++++++++
[2025-04-04T08:25:24.156Z] make[2]: *** [settings.mk:445: resultsSummary] Error 2
[2025-04-04T08:25:24.156Z] make[2]: Leaving directory '/home/jenkins/workspace/Test_openjdk25_hs_extended.openjdk_ppc64le_linux_testList_1/aqa-tests/TKG'
[2025-04-04T08:25:24.156Z] make[1]: *** [makefile:62: _testList] Error 2
[2025-04-04T08:25:24.156Z] make[1]: Leaving directory '/home/jenkins/workspace/Test_openjdk25_hs_extended.openjdk_ppc64le_linux_testList_1/aqa-tests/TKG'
[2025-04-04T08:25:24.156Z] make: *** [parallelList.mk:20: testList_1] Error 2
[Pipeline] sh
[2025-04-04T08:25:27.191Z] ++ uname
[2025-04-04T08:25:27.191Z] + '[' Linux = AIX ']'
[2025-04-04T08:25:27.191Z] ++ uname
[2025-04-04T08:25:27.191Z] + '[' Linux = SunOS ']'
[2025-04-04T08:25:27.191Z] ++ uname
[2025-04-04T08:25:27.191Z] + '[' Linux = '*BSD' ']'
[2025-04-04T08:25:27.191Z] + MAKE=make
[2025-04-04T08:25:27.191Z] + make -f ./aqa-tests/TKG/testEnv.mk testEnvTeardown
[2025-04-04T08:25:27.191Z] make: Nothing to be done for 'testEnvTeardown'.
[Pipeline] }
[2025-04-04T08:25:27.723Z] Xvfb stopping
[Pipeline] // wrap
[Pipeline] echo
[2025-04-04T08:25:30.579Z] There were test failures, set build result to UNSTABLE.
[Pipeline] }
[Pipeline] // stage
[Pipeline] stage
[Pipeline] { (Post)
[Pipeline] step
[2025-04-04T08:25:30.840Z] TAP Reports Processing: START
[2025-04-04T08:25:30.841Z] Looking for TAP results report in workspace using pattern: aqa-tests/TKG/**/*.tap
[2025-04-04T08:25:34.771Z] Saving reports...
[2025-04-04T08:25:34.957Z] Processing '/home/jenkins/.jenkins/jobs/Test_openjdk25_hs_extended.openjdk_ppc64le_linux_testList_1/builds/9/tap-master-files/aqa-tests/TKG/output_17437332545453/Test_openjdk25_hs_extended.openjdk_ppc64le_linux_testList_1.tap'
[2025-04-04T08:25:34.957Z] Parsing TAP test result [/home/jenkins/.jenkins/jobs/Test_openjdk25_hs_extended.openjdk_ppc64le_linux_testList_1/builds/9/tap-master-files/aqa-tests/TKG/output_17437332545453/Test_openjdk25_hs_extended.openjdk_ppc64le_linux_testList_1.tap].
[2025-04-04T08:25:34.963Z] There are failed test cases. Marking build as UNSTABLE
[2025-04-04T08:25:34.963Z] TAP Reports Processing: FINISH
[Pipeline] echo
[2025-04-04T08:25:34.976Z] Saving aqa-tests/testenv/testenv.properties file on jenkins.
[Pipeline] archiveArtifacts
[2025-04-04T08:25:35.162Z] Archiving artifacts
[2025-04-04T08:25:35.665Z] Recording fingerprints
[Pipeline] echo
[2025-04-04T08:25:35.863Z] Saving aqa-tests/TKG/**/*.tap file on jenkins.
[Pipeline] archiveArtifacts
[2025-04-04T08:25:36.049Z] Archiving artifacts
[2025-04-04T08:25:39.280Z] Recording fingerprints
[Pipeline] sh
[2025-04-04T08:25:44.225Z] + tar -cf - ./aqa-tests/TKG/output_17437332545453
[2025-04-04T08:25:44.225Z] + pigz -9
[Pipeline] echo
[2025-04-04T08:31:49.338Z] ARTIFACTORY_SERVER is not set. Saving artifacts on jenkins.
[Pipeline] archiveArtifacts
[2025-04-04T08:31:49.526Z] Archiving artifacts
[2025-04-04T08:32:06.943Z] Recording fingerprints
[Pipeline] findFiles
[Pipeline] echo
[2025-04-04T08:32:17.981Z] Tap file found: aqa-tests/TKG/output_17437332545453/Test_openjdk25_hs_extended.openjdk_ppc64le_linux_testList_1.tap...
[Pipeline] readFile
[Pipeline] echo
[2025-04-04T08:32:18.255Z] Rerun in Grinder with failed test targets: https://ci.adoptium.net/job/Grinder/parambuild/?SDK_RESOURCE=upstream&TARGET=testList+TESTLIST=jdk_tools_1&BASE_DOCKER_REGISTRY_CREDENTIAL_ID=&TEST_FLAG=&UPSTREAM_TEST_JOB_NAME=Test_openjdk25_hs_extended.openjdk_ppc64le_linux&DOCKER_REQUIRED=false&ACTIVE_NODE_TIMEOUT=5&VENDOR_TEST_DIRS=&EXTRA_DOCKER_ARGS=&TKG_OWNER_BRANCH=adoptium%3Amaster&OPENJ9_SYSTEMTEST_OWNER_BRANCH=eclipse%3Amaster&PLATFORM=ppc64le_linux&GENERATE_JOBS=true&KEEP_REPORTDIR=true&PERSONAL_BUILD=false&DOCKER_REGISTRY_DIR=&RERUN_ITERATIONS=0&ADOPTOPENJDK_REPO=https%3A%2F%2Fgithub.com%2Fadoptium%2Faqa-tests.git&SETUP_JCK_RUN=false&DOCKER_REGISTRY_URL_CREDENTIAL_ID=&LABEL=&EXTRA_OPTIONS=&CUSTOMIZED_SDK_URL=&BUILD_IDENTIFIER=&JENKINS_KEY=&ADOPTOPENJDK_BRANCH=master&LIGHT_WEIGHT_CHECKOUT=false&USE_JRE=false&ARTIFACTORY_SERVER=&KEEP_WORKSPACE=false&USER_CREDENTIALS_ID=&JDK_VERSION=25&DOCKER_REGISTRY_URL=&ITERATIONS=1&VENDOR_TEST_REPOS=&JDK_REPO=https%3A%2F%2Fgithub.com%2Fadoptium%2Fjdk&JCK_GIT_BRANCH=master&OPENJ9_BRANCH=master&OPENJ9_SHA=&JCK_GIT_REPO=&VENDOR_TEST_BRANCHES=&UPSTREAM_JOB_NAME=build-scripts%2Fjobs%2Fjdk%2Fjdk-linux-ppc64le-temurin&OPENJ9_REPO=https%3A%2F%2Fgithub.com%2Feclipse-openj9%2Fopenj9.git&CLOUD_PROVIDER=&CUSTOM_TARGET=&VENDOR_TEST_SHAS=&JDK_BRANCH=jdk-25%2B17_adopt&LABEL_ADDITION=&ARTIFACTORY_REPO=&ARTIFACTORY_ROOT_DIR=&UPSTREAM_TEST_JOB_NUMBER=11&DOCKERIMAGE_TAG=&TEST_TIME=&JDK_IMPL=hotspot&SSH_AGENT_CREDENTIAL=&AUTO_DETECT=true&SLACK_CHANNEL=aqavit-bot&DYNAMIC_COMPILE=false&RELATED_NODES=&ADOPTOPENJDK_SYSTEMTEST_OWNER_BRANCH=adoptium%3Amaster&APPLICATION_OPTIONS=&CUSTOMIZED_SDK_URL_CREDENTIAL_ID=eclipse_temurin_bot_email_and_token&ARCHIVE_TEST_RESULTS=false&NUM_MACHINES=&OPENJDK_SHA=&TRSS_URL=&RERUN_FAILURE=false&USE_TESTENV_PROPERTIES=false&BUILD_LIST=openjdk&ADDITIONAL_ARTIFACTS_REQUIRED=&UPSTREAM_JOB_NUMBER=349&STF_OWNER_BRANCH=adoptium%3Amaster&TIME_LIMIT=25&JVM_OPTIONS=&PARALLEL=None
[Pipeline] echo
[2025-04-04T08:32:18.321Z] Rerun failed jdk test cases in Grinder with jdk_custom target: https://ci.adoptium.net/job/Grinder/parambuild/?SDK_RESOURCE=upstream&TARGET=jdk_custom&BASE_DOCKER_REGISTRY_CREDENTIAL_ID=&TEST_FLAG=&UPSTREAM_TEST_JOB_NAME=Test_openjdk25_hs_extended.openjdk_ppc64le_linux&DOCKER_REQUIRED=false&ACTIVE_NODE_TIMEOUT=5&VENDOR_TEST_DIRS=&EXTRA_DOCKER_ARGS=&TKG_OWNER_BRANCH=adoptium%3Amaster&OPENJ9_SYSTEMTEST_OWNER_BRANCH=eclipse%3Amaster&PLATFORM=ppc64le_linux&GENERATE_JOBS=true&KEEP_REPORTDIR=true&PERSONAL_BUILD=false&DOCKER_REGISTRY_DIR=&RERUN_ITERATIONS=0&ADOPTOPENJDK_REPO=https%3A%2F%2Fgithub.com%2Fadoptium%2Faqa-tests.git&SETUP_JCK_RUN=false&DOCKER_REGISTRY_URL_CREDENTIAL_ID=&LABEL=&EXTRA_OPTIONS=&CUSTOMIZED_SDK_URL=&BUILD_IDENTIFIER=&JENKINS_KEY=&ADOPTOPENJDK_BRANCH=master&LIGHT_WEIGHT_CHECKOUT=false&USE_JRE=false&ARTIFACTORY_SERVER=&KEEP_WORKSPACE=false&USER_CREDENTIALS_ID=&JDK_VERSION=25&DOCKER_REGISTRY_URL=&ITERATIONS=1&VENDOR_TEST_REPOS=&JDK_REPO=https%3A%2F%2Fgithub.com%2Fadoptium%2Fjdk&JCK_GIT_BRANCH=master&OPENJ9_BRANCH=master&OPENJ9_SHA=&JCK_GIT_REPO=&VENDOR_TEST_BRANCHES=&UPSTREAM_JOB_NAME=build-scripts%2Fjobs%2Fjdk%2Fjdk-linux-ppc64le-temurin&OPENJ9_REPO=https%3A%2F%2Fgithub.com%2Feclipse-openj9%2Fopenj9.git&CLOUD_PROVIDER=&CUSTOM_TARGET=tools%2Fjpackage%2Fshare%2FErrorTest.java%23id0+tools%2Fjpackage%2Fshare%2FErrorTest.java%23id1&VENDOR_TEST_SHAS=&JDK_BRANCH=jdk-25%2B17_adopt&LABEL_ADDITION=&ARTIFACTORY_REPO=&ARTIFACTORY_ROOT_DIR=&UPSTREAM_TEST_JOB_NUMBER=11&DOCKERIMAGE_TAG=&TEST_TIME=&JDK_IMPL=hotspot&SSH_AGENT_CREDENTIAL=&AUTO_DETECT=true&SLACK_CHANNEL=aqavit-bot&DYNAMIC_COMPILE=false&RELATED_NODES=&ADOPTOPENJDK_SYSTEMTEST_OWNER_BRANCH=adoptium%3Amaster&APPLICATION_OPTIONS=&CUSTOMIZED_SDK_URL_CREDENTIAL_ID=eclipse_temurin_bot_email_and_token&ARCHIVE_TEST_RESULTS=false&NUM_MACHINES=&OPENJDK_SHA=&TRSS_URL=&RERUN_FAILURE=false&USE_TESTENV_PROPERTIES=false&BUILD_LIST=openjdk&ADDITIONAL_ARTIFACTS_REQUIRED=&UPSTREAM_JOB_NUMBER=349&STF_OWNER_BRANCH=adoptium%3Amaster&TIME_LIMIT=25&JVM_OPTIONS=&PARALLEL=None
[Pipeline] junit
[2025-04-04T08:32:18.511Z] Recording test results
[2025-04-04T08:32:32.334Z] [Checks API] No suitable checks publisher found.
[Pipeline] }
[Pipeline] // stage
[Pipeline] echo
[2025-04-04T08:32:32.395Z] PROCESSCATCH: Terminating any hung/left over test processes:
[Pipeline] sh
[2025-04-04T08:32:34.284Z] + aqa-tests/terminateTestProcesses.sh jenkins
[2025-04-04T08:32:34.284Z] Unix type machine..
[2025-04-04T08:32:34.284Z] egrep: warning: egrep is obsolescent; using grep -E
[2025-04-04T08:32:34.284Z] grep: warning: stray \ before /
[2025-04-04T08:32:34.284Z] grep: warning: stray \ before /
[2025-04-04T08:32:34.284Z] Running on a Linux host
[2025-04-04T08:32:34.284Z] egrep: warning: egrep is obsolescent; using grep -E
[2025-04-04T08:32:34.284Z] egrep: warning: egrep is obsolescent; using grep -E
[2025-04-04T08:32:34.284Z] egrep: warning: egrep is obsolescent; using grep -E
[2025-04-04T08:32:34.284Z] grep: warning: stray \ before /
[2025-04-04T08:32:34.284Z] Woohoo - no rogue processes detected!
[Pipeline] cleanWs
[2025-04-04T08:32:35.179Z] [WS-CLEANUP] Deleting project workspace...
[2025-04-04T08:32:35.179Z] [WS-CLEANUP] Deferred wipeout is disabled by the job configuration...
[2025-04-04T08:33:27.525Z] [WS-CLEANUP] done
[Pipeline] sh
[2025-04-04T08:33:29.559Z] + find /tmp -name '*core*' -print -exec rm -f '{}' ';'
[Pipeline] }
[Pipeline] // timeout
[Pipeline] timeout
[2025-04-04T08:33:44.006Z] Timeout set to expire in 5 min 0 sec
[Pipeline] {
[Pipeline] }
[Pipeline] // timeout
[Pipeline] }
[Pipeline] // node
[Pipeline] }
[Pipeline] // stage
[Pipeline] echo
[2025-04-04T08:33:44.153Z] SETUP_LABEL: ci.role.test
[Pipeline] }
[Pipeline] // timestamps
[Pipeline] End of Pipeline
/home/jenkins/.jenkins/workspace/Test_openjdk25_hs_extended.openjdk_ppc64le_linux_testList_1@tmp/jfrog/9/.jfrog deleted
Finished: UNSTABLE