PatMod_Unex_0
[2025-02-13T03:51:26.871Z] Running test PatMod_Unex_0 ...
[2025-02-13T03:51:26.871Z] ===============================================
[2025-02-13T03:51:26.871Z] PatMod_Unex_0 Start Time: Thu Feb 13 03:51:26 2025 Epoch Time (ms): 1739418686599
[2025-02-13T03:51:26.871Z] variation: Mode150
[2025-02-13T03:51:26.871Z] JVM_OPTIONS: -XX:+UseCompressedOops
[2025-02-13T03:51:26.871Z] { \
[2025-02-13T03:51:26.871Z] echo ""; echo "TEST SETUP:"; \
[2025-02-13T03:51:26.871Z] echo "Nothing to be done for setup."; \
[2025-02-13T03:51:26.871Z] mkdir -p "/home/jenkins/workspace/Test_openjdk21_hs_sanity.system_riscv64_linux_testList_1/aqa-tests/TKG/../TKG/output_17394180847736/PatMod_Unex_0"; \
[2025-02-13T03:51:26.871Z] cd "/home/jenkins/workspace/Test_openjdk21_hs_sanity.system_riscv64_linux_testList_1/aqa-tests/TKG/../TKG/output_17394180847736/PatMod_Unex_0"; \
[2025-02-13T03:51:26.871Z] echo ""; echo "TESTING:"; \
[2025-02-13T03:51:26.872Z] perl /home/jenkins/workspace/Test_openjdk21_hs_sanity.system_riscv64_linux_testList_1/aqa-tests/TKG/../../jvmtest/system/modularity/..//STF/stf.core/scripts/stf.pl -test-root="/home/jenkins/workspace/Test_openjdk21_hs_sanity.system_riscv64_linux_testList_1/aqa-tests/TKG/../../jvmtest/system/modularity/..//STF;/home/jenkins/workspace/Test_openjdk21_hs_sanity.system_riscv64_linux_testList_1/aqa-tests/TKG/../../jvmtest/system/modularity/..//aqa-systemtest""" -systemtest-prereqs="/home/jenkins/workspace/Test_openjdk21_hs_sanity.system_riscv64_linux_testList_1/../../testDependency/system_lib/" -java-args=' -XX:+UseCompressedOops ' -results-root="/home/jenkins/workspace/Test_openjdk21_hs_sanity.system_riscv64_linux_testList_1/aqa-tests/TKG/../TKG/output_17394180847736/PatMod_Unex_0" -test=PatModTest -test-args="variant=Unex"; \
[2025-02-13T03:51:26.872Z] if [ $? -eq 0 ]; then echo "-----------------------------------"; echo "PatMod_Unex_0""_PASSED"; echo "-----------------------------------"; cd /home/jenkins/workspace/Test_openjdk21_hs_sanity.system_riscv64_linux_testList_1/aqa-tests/TKG/..; rm -f -r "/home/jenkins/workspace/Test_openjdk21_hs_sanity.system_riscv64_linux_testList_1/aqa-tests/TKG/../TKG/output_17394180847736/PatMod_Unex_0"; else echo "-----------------------------------"; echo "PatMod_Unex_0""_FAILED"; echo "-----------------------------------"; fi; \
[2025-02-13T03:51:26.872Z] echo ""; echo "TEST TEARDOWN:"; \
[2025-02-13T03:51:26.872Z] echo "Nothing to be done for teardown."; \
[2025-02-13T03:51:26.872Z] } 2>&1 | tee -a "/home/jenkins/workspace/Test_openjdk21_hs_sanity.system_riscv64_linux_testList_1/aqa-tests/TKG/../TKG/output_17394180847736/TestTargetResult";
[2025-02-13T03:51:26.872Z]
[2025-02-13T03:51:26.872Z] TEST SETUP:
[2025-02-13T03:51:26.872Z] Nothing to be done for setup.
[2025-02-13T03:51:26.872Z]
[2025-02-13T03:51:26.872Z] TESTING:
[2025-02-13T03:51:27.198Z] STF 03:51:26.873 - ========================= S T F =========================
[2025-02-13T03:51:27.198Z] systemtest-prereqs has been processed, and set to: /home/jenkins/testDependency/system_libRetrieving amount of free space on drive containing /home/jenkins/workspace/Test_openjdk21_hs_sanity.system_riscv64_linux_testList_1/aqa-tests/TKG/../TKG/output_17394180847736/PatMod_Unex_0
[2025-02-13T03:51:27.198Z] There is 81043 Mb free
[2025-02-13T03:51:27.198Z] STF 03:51:26.894 - ================== G E N E R A T I O N ==================
[2025-02-13T03:51:27.198Z] STF 03:51:26.898 - Checking JVM: /home/jenkins/workspace/Test_openjdk21_hs_sanity.system_riscv64_linux_testList_1/jdkbinary/j2sdk-image
[2025-02-13T03:51:27.199Z] STF 03:51:26.898 - Starting process to generate scripts: /home/jenkins/workspace/Test_openjdk21_hs_sanity.system_riscv64_linux_testList_1/jdkbinary/j2sdk-image/bin/java -Dlog4j.skipJansi=true -Djava.system.class.loader=net.adoptopenjdk.stf.runner.StfClassLoader -Dload.agent.path=/home/jenkins/workspace/Test_openjdk21_hs_sanity.system_riscv64_linux_testList_1/jvmtest/system/STF/stf.core/scripts/../../stf.load/bin/stf.load.jar -classpath /home/jenkins/workspace/Test_openjdk21_hs_sanity.system_riscv64_linux_testList_1/../../testDependency/system_lib//asm/asm.jar:/home/jenkins/workspace/Test_openjdk21_hs_sanity.system_riscv64_linux_testList_1/../../testDependency/system_lib//asm/asm-commons.jar:/home/jenkins/workspace/Test_openjdk21_hs_sanity.system_riscv64_linux_testList_1/../../testDependency/system_lib//log4j/log4j-api.jar:/home/jenkins/workspace/Test_openjdk21_hs_sanity.system_riscv64_linux_testList_1/../../testDependency/system_lib//log4j/log4j-core.jar:/home/jenkins/workspace/Test_openjdk21_hs_sanity.system_riscv64_linux_testList_1/jvmtest/system/STF/stf.core/scripts/../bin net.adoptopenjdk.stf.runner.StfRunner -properties "/home/jenkins/workspace/Test_openjdk21_hs_sanity.system_riscv64_linux_testList_1/aqa-tests/TKG/../TKG/output_17394180847736/PatMod_Unex_0/20250213-035126-PatModTest/stf_parameters.properties, , /home/jenkins/workspace/Test_openjdk21_hs_sanity.system_riscv64_linux_testList_1/jvmtest/system/STF/stf.core/config/stf.properties" -testDir "/home/jenkins/workspace/Test_openjdk21_hs_sanity.system_riscv64_linux_testList_1/aqa-tests/TKG/../TKG/output_17394180847736/PatMod_Unex_0/20250213-035126-PatModTest"
[2025-02-13T03:51:27.199Z] GEN stderr Picked up JAVA_TOOL_OPTIONS: -Djava.security.manager=allow
[2025-02-13T03:51:27.199Z] GEN [0.019s][warning][cds] Archived non-system classes are disabled because the java.system.class.loader property is specified (value = "net.adoptopenjdk.stf.runner.StfClassLoader"). To use archived non-system classes, this property must not be set
[2025-02-13T03:51:31.925Z] GEN 03:51:31.490 - Found test. Project: 'openjdk.test.modularity' class: 'PatModTest.class' Dir: '/home/jenkins/workspace/Test_openjdk21_hs_sanity.system_riscv64_linux_testList_1/jvmtest/system/aqa-systemtest/openjdk.test.modularity/bin'
[2025-02-13T03:51:31.925Z] GEN 03:51:31.541 - Found test. Project: 'openjdk.test.modularity' class: 'net.adoptopenjdk.test.modularity.PatModTest'
[2025-02-13T03:51:32.252Z] GEN Classpath directories used by project 'openjdk.test.modularity':
[2025-02-13T03:51:32.252Z] GEN /home/jenkins/workspace/Test_openjdk21_hs_sanity.system_riscv64_linux_testList_1/jvmtest/system/aqa-systemtest/openjdk.test.modularity/bin/common-mods/displayService
[2025-02-13T03:51:32.252Z] GEN /home/jenkins/workspace/Test_openjdk21_hs_sanity.system_riscv64_linux_testList_1/jvmtest/system/aqa-systemtest/openjdk.test.modularity/bin/common-mods/com.helper
[2025-02-13T03:51:32.252Z] GEN /home/jenkins/workspace/Test_openjdk21_hs_sanity.system_riscv64_linux_testList_1/jvmtest/system/aqa-systemtest/openjdk.test.modularity/bin/common-mods/displayServiceImpl1
[2025-02-13T03:51:32.252Z] GEN /home/jenkins/workspace/Test_openjdk21_hs_sanity.system_riscv64_linux_testList_1/jvmtest/system/aqa-systemtest/openjdk.test.modularity/bin/common-mods/com.discreet
[2025-02-13T03:51:32.252Z] GEN /home/jenkins/workspace/Test_openjdk21_hs_sanity.system_riscv64_linux_testList_1/jvmtest/system/aqa-systemtest/openjdk.test.modularity/bin/common-mods/com.hello
[2025-02-13T03:51:32.252Z] GEN /home/jenkins/workspace/Test_openjdk21_hs_sanity.system_riscv64_linux_testList_1/jvmtest/system/aqa-systemtest/openjdk.test.modularity/bin/common-mods/com.hola
[2025-02-13T03:51:32.252Z] GEN /home/jenkins/workspace/Test_openjdk21_hs_sanity.system_riscv64_linux_testList_1/jvmtest/system/aqa-systemtest/openjdk.test.modularity/bin/common-mods/displayServiceImpl2
[2025-02-13T03:51:32.252Z] GEN /home/jenkins/workspace/Test_openjdk21_hs_sanity.system_riscv64_linux_testList_1/jvmtest/system/aqa-systemtest/openjdk.test.modularity/bin/common-mods/com.hi
[2025-02-13T03:51:32.252Z] GEN /home/jenkins/workspace/Test_openjdk21_hs_sanity.system_riscv64_linux_testList_1/jvmtest/system/aqa-systemtest/openjdk.test.modularity/bin/common-override
[2025-02-13T03:51:32.252Z] GEN /home/jenkins/workspace/Test_openjdk21_hs_sanity.system_riscv64_linux_testList_1/jvmtest/system/aqa-systemtest/openjdk.test.modularity/bin/common-override-new
[2025-02-13T03:51:32.252Z] GEN /home/jenkins/workspace/Test_openjdk21_hs_sanity.system_riscv64_linux_testList_1/jvmtest/system/aqa-systemtest/openjdk.test.modularity/bin/common/displayServiceImpl3
[2025-02-13T03:51:32.252Z] GEN /home/jenkins/workspace/Test_openjdk21_hs_sanity.system_riscv64_linux_testList_1/jvmtest/system/aqa-systemtest/openjdk.test.modularity/bin/common/displayServiceImpl4
[2025-02-13T03:51:32.252Z] GEN /home/jenkins/workspace/Test_openjdk21_hs_sanity.system_riscv64_linux_testList_1/jvmtest/system/aqa-systemtest/openjdk.test.modularity/bin/common
[2025-02-13T03:51:32.252Z] GEN /home/jenkins/workspace/Test_openjdk21_hs_sanity.system_riscv64_linux_testList_1/jvmtest/system/aqa-systemtest/openjdk.test.modularity/bin/tests
[2025-02-13T03:51:32.252Z] GEN /home/jenkins/workspace/Test_openjdk21_hs_sanity.system_riscv64_linux_testList_1/jvmtest/system/aqa-systemtest/openjdk.test.modularity/bin
[2025-02-13T03:51:32.252Z] GEN /home/jenkins/workspace/Test_openjdk21_hs_sanity.system_riscv64_linux_testList_1/jvmtest/system/STF/stf.core/bin
[2025-02-13T03:51:32.252Z] GEN /home/jenkins/testDependency/system_lib/log4j/log4j-api.jar
[2025-02-13T03:51:32.252Z] GEN /home/jenkins/testDependency/system_lib/log4j/log4j-core.jar
[2025-02-13T03:51:32.252Z] GEN /home/jenkins/testDependency/system_lib/junit/junit.jar
[2025-02-13T03:51:32.580Z] GEN 03:51:32.215 - Using Mode NoOptions. Values = ''
[2025-02-13T03:51:32.905Z] GEN 03:51:32.608 -
[2025-02-13T03:51:32.905Z] GEN 03:51:32.609 - Test command summary:
[2025-02-13T03:51:32.905Z] GEN 03:51:32.610 - Step Stage Command Description
[2025-02-13T03:51:32.905Z] GEN 03:51:32.611 - -----+--------+-----------------+------------
[2025-02-13T03:51:32.905Z] GEN 03:51:32.613 - 1 execute jar Create com.hello jar
[2025-02-13T03:51:32.905Z] GEN 03:51:32.613 - 2 execute jar Create com.discreet jar
[2025-02-13T03:51:32.905Z] GEN 03:51:32.614 - 3 execute jar create java.xml.jar
[2025-02-13T03:51:32.905Z] GEN 03:51:32.615 - 4 execute Run java (Negative test) Include a new package that is not exported and ensure the public type cannot be accessed
[2025-02-13T03:51:32.905Z] GEN 03:51:32.615 - 5 execute count Check output
[2025-02-13T03:51:32.905Z] GEN 03:51:32.616 - 6 execute Run java Include a new package that is not exported and check if the public type can be accessed by adding --add-exports
[2025-02-13T03:51:32.905Z] STF 03:51:32.722 -
[2025-02-13T03:51:32.905Z] STF 03:51:32.723 - Script generation completed
[2025-02-13T03:51:32.905Z] STF 03:51:32.723 -
[2025-02-13T03:51:32.905Z] STF 03:51:32.727 -
[2025-02-13T03:51:32.905Z] STF 03:51:32.728 - ======================= S E T U P =======================
[2025-02-13T03:51:32.905Z] STF 03:51:32.728 - Running setup: perl /home/jenkins/workspace/Test_openjdk21_hs_sanity.system_riscv64_linux_testList_1/aqa-tests/TKG/../TKG/output_17394180847736/PatMod_Unex_0/20250213-035126-PatModTest/setUp.pl
[2025-02-13T03:51:33.228Z] STF 03:51:32.961 - SETUP stage completed
[2025-02-13T03:51:33.228Z] STF 03:51:32.974 -
[2025-02-13T03:51:33.228Z] STF 03:51:32.974 - ==================== E X E C U T E - ====================
[2025-02-13T03:51:33.229Z] STF 03:51:32.974 - Running execute: perl /home/jenkins/workspace/Test_openjdk21_hs_sanity.system_riscv64_linux_testList_1/aqa-tests/TKG/../TKG/output_17394180847736/PatMod_Unex_0/20250213-035126-PatModTest/execute.pl
[2025-02-13T03:51:33.229Z] STF 03:51:33.209 -
[2025-02-13T03:51:33.229Z] STF 03:51:33.209 - Java version
[2025-02-13T03:51:33.229Z] STF 03:51:33.210 - Running: /home/jenkins/workspace/Test_openjdk21_hs_sanity.system_riscv64_linux_testList_1/jdkbinary/j2sdk-image/bin/java -version
[2025-02-13T03:51:33.561Z] Picked up JAVA_TOOL_OPTIONS: -Djava.security.manager=allow
[2025-02-13T03:51:33.561Z] openjdk version "21.0.7-beta" 2025-04-15
[2025-02-13T03:51:33.561Z] OpenJDK Runtime Environment Temurin-21.0.7+2-202502122027 (build 21.0.7-beta+2-ea)
[2025-02-13T03:51:33.562Z] OpenJDK 64-Bit Server VM Temurin-21.0.7+2-202502122027 (build 21.0.7-beta+2-ea, mixed mode, sharing)
[2025-02-13T03:51:33.562Z] STF 03:51:33.432 -
[2025-02-13T03:51:33.562Z] STF 03:51:33.432 - +------ Step 1 - Create com.hello jar
[2025-02-13T03:51:33.562Z] STF 03:51:33.432 - | Create modular jar
[2025-02-13T03:51:33.562Z] STF 03:51:33.432 - | ModuleSpec: openjdk.test.modularity/bin/common-override/com.hello
[2025-02-13T03:51:33.562Z] STF 03:51:33.432 - | ModuleVersion: null
[2025-02-13T03:51:33.562Z] STF 03:51:33.432 - | MainClass: null
[2025-02-13T03:51:33.562Z] STF 03:51:33.433 - | HashModules: null
[2025-02-13T03:51:33.562Z] STF 03:51:33.433 - |
[2025-02-13T03:51:33.562Z] STF 03:51:33.434 - Running command: /home/jenkins/workspace/Test_openjdk21_hs_sanity.system_riscv64_linux_testList_1/jdkbinary/j2sdk-image/bin/jar --create --file /home/jenkins/workspace/Test_openjdk21_hs_sanity.system_riscv64_linux_testList_1/aqa-tests/TKG/output_17394180847736/PatMod_Unex_0/20250213-035126-PatModTest/modules/1.com.hello.jar -C /home/jenkins/workspace/Test_openjdk21_hs_sanity.system_riscv64_linux_testList_1/jvmtest/system/aqa-systemtest/openjdk.test.modularity/bin/common-override/com.hello .
[2025-02-13T03:51:33.562Z] STF 03:51:33.434 - Redirecting stderr to /home/jenkins/workspace/Test_openjdk21_hs_sanity.system_riscv64_linux_testList_1/aqa-tests/TKG/output_17394180847736/PatMod_Unex_0/20250213-035126-PatModTest/results/1.CMJ.stderr
[2025-02-13T03:51:33.562Z] STF 03:51:33.434 - Redirecting stdout to /home/jenkins/workspace/Test_openjdk21_hs_sanity.system_riscv64_linux_testList_1/aqa-tests/TKG/output_17394180847736/PatMod_Unex_0/20250213-035126-PatModTest/results/1.CMJ.stdout
[2025-02-13T03:51:33.562Z] STF 03:51:33.478 - Monitoring processes: CMJ
[2025-02-13T03:51:33.562Z] CMJ stderr Picked up JAVA_TOOL_OPTIONS: -Djava.security.manager=allow
[2025-02-13T03:51:35.224Z] STF 03:51:34.826 - Monitoring Report Summary:
[2025-02-13T03:51:35.224Z] STF 03:51:34.826 - o Process CMJ ended with the expected exit code (0)
[2025-02-13T03:51:35.224Z] STF 03:51:34.827 - Created modular jar: 1.com.hello.jar
[2025-02-13T03:51:35.224Z] STF 03:51:34.827 -
[2025-02-13T03:51:35.224Z] STF 03:51:34.827 - +------ Step 2 - Create com.discreet jar
[2025-02-13T03:51:35.224Z] STF 03:51:34.827 - | Create modular jar
[2025-02-13T03:51:35.224Z] STF 03:51:34.827 - | ModuleSpec: openjdk.test.modularity/bin/common-override/com.discreet
[2025-02-13T03:51:35.224Z] STF 03:51:34.827 - | ModuleVersion: null
[2025-02-13T03:51:35.224Z] STF 03:51:34.827 - | MainClass: null
[2025-02-13T03:51:35.224Z] STF 03:51:34.827 - | HashModules: null
[2025-02-13T03:51:35.224Z] STF 03:51:34.827 - |
[2025-02-13T03:51:35.224Z] STF 03:51:34.828 - Running command: /home/jenkins/workspace/Test_openjdk21_hs_sanity.system_riscv64_linux_testList_1/jdkbinary/j2sdk-image/bin/jar --create --file /home/jenkins/workspace/Test_openjdk21_hs_sanity.system_riscv64_linux_testList_1/aqa-tests/TKG/output_17394180847736/PatMod_Unex_0/20250213-035126-PatModTest/modules/2.com.discreet.jar -C /home/jenkins/workspace/Test_openjdk21_hs_sanity.system_riscv64_linux_testList_1/jvmtest/system/aqa-systemtest/openjdk.test.modularity/bin/common-override/com.discreet .
[2025-02-13T03:51:35.224Z] STF 03:51:34.828 - Redirecting stderr to /home/jenkins/workspace/Test_openjdk21_hs_sanity.system_riscv64_linux_testList_1/aqa-tests/TKG/output_17394180847736/PatMod_Unex_0/20250213-035126-PatModTest/results/2.CMJ.stderr
[2025-02-13T03:51:35.224Z] STF 03:51:34.828 - Redirecting stdout to /home/jenkins/workspace/Test_openjdk21_hs_sanity.system_riscv64_linux_testList_1/aqa-tests/TKG/output_17394180847736/PatMod_Unex_0/20250213-035126-PatModTest/results/2.CMJ.stdout
[2025-02-13T03:51:35.224Z] STF 03:51:34.833 - Monitoring processes: CMJ
[2025-02-13T03:51:35.224Z] CMJ stderr Picked up JAVA_TOOL_OPTIONS: -Djava.security.manager=allow
[2025-02-13T03:51:36.372Z] STF 03:51:36.161 - Monitoring Report Summary:
[2025-02-13T03:51:36.372Z] STF 03:51:36.161 - o Process CMJ ended with the expected exit code (0)
[2025-02-13T03:51:36.372Z] STF 03:51:36.163 - Created modular jar: 2.com.discreet.jar
[2025-02-13T03:51:36.372Z] STF 03:51:36.164 -
[2025-02-13T03:51:36.372Z] STF 03:51:36.164 - +------ Step 3 - create java.xml.jar
[2025-02-13T03:51:36.372Z] STF 03:51:36.164 - | Create modular jar
[2025-02-13T03:51:36.372Z] STF 03:51:36.165 - | ModuleSpec: openjdk.test.modularity/bin/common-override/java.xml
[2025-02-13T03:51:36.372Z] STF 03:51:36.165 - | ModuleVersion: null
[2025-02-13T03:51:36.372Z] STF 03:51:36.165 - | MainClass: null
[2025-02-13T03:51:36.372Z] STF 03:51:36.165 - | HashModules: null
[2025-02-13T03:51:36.372Z] STF 03:51:36.165 - |
[2025-02-13T03:51:36.372Z] STF 03:51:36.166 - Running command: /home/jenkins/workspace/Test_openjdk21_hs_sanity.system_riscv64_linux_testList_1/jdkbinary/j2sdk-image/bin/jar --create --file /home/jenkins/workspace/Test_openjdk21_hs_sanity.system_riscv64_linux_testList_1/aqa-tests/TKG/output_17394180847736/PatMod_Unex_0/20250213-035126-PatModTest/modules/3.java.xml.jar -C /home/jenkins/workspace/Test_openjdk21_hs_sanity.system_riscv64_linux_testList_1/jvmtest/system/aqa-systemtest/openjdk.test.modularity/bin/common-override/java.xml .
[2025-02-13T03:51:36.372Z] STF 03:51:36.167 - Redirecting stderr to /home/jenkins/workspace/Test_openjdk21_hs_sanity.system_riscv64_linux_testList_1/aqa-tests/TKG/output_17394180847736/PatMod_Unex_0/20250213-035126-PatModTest/results/3.CMJ.stderr
[2025-02-13T03:51:36.372Z] STF 03:51:36.167 - Redirecting stdout to /home/jenkins/workspace/Test_openjdk21_hs_sanity.system_riscv64_linux_testList_1/aqa-tests/TKG/output_17394180847736/PatMod_Unex_0/20250213-035126-PatModTest/results/3.CMJ.stdout
[2025-02-13T03:51:36.372Z] STF 03:51:36.175 - Monitoring processes: CMJ
[2025-02-13T03:51:36.372Z] CMJ stderr Picked up JAVA_TOOL_OPTIONS: -Djava.security.manager=allow
[2025-02-13T03:51:37.524Z] STF 03:51:37.464 - Monitoring Report Summary:
[2025-02-13T03:51:37.524Z] STF 03:51:37.464 - o Process CMJ ended with the expected exit code (0)
[2025-02-13T03:51:37.524Z] STF 03:51:37.465 - Created modular jar: 3.java.xml.jar
[2025-02-13T03:51:37.524Z] STF 03:51:37.465 -
[2025-02-13T03:51:37.524Z] STF 03:51:37.465 - +------ Step 4 - (Negative test) Include a new package that is not exported and ensure the public type cannot be accessed
[2025-02-13T03:51:37.524Z] STF 03:51:37.465 - | Run foreground process
[2025-02-13T03:51:37.524Z] STF 03:51:37.465 - | Program: /home/jenkins/workspace/Test_openjdk21_hs_sanity.system_riscv64_linux_testList_1/jdkbinary/j2sdk-image/bin/java
[2025-02-13T03:51:37.524Z] STF 03:51:37.465 - | Mnemonic: OT3
[2025-02-13T03:51:37.524Z] STF 03:51:37.465 - | Echo: ECHO_ON
[2025-02-13T03:51:37.524Z] STF 03:51:37.465 - | Expectation: NON_ZERO_EXIT [1] within 1m
[2025-02-13T03:51:37.524Z] STF 03:51:37.465 - |
[2025-02-13T03:51:37.524Z] STF 03:51:37.467 - Running command: /home/jenkins/workspace/Test_openjdk21_hs_sanity.system_riscv64_linux_testList_1/jdkbinary/j2sdk-image/bin/java --add-reads com.test=ALL-UNNAMED --module-path /home/jenkins/workspace/Test_openjdk21_hs_sanity.system_riscv64_linux_testList_1/jvmtest/system/aqa-systemtest/openjdk.test.modularity/bin/common-mods:/home/jenkins/workspace/Test_openjdk21_hs_sanity.system_riscv64_linux_testList_1/jvmtest/system/aqa-systemtest/openjdk.test.modularity/bin/tests --add-modules=com.test --patch-module com.hello=/home/jenkins/workspace/Test_openjdk21_hs_sanity.system_riscv64_linux_testList_1/aqa-tests/TKG/output_17394180847736/PatMod_Unex_0/20250213-035126-PatModTest/modules/1.com.hello.jar -XX:+UseCompressedOops -classpath /home/jenkins/testDependency/system_lib/junit/junit.jar:/home/jenkins/testDependency/system_lib/junit/hamcrest-core.jar org.junit.runner.JUnitCore net.adoptopenjdk.test.modularity.junit.TestOverrideUsingAppModuleAndNewPackage
[2025-02-13T03:51:37.524Z] STF 03:51:37.467 - Redirecting stderr to /home/jenkins/workspace/Test_openjdk21_hs_sanity.system_riscv64_linux_testList_1/aqa-tests/TKG/output_17394180847736/PatMod_Unex_0/20250213-035126-PatModTest/results/4.OT3.stderr
[2025-02-13T03:51:37.525Z] STF 03:51:37.467 - Redirecting stdout to /home/jenkins/workspace/Test_openjdk21_hs_sanity.system_riscv64_linux_testList_1/aqa-tests/TKG/output_17394180847736/PatMod_Unex_0/20250213-035126-PatModTest/results/4.OT3.stdout
[2025-02-13T03:51:37.525Z] STF 03:51:37.472 - Monitoring processes: OT3
[2025-02-13T03:51:37.525Z] OT3 stderr Picked up JAVA_TOOL_OPTIONS: -Djava.security.manager=allow
[2025-02-13T03:51:38.678Z] OT3 stderr WARNING: module-info.class ignored in patch: /home/jenkins/workspace/Test_openjdk21_hs_sanity.system_riscv64_linux_testList_1/aqa-tests/TKG/output_17394180847736/PatMod_Unex_0/20250213-035126-PatModTest/modules/1.com.hello.jar
[2025-02-13T03:51:38.678Z] OT3 JUnit version 4.12
[2025-02-13T03:51:39.393Z] OT3 .E
[2025-02-13T03:51:39.719Z] OT3 Time: 0.057
[2025-02-13T03:51:39.719Z] OT3 There was 1 failure:
[2025-02-13T03:51:39.719Z] OT3 1) testOverrideUsingAppModuleAndNewPackage(net.adoptopenjdk.test.modularity.junit.TestOverrideUsingAppModuleAndNewPackage)
[2025-02-13T03:51:39.719Z] OT3 java.lang.IllegalAccessException: class net.adoptopenjdk.test.modularity.junit.TestOverrideUsingAppModuleAndNewPackage (in module com.test) cannot access class adoptopenjdk.test.modularity.hellonew.HelloNew (in module com.hello) because module com.hello does not export adoptopenjdk.test.modularity.hellonew to module com.test
[2025-02-13T03:51:39.719Z] OT3 at java.base/jdk.internal.reflect.Reflection.newIllegalAccessException(Reflection.java:394)
[2025-02-13T03:51:39.719Z] OT3 at java.base/java.lang.reflect.AccessibleObject.checkAccess(AccessibleObject.java:714)
[2025-02-13T03:51:39.719Z] OT3 at java.base/java.lang.reflect.Constructor.newInstanceWithCaller(Constructor.java:495)
[2025-02-13T03:51:39.719Z] OT3 at java.base/java.lang.reflect.Constructor.newInstance(Constructor.java:486)
[2025-02-13T03:51:39.719Z] OT3 at com.test/net.adoptopenjdk.test.modularity.junit.TestOverrideUsingAppModuleAndNewPackage.testOverrideUsingAppModuleAndNewPackage(TestOverrideUsingAppModuleAndNewPackage.java:31)
[2025-02-13T03:51:39.719Z] OT3 at java.base/jdk.internal.reflect.DirectMethodHandleAccessor.invoke(DirectMethodHandleAccessor.java:103)
[2025-02-13T03:51:39.719Z] OT3 at java.base/java.lang.reflect.Method.invoke(Method.java:580)
[2025-02-13T03:51:39.719Z] OT3 at org.junit.runners.model.FrameworkMethod$1.runReflectiveCall(FrameworkMethod.java:50)
[2025-02-13T03:51:39.719Z] OT3 at org.junit.internal.runners.model.ReflectiveCallable.run(ReflectiveCallable.java:12)
[2025-02-13T03:51:39.719Z] OT3 at org.junit.runners.model.FrameworkMethod.invokeExplosively(FrameworkMethod.java:47)
[2025-02-13T03:51:39.719Z] OT3 at org.junit.internal.runners.statements.InvokeMethod.evaluate(InvokeMethod.java:17)
[2025-02-13T03:51:39.719Z] OT3 at org.junit.runners.ParentRunner.runLeaf(ParentRunner.java:325)
[2025-02-13T03:51:39.719Z] OT3 at org.junit.runners.BlockJUnit4ClassRunner.runChild(BlockJUnit4ClassRunner.java:78)
[2025-02-13T03:51:39.719Z] OT3 at org.junit.runners.BlockJUnit4ClassRunner.runChild(BlockJUnit4ClassRunner.java:57)
[2025-02-13T03:51:39.719Z] OT3 at org.junit.runners.ParentRunner$3.run(ParentRunner.java:290)
[2025-02-13T03:51:39.719Z] OT3 at org.junit.runners.ParentRunner$1.schedule(ParentRunner.java:71)
[2025-02-13T03:51:39.719Z] OT3 at org.junit.runners.ParentRunner.runChildren(ParentRunner.java:288)
[2025-02-13T03:51:39.719Z] OT3 at org.junit.runners.ParentRunner.access$000(ParentRunner.java:58)
[2025-02-13T03:51:39.719Z] OT3 at org.junit.runners.ParentRunner$2.evaluate(ParentRunner.java:268)
[2025-02-13T03:51:39.719Z] OT3 at org.junit.runners.ParentRunner.run(ParentRunner.java:363)
[2025-02-13T03:51:39.719Z] OT3 at org.junit.runners.Suite.runChild(Suite.java:128)
[2025-02-13T03:51:39.719Z] OT3 at org.junit.runners.Suite.runChild(Suite.java:27)
[2025-02-13T03:51:39.719Z] OT3 at org.junit.runners.ParentRunner$3.run(ParentRunner.java:290)
[2025-02-13T03:51:39.719Z] OT3 at org.junit.runners.ParentRunner$1.schedule(ParentRunner.java:71)
[2025-02-13T03:51:39.719Z] OT3 at org.junit.runners.ParentRunner.runChildren(ParentRunner.java:288)
[2025-02-13T03:51:39.719Z] OT3 at org.junit.runners.ParentRunner.access$000(ParentRunner.java:58)
[2025-02-13T03:51:39.719Z] OT3 at org.junit.runners.ParentRunner$2.evaluate(ParentRunner.java:268)
[2025-02-13T03:51:39.719Z] OT3 at org.junit.runners.ParentRunner.run(ParentRunner.java:363)
[2025-02-13T03:51:39.719Z] OT3 at org.junit.runner.JUnitCore.run(JUnitCore.java:137)
[2025-02-13T03:51:39.719Z] OT3 at org.junit.runner.JUnitCore.run(JUnitCore.java:115)
[2025-02-13T03:51:39.719Z] OT3 at org.junit.runner.JUnitCore.runMain(JUnitCore.java:77)
[2025-02-13T03:51:39.719Z] OT3 at org.junit.runner.JUnitCore.main(JUnitCore.java:36)
[2025-02-13T03:51:39.719Z] OT3
[2025-02-13T03:51:39.719Z] OT3 FAILURES!!!
[2025-02-13T03:51:39.719Z] OT3 Tests run: 1, Failures: 1
[2025-02-13T03:51:39.719Z] OT3
[2025-02-13T03:51:39.719Z] STF 03:51:39.454 - Monitoring Report Summary:
[2025-02-13T03:51:39.719Z] STF 03:51:39.455 - o Process OT3 ended with the expected exit code (1)
[2025-02-13T03:51:39.719Z] STF 03:51:39.458 -
[2025-02-13T03:51:39.719Z] STF 03:51:39.459 - +------ Step 5 - Check output
[2025-02-13T03:51:39.719Z] STF 03:51:39.459 - | Count file matches
[2025-02-13T03:51:39.719Z] STF 03:51:39.459 - | TargetFile: /home/jenkins/workspace/Test_openjdk21_hs_sanity.system_riscv64_linux_testList_1/aqa-tests/TKG/output_17394180847736/PatMod_Unex_0/20250213-035126-PatModTest/results/4.OT3.stdout
[2025-02-13T03:51:39.719Z] STF 03:51:39.459 - | ExpectedNumMatches: 1
[2025-02-13T03:51:39.719Z] STF 03:51:39.460 - | SearchStrings: ["java.lang.IllegalAccessException"]
[2025-02-13T03:51:39.719Z] STF 03:51:39.460 - |
[2025-02-13T03:51:39.719Z] STF 03:51:39.460 - Found 1 instances of ["java.lang.IllegalAccessException"]
[2025-02-13T03:51:39.719Z] STF 03:51:39.460 -
[2025-02-13T03:51:39.719Z] STF 03:51:39.461 - +------ Step 6 - Include a new package that is not exported and check if the public type can be accessed by adding --add-exports
[2025-02-13T03:51:39.719Z] STF 03:51:39.461 - | Run foreground process
[2025-02-13T03:51:39.719Z] STF 03:51:39.461 - | Program: /home/jenkins/workspace/Test_openjdk21_hs_sanity.system_riscv64_linux_testList_1/jdkbinary/j2sdk-image/bin/java
[2025-02-13T03:51:39.719Z] STF 03:51:39.461 - | Mnemonic: OT4
[2025-02-13T03:51:39.719Z] STF 03:51:39.461 - | Echo: ECHO_ON
[2025-02-13T03:51:39.719Z] STF 03:51:39.461 - | Expectation: CLEAN_RUN within 1m
[2025-02-13T03:51:39.719Z] STF 03:51:39.461 - |
[2025-02-13T03:51:39.719Z] STF 03:51:39.462 - Running command: /home/jenkins/workspace/Test_openjdk21_hs_sanity.system_riscv64_linux_testList_1/jdkbinary/j2sdk-image/bin/java --add-reads com.test=ALL-UNNAMED --module-path /home/jenkins/workspace/Test_openjdk21_hs_sanity.system_riscv64_linux_testList_1/jvmtest/system/aqa-systemtest/openjdk.test.modularity/bin/common-mods:/home/jenkins/workspace/Test_openjdk21_hs_sanity.system_riscv64_linux_testList_1/jvmtest/system/aqa-systemtest/openjdk.test.modularity/bin/tests --add-modules=com.test --add-exports com.hello/adoptopenjdk.test.modularity.hellonew=com.test --patch-module com.hello=/home/jenkins/workspace/Test_openjdk21_hs_sanity.system_riscv64_linux_testList_1/aqa-tests/TKG/output_17394180847736/PatMod_Unex_0/20250213-035126-PatModTest/modules/1.com.hello.jar -XX:+UseCompressedOops -classpath /home/jenkins/testDependency/system_lib/junit/junit.jar:/home/jenkins/testDependency/system_lib/junit/hamcrest-core.jar org.junit.runner.JUnitCore net.adoptopenjdk.test.modularity.junit.TestOverrideUsingAppModuleAndNewPackage
[2025-02-13T03:51:39.719Z] STF 03:51:39.462 - Redirecting stderr to /home/jenkins/workspace/Test_openjdk21_hs_sanity.system_riscv64_linux_testList_1/aqa-tests/TKG/output_17394180847736/PatMod_Unex_0/20250213-035126-PatModTest/results/6.OT4.stderr
[2025-02-13T03:51:39.719Z] STF 03:51:39.462 - Redirecting stdout to /home/jenkins/workspace/Test_openjdk21_hs_sanity.system_riscv64_linux_testList_1/aqa-tests/TKG/output_17394180847736/PatMod_Unex_0/20250213-035126-PatModTest/results/6.OT4.stdout
[2025-02-13T03:51:39.719Z] STF 03:51:39.469 - Monitoring processes: OT4
[2025-02-13T03:51:39.719Z] OT4 stderr Picked up JAVA_TOOL_OPTIONS: -Djava.security.manager=allow
[2025-02-13T03:51:40.423Z] OT4 stderr WARNING: module-info.class ignored in patch: /home/jenkins/workspace/Test_openjdk21_hs_sanity.system_riscv64_linux_testList_1/aqa-tests/TKG/output_17394180847736/PatMod_Unex_0/20250213-035126-PatModTest/modules/1.com.hello.jar
[2025-02-13T03:51:40.749Z] OT4 JUnit version 4.12
[2025-02-13T03:51:41.459Z] OT4 .
[2025-02-13T03:51:41.459Z] OT4 Time: 0.034
[2025-02-13T03:51:41.459Z] OT4
[2025-02-13T03:51:41.459Z] OT4 OK (1 test)
[2025-02-13T03:51:41.459Z] OT4
[2025-02-13T03:51:41.459Z] STF 03:51:41.321 - Monitoring Report Summary:
[2025-02-13T03:51:41.459Z] STF 03:51:41.322 - o Process OT4 ended with the expected exit code (0)
[2025-02-13T03:51:41.459Z] STF 03:51:41.326 - EXECUTE stage completed
[2025-02-13T03:51:41.459Z] STF 03:51:41.425 -
[2025-02-13T03:51:41.459Z] STF 03:51:41.425 - ==================== T E A R D O W N ====================
[2025-02-13T03:51:41.459Z] STF 03:51:41.425 - Running teardown: perl /home/jenkins/workspace/Test_openjdk21_hs_sanity.system_riscv64_linux_testList_1/aqa-tests/TKG/../TKG/output_17394180847736/PatMod_Unex_0/20250213-035126-PatModTest/tearDown.pl
[2025-02-13T03:51:41.786Z] STF 03:51:41.655 - TEARDOWN stage completed
[2025-02-13T03:51:41.786Z] STF 03:51:41.664 -
[2025-02-13T03:51:41.786Z] STF 03:51:41.665 - ===================== R E S U L T S =====================
[2025-02-13T03:51:41.786Z] STF 03:51:41.665 - Stage results:
[2025-02-13T03:51:41.786Z] STF 03:51:41.665 - setUp: pass
[2025-02-13T03:51:41.786Z] STF 03:51:41.665 - execute: pass
[2025-02-13T03:51:41.786Z] STF 03:51:41.665 - teardown: pass
[2025-02-13T03:51:41.786Z] STF 03:51:41.665 -
[2025-02-13T03:51:41.786Z] STF 03:51:41.665 - Overall result: PASSED
[2025-02-13T03:51:41.786Z] -----------------------------------
[2025-02-13T03:51:41.786Z] PatMod_Unex_0_PASSED
[2025-02-13T03:51:41.786Z] -----------------------------------
[2025-02-13T03:51:41.786Z]
[2025-02-13T03:51:41.786Z] TEST TEARDOWN:
[2025-02-13T03:51:41.786Z] Nothing to be done for teardown.
[2025-02-13T03:51:41.786Z] PatMod_Unex_0 Finish Time: Thu Feb 13 03:51:41 2025 Epoch Time (ms): 1739418701728