Post Test
[2025-01-06T01:12:01.000Z] make[3]: Leaving directory '/cygdrive/c/jenkins/workspace/Test_openjdk25_hs_special.openjdk_x86-64_windows/aqa-tests/openjdk'
[2025-01-06T01:12:01.000Z] make[2]: Leaving directory '/cygdrive/c/jenkins/workspace/Test_openjdk25_hs_special.openjdk_x86-64_windows/aqa-tests'
[2025-01-06T01:12:01.000Z]
[2025-01-06T01:12:01.000Z]
[2025-01-06T01:12:01.000Z] All tests finished, run result summary:
[2025-01-06T01:12:01.000Z] cd "C:/jenkins/workspace/Test_openjdk25_hs_special.openjdk_x86-64_windows/aqa-tests/\\TKG\\scripts"; \
[2025-01-06T01:12:01.000Z] perl "resultsSum.pl" --failuremk="C:/jenkins/workspace/Test_openjdk25_hs_special.openjdk_x86-64_windows/aqa-tests/\\TKG\\failedtargets.mk" --resultFile="C:/jenkins/workspace/Test_openjdk25_hs_special.openjdk_x86-64_windows/aqa-tests/\\TKG\\output_17361254242097\\TestTargetResult" --platFile="C:/jenkins/workspace/Test_openjdk25_hs_special.openjdk_x86-64_windows/aqa-tests/\\TKG\\resources\\buildPlatformMap.properties" --diagnostic=failure --jdkVersion=25 --jdkImpl=hotspot --jdkVendor="eclipse" --spec=win_x86-64 --buildList=openjdk --customTarget="" --testTarget=special.openjdk --tapPath=C:/jenkins/workspace/Test_openjdk25_hs_special.openjdk_x86-64_windows/aqa-tests/\\TKG\\output_17361254242097\\ --tapName=Test_openjdk25_hs_special.openjdk_x86-64_windows.tap --comment=""
[2025-01-06T01:12:01.000Z]
[2025-01-06T01:12:01.000Z]
[2025-01-06T01:12:01.000Z] TEST TARGETS SUMMARY
[2025-01-06T01:12:01.000Z] ++++++++++++++++++++++++++++++++++++++++++++++++++++++++++++++++++++++++++
[2025-01-06T01:12:01.000Z] PASSED test targets:
[2025-01-06T01:12:01.000Z] jdk_custom_0 - Test results: passed: 1
[2025-01-06T01:12:01.000Z] langtools_custom_0 - Test results: passed: 1
[2025-01-06T01:12:01.000Z] langtools_custom_1 - Test results: passed: 1
[2025-01-06T01:12:01.000Z]
[2025-01-06T01:12:01.000Z] FAILED test targets:
[2025-01-06T01:12:01.000Z] hotspot_custom_0
[2025-01-06T01:12:01.000Z] hotspot_custom_1
[2025-01-06T01:12:01.000Z]
[2025-01-06T01:12:01.000Z] TOTAL: 7 EXECUTED: 5 PASSED: 3 FAILED: 2 DISABLED: 0 SKIPPED: 2
[2025-01-06T01:12:01.000Z] ++++++++++++++++++++++++++++++++++++++++++++++++++++++++++++++++++++++++++
[2025-01-06T01:12:01.000Z]
[2025-01-06T01:12:01.000Z] TESTCASES RESULTS SUMMARY: passed: 3; failed: 0; error: 0; skipped: 0
[2025-01-06T01:12:01.000Z] ++++++++++++++++++++++++++++++++++++++++++++++++++++++++++++++++++++++++++
[2025-01-06T01:12:01.333Z] make[1]: *** [settings.mk:450: resultsSummary] Error 2
[2025-01-06T01:12:01.333Z] make[1]: Leaving directory '/cygdrive/c/jenkins/workspace/Test_openjdk25_hs_special.openjdk_x86-64_windows/aqa-tests/TKG'
[2025-01-06T01:12:01.333Z] make: *** [makefile:70: _special.openjdk] Error 2
[Pipeline] sh
[2025-01-06T01:12:01.875Z] ++ uname
[2025-01-06T01:12:01.876Z] + '[' CYGWIN_NT-10.0-20348 = AIX ']'
[2025-01-06T01:12:01.876Z] ++ uname
[2025-01-06T01:12:01.876Z] + '[' CYGWIN_NT-10.0-20348 = SunOS ']'
[2025-01-06T01:12:01.876Z] ++ uname
[2025-01-06T01:12:01.876Z] + '[' CYGWIN_NT-10.0-20348 = '*BSD' ']'
[2025-01-06T01:12:01.876Z] + MAKE=make
[2025-01-06T01:12:01.876Z] + make -f ./aqa-tests/TKG/testEnv.mk testEnvTeardown
[2025-01-06T01:12:01.876Z] make: Nothing to be done for 'testEnvTeardown'.
[Pipeline] echo
[2025-01-06T01:12:01.975Z] There were test failures, set build result to UNSTABLE.
[Pipeline] }
[Pipeline] // stage
[Pipeline] stage
[Pipeline] { (Post)
[Pipeline] step
[2025-01-06T01:12:02.108Z] TAP Reports Processing: START
[2025-01-06T01:12:02.109Z] Looking for TAP results report in workspace using pattern: aqa-tests/TKG/**/*.tap
[2025-01-06T01:12:02.185Z] Saving reports...
[2025-01-06T01:12:02.236Z] Processing '/home/jenkins/.jenkins/jobs/Test_openjdk25_hs_special.openjdk_x86-64_windows/builds/1/tap-master-files/aqa-tests/TKG/output_17361254242097/Test_openjdk25_hs_special.openjdk_x86-64_windows.tap'
[2025-01-06T01:12:02.236Z] Parsing TAP test result [/home/jenkins/.jenkins/jobs/Test_openjdk25_hs_special.openjdk_x86-64_windows/builds/1/tap-master-files/aqa-tests/TKG/output_17361254242097/Test_openjdk25_hs_special.openjdk_x86-64_windows.tap].
[2025-01-06T01:12:02.240Z] There are failed test cases. Marking build as UNSTABLE
[2025-01-06T01:12:02.240Z] TAP Reports Processing: FINISH
[Pipeline] echo
[2025-01-06T01:12:02.266Z] Saving aqa-tests/testenv/testenv.properties file on jenkins.
[Pipeline] archiveArtifacts
[2025-01-06T01:12:02.308Z] Archiving artifacts
[2025-01-06T01:12:02.358Z] Recording fingerprints
[Pipeline] echo
[2025-01-06T01:12:02.425Z] Saving aqa-tests/TKG/**/*.tap file on jenkins.
[Pipeline] archiveArtifacts
[2025-01-06T01:12:02.456Z] Archiving artifacts
[2025-01-06T01:12:02.573Z] Recording fingerprints
[Pipeline] sh
[2025-01-06T01:12:03.130Z] + tar -cf - ./aqa-tests/TKG/output_17361254242097
[2025-01-06T01:12:03.130Z] + pigz -9
[2025-01-06T01:12:03.130Z] + gzip -9
[Pipeline] echo
[2025-01-06T01:12:04.862Z] ARTIFACTORY_SERVER is not set. Saving artifacts on jenkins.
[Pipeline] archiveArtifacts
[2025-01-06T01:12:04.891Z] Archiving artifacts
[2025-01-06T01:12:04.943Z] Recording fingerprints
[Pipeline] findFiles
[Pipeline] echo
[2025-01-06T01:12:09.469Z] Tap file found: aqa-tests\TKG\output_17361254242097\Test_openjdk25_hs_special.openjdk_x86-64_windows.tap...
[Pipeline] readFile
[Pipeline] echo
[2025-01-06T01:12:09.573Z] Rerun in Grinder with failed test targets: https://ci.adoptium.net/job/Grinder/parambuild/?SDK_RESOURCE=upstream&TARGET=testList+TESTLIST=hotspot_custom_0,hotspot_custom_1&BASE_DOCKER_REGISTRY_CREDENTIAL_ID=&TEST_FLAG=&UPSTREAM_TEST_JOB_NAME=&DOCKER_REQUIRED=false&ACTIVE_NODE_TIMEOUT=5&VENDOR_TEST_DIRS=&EXTRA_DOCKER_ARGS=&TKG_OWNER_BRANCH=adoptium%3Amaster&OPENJ9_SYSTEMTEST_OWNER_BRANCH=eclipse%3Amaster&PLATFORM=x86-64_windows&GENERATE_JOBS=true&KEEP_REPORTDIR=true&PERSONAL_BUILD=false&DOCKER_REGISTRY_DIR=&RERUN_ITERATIONS=0&ADOPTOPENJDK_REPO=https%3A%2F%2Fgithub.com%2Fadoptium%2Faqa-tests.git&SETUP_JCK_RUN=false&DOCKER_REGISTRY_URL_CREDENTIAL_ID=&LABEL=&EXTRA_OPTIONS=&CUSTOMIZED_SDK_URL=&BUILD_IDENTIFIER=&JENKINS_KEY=&ADOPTOPENJDK_BRANCH=master&LIGHT_WEIGHT_CHECKOUT=false&USE_JRE=false&ARTIFACTORY_SERVER=&KEEP_WORKSPACE=false&USER_CREDENTIALS_ID=&JDK_VERSION=25&DOCKER_REGISTRY_URL=&ITERATIONS=1&VENDOR_TEST_REPOS=&JDK_REPO=https%3A%2F%2Fgithub.com%2Fadoptium%2Fjdk&JCK_GIT_BRANCH=master&OPENJ9_BRANCH=master&OPENJ9_SHA=&JCK_GIT_REPO=&VENDOR_TEST_BRANCHES=&UPSTREAM_JOB_NAME=build-scripts%2Fjobs%2Fjdk%2Fjdk-windows-x64-temurin&OPENJ9_REPO=https%3A%2F%2Fgithub.com%2Feclipse-openj9%2Fopenj9.git&CLOUD_PROVIDER=&CUSTOM_TARGET=&VENDOR_TEST_SHAS=&JDK_BRANCH=jdk-25%2B4_adopt&LABEL_ADDITION=&ARTIFACTORY_REPO=&ARTIFACTORY_ROOT_DIR=&UPSTREAM_TEST_JOB_NUMBER=&DOCKERIMAGE_TAG=&TEST_TIME=120&JDK_IMPL=hotspot&SSH_AGENT_CREDENTIAL=&AUTO_DETECT=true&SLACK_CHANNEL=aqavit-bot&DYNAMIC_COMPILE=false&RELATED_NODES=&ADOPTOPENJDK_SYSTEMTEST_OWNER_BRANCH=adoptium%3Amaster&APPLICATION_OPTIONS=&CUSTOMIZED_SDK_URL_CREDENTIAL_ID=eclipse_temurin_bot_email_and_token&ARCHIVE_TEST_RESULTS=false&NUM_MACHINES=&OPENJDK_SHA=&TRSS_URL=&RERUN_FAILURE=false&USE_TESTENV_PROPERTIES=false&BUILD_LIST=openjdk&ADDITIONAL_ARTIFACTS_REQUIRED=&UPSTREAM_JOB_NUMBER=401&STF_OWNER_BRANCH=adoptium%3Amaster&TIME_LIMIT=25&JVM_OPTIONS=&PARALLEL=None
[Pipeline] junit
[2025-01-06T01:12:09.623Z] Recording test results
[2025-01-06T01:12:13.910Z] [Checks API] No suitable checks publisher found.
[Pipeline] }
[Pipeline] // stage
[Pipeline] echo
[2025-01-06T01:12:13.953Z] PROCESSCATCH: Terminating any hung/left over test processes:
[Pipeline] sh
[2025-01-06T01:12:14.423Z] + aqa-tests/terminateTestProcesses.sh null
[2025-01-06T01:12:14.423Z] Windows machine, using powershell queries...
[2025-01-06T01:12:15.150Z] Woohoo - no rogue processes detected!
[Pipeline] cleanWs
[2025-01-06T01:12:15.270Z] [WS-CLEANUP] Deleting project workspace...
[2025-01-06T01:12:15.270Z] [WS-CLEANUP] Deferred wipeout is disabled by the job configuration...
[2025-01-06T01:12:49.086Z] [WS-CLEANUP] done
[Pipeline] sh
[2025-01-06T01:12:49.561Z] + find /cygdrive/c/temp -name '*core*' -print -exec rm -f '{}' ';'
[Pipeline] }
[Pipeline] // timeout
[Pipeline] timeout
[2025-01-06T01:12:49.662Z] Timeout set to expire in 5 min 0 sec
[Pipeline] {
[Pipeline] }
[Pipeline] // timeout
[Pipeline] }
[Pipeline] // node
[Pipeline] }
[Pipeline] // stage
[Pipeline] echo
[2025-01-06T01:12:49.837Z] SETUP_LABEL: ci.role.test
[Pipeline] stage
[Pipeline] { (Parallel Tests)
[Pipeline] parallel
[2025-01-06T01:12:49.877Z] No branches to run
[Pipeline] // parallel
[Pipeline] node
[2025-01-06T01:12:49.934Z] Running on test-docker-alpine319-x64-4 in /home/jenkins/workspace/Test_openjdk25_hs_special.openjdk_x86-64_windows
[Pipeline] {
[Pipeline] cleanWs
[2025-01-06T01:12:50.213Z] [WS-CLEANUP] Deleting project workspace...
[2025-01-06T01:12:50.213Z] [WS-CLEANUP] Deferred wipeout is disabled by the job configuration...
[2025-01-06T01:12:50.344Z] [WS-CLEANUP] done
[Pipeline] findFiles
[Pipeline] cleanWs
[2025-01-06T01:12:50.754Z] [WS-CLEANUP] Deleting project workspace...
[2025-01-06T01:12:50.754Z] [WS-CLEANUP] Deferred wipeout is disabled by the job configuration...
[2025-01-06T01:12:50.881Z] [WS-CLEANUP] done
[Pipeline] }
[Pipeline] // node
[Pipeline] }
[Pipeline] // stage
[Pipeline] stage
[Pipeline] { (Rerun)
[Pipeline] echo
[2025-01-06T01:12:50.998Z] allocate a node for generating rerun job ...
[Pipeline] node
[2025-01-06T01:12:51.034Z] Running on test-docker-ubuntu2204-ppc64le-1 in /home/jenkins/workspace/Test_openjdk25_hs_special.openjdk_x86-64_windows
[Pipeline] {
[Pipeline] echo
[2025-01-06T01:12:51.056Z] Generating rerun Test_openjdk25_hs_special.openjdk_x86-64_windows_rerun job for running failed test(s) ...
[Pipeline] parallel
[Pipeline] { (Branch: Test_openjdk25_hs_special.openjdk_x86-64_windows_rerun)
[Pipeline] echo
[2025-01-06T01:12:51.100Z] GENERATE_JOBS is set to true, set test job Test_openjdk25_hs_special.openjdk_x86-64_windows_rerun params for generating the job
[Pipeline] fileExists
[Pipeline] sh
[2025-01-06T01:12:51.583Z] + curl -Os https://raw.githubusercontent.com/adoptium/aqa-tests/master/buildenv/jenkins/testJobTemplate
[Pipeline] jobDsl
[2025-01-06T01:12:52.056Z] Processing DSL script testJobTemplate
[2025-01-06T01:13:20.871Z] LEVELS: [special]
[2025-01-06T01:13:20.871Z] JDK_VERSIONS: [8]
[2025-01-06T01:13:20.871Z] GROUPS: [openjdk]
[2025-01-06T01:13:20.871Z] ARCH_OS_LIST: [x86-64_windows]
[2025-01-06T01:13:21.053Z] Added items:
[2025-01-06T01:13:21.053Z] GeneratedJob{name='Test_openjdk25_hs_special.openjdk_x86-64_windows_rerun'}
[Pipeline] }
[Pipeline] // parallel
[Pipeline] }
[Pipeline] // node
[Pipeline] echo
[2025-01-06T01:13:24.067Z] Triggering rerun jobs in parallel ...
[Pipeline] parallel
[Pipeline] { (Branch: Test_openjdk25_hs_special.openjdk_x86-64_windows_rerun)
[Pipeline] build
[2025-01-06T01:13:24.097Z] Scheduling project: Test_openjdk25_hs_special.openjdk_x86-64_windows_rerun
[2025-01-06T01:13:31.476Z] Starting building: Test_openjdk25_hs_special.openjdk_x86-64_windows_rerun #1
[2025-01-06T09:35:08.517Z] Build Test_openjdk25_hs_special.openjdk_x86-64_windows_rerun #1 completed: UNSTABLE
[Pipeline] }
[Pipeline] // parallel
[Pipeline] node
[2025-01-06T09:35:08.581Z] Running on test-osuosl-centos74-ppc64le-2 in /home/jenkins/workspace/Test_openjdk25_hs_special.openjdk_x86-64_windows
[Pipeline] {
[Pipeline] cleanWs
[2025-01-06T09:35:08.958Z] [WS-CLEANUP] Deleting project workspace...
[2025-01-06T09:35:08.958Z] [WS-CLEANUP] Deferred wipeout is disabled by the job configuration...
[2025-01-06T09:35:09.137Z] [WS-CLEANUP] done
[Pipeline] echo
[2025-01-06T09:35:09.149Z] Test_openjdk25_hs_special.openjdk_x86-64_windows_rerun #1 completed with status UNSTABLE
[Pipeline] timeout
[2025-01-06T09:35:09.152Z] Timeout set to expire in 1 hr 0 min
[Pipeline] {
[Pipeline] copyArtifacts
[2025-01-06T09:35:10.412Z] Copied 1 artifact from "Test_openjdk25_hs_special.openjdk_x86-64_windows_rerun" build number 1
[Pipeline] }
[Pipeline] // timeout
[Pipeline] step
[2025-01-06T09:35:10.639Z] TAP Reports Processing: START
[2025-01-06T09:35:10.640Z] Looking for TAP results report in workspace using pattern: Test_openjdk25_hs_special.openjdk_x86-64_windows_rerun/1/**/*.tap
[2025-01-06T09:35:10.818Z] Saving reports...
[2025-01-06T09:35:11.001Z] Processing '/home/jenkins/.jenkins/jobs/Test_openjdk25_hs_special.openjdk_x86-64_windows/builds/1/tap-master-files/Test_openjdk25_hs_special.openjdk_x86-64_windows_rerun/1/aqa-tests/TKG/output_17361558582066/Test_openjdk25_hs_special.openjdk_x86-64_windows_rerun.tap'
[2025-01-06T09:35:11.001Z] Parsing TAP test result [/home/jenkins/.jenkins/jobs/Test_openjdk25_hs_special.openjdk_x86-64_windows/builds/1/tap-master-files/Test_openjdk25_hs_special.openjdk_x86-64_windows_rerun/1/aqa-tests/TKG/output_17361558582066/Test_openjdk25_hs_special.openjdk_x86-64_windows_rerun.tap].
[2025-01-06T09:35:11.004Z] There are failed test cases. Marking build as UNSTABLE
[2025-01-06T09:35:11.023Z] TAP Reports Processing: FINISH
[Pipeline] echo
[2025-01-06T09:35:11.036Z] Saving Test_openjdk25_hs_special.openjdk_x86-64_windows_rerun/1/**/*.tap file on jenkins.
[Pipeline] archiveArtifacts
[2025-01-06T09:35:11.226Z] Archiving artifacts
[2025-01-06T09:35:11.755Z] Recording fingerprints
[Pipeline] findFiles
[Pipeline] readFile
[Pipeline] cleanWs
[2025-01-06T09:35:13.327Z] [WS-CLEANUP] Deleting project workspace...
[2025-01-06T09:35:13.327Z] [WS-CLEANUP] Deferred wipeout is disabled by the job configuration...
[2025-01-06T09:35:13.503Z] [WS-CLEANUP] done
[Pipeline] }
[Pipeline] // node
[Pipeline] }
[Pipeline] // stage
[Pipeline] }
[Pipeline] // timestamps
[Pipeline] End of Pipeline
/home/jenkins/.jenkins/workspace/Test_openjdk25_hs_special.openjdk_x86-64_windows@tmp/jfrog/1/.jfrog deleted
Finished: UNSTABLE