Post Test
[2025-01-09T22:34:03.826Z] make[4]: Leaving directory '/home/jenkins/workspace/Test_openjdk25_hs_extended.functional_ppc64le_linux/aqa-tests/functional/NativeTest'
[2025-01-09T22:34:03.826Z] make[3]: Leaving directory '/home/jenkins/workspace/Test_openjdk25_hs_extended.functional_ppc64le_linux/aqa-tests/functional'
[2025-01-09T22:34:03.826Z] make[2]: Leaving directory '/home/jenkins/workspace/Test_openjdk25_hs_extended.functional_ppc64le_linux/aqa-tests'
[2025-01-09T22:34:03.826Z]
[2025-01-09T22:34:03.826Z]
[2025-01-09T22:34:03.826Z] All tests finished, run result summary:
[2025-01-09T22:34:03.826Z] cd "/home/jenkins/workspace/Test_openjdk25_hs_extended.functional_ppc64le_linux/aqa-tests/TKG/../TKG/scripts"; \
[2025-01-09T22:34:03.826Z] perl "resultsSum.pl" --failuremk="/home/jenkins/workspace/Test_openjdk25_hs_extended.functional_ppc64le_linux/aqa-tests/TKG/../TKG/failedtargets.mk" --resultFile="/home/jenkins/workspace/Test_openjdk25_hs_extended.functional_ppc64le_linux/aqa-tests/TKG/../TKG/output_17364610603831/TestTargetResult" --platFile="/home/jenkins/workspace/Test_openjdk25_hs_extended.functional_ppc64le_linux/aqa-tests/TKG/../TKG/resources/buildPlatformMap.properties" --diagnostic=failure --jdkVersion=25 --jdkImpl=hotspot --jdkVendor="eclipse" --spec=linux_ppc-64_le --buildList=functional --customTarget="" --testTarget=extended.functional --tapPath=/home/jenkins/workspace/Test_openjdk25_hs_extended.functional_ppc64le_linux/aqa-tests/TKG/../TKG/output_17364610603831/ --tapName=Test_openjdk25_hs_extended.functional_ppc64le_linux.tap --comment=""
[2025-01-09T22:34:04.150Z]
[2025-01-09T22:34:04.150Z]
[2025-01-09T22:34:04.150Z] TEST TARGETS SUMMARY
[2025-01-09T22:34:04.150Z] ++++++++++++++++++++++++++++++++++++++++++++++++++++++++++++++++++++++++++
[2025-01-09T22:34:04.150Z] DISABLED test targets:
[2025-01-09T22:34:04.150Z] CryptoTests_0
[2025-01-09T22:34:04.150Z] SecurityTests_0
[2025-01-09T22:34:04.150Z] vmLifecyleTests_0
[2025-01-09T22:34:04.150Z] vmLifecyleTests_1
[2025-01-09T22:34:04.150Z] vmLifecyleTests_2
[2025-01-09T22:34:04.150Z] vmLifecyleTests_3
[2025-01-09T22:34:04.150Z] vmLifecyleTests_4
[2025-01-09T22:34:04.150Z] vmLifecyleTests_5
[2025-01-09T22:34:04.150Z]
[2025-01-09T22:34:04.150Z] PASSED test targets:
[2025-01-09T22:34:04.150Z] jsr292BootstrapTest_0
[2025-01-09T22:34:04.150Z] IllegalAccessProtectedMethodTest_hs_0
[2025-01-09T22:34:04.150Z]
[2025-01-09T22:34:04.150Z] FAILED test targets:
[2025-01-09T22:34:04.150Z] CryptoTests_jtreg_0 - Test results: passed: 27; failed: 5
[2025-01-09T22:34:04.150Z] Failed test cases:
[2025-01-09T22:34:04.150Z]
[2025-01-09T22:34:04.150Z] MockitoMockTest_0
[2025-01-09T22:34:04.150Z]
[2025-01-09T22:34:04.150Z] TOTAL: 14 EXECUTED: 4 PASSED: 2 FAILED: 2 DISABLED: 8 SKIPPED: 2
[2025-01-09T22:34:04.150Z] ++++++++++++++++++++++++++++++++++++++++++++++++++++++++++++++++++++++++++
[2025-01-09T22:34:04.150Z]
[2025-01-09T22:34:04.150Z] make[1]: *** [settings.mk:450: resultsSummary] Error 2
[2025-01-09T22:34:04.150Z] make[1]: Leaving directory '/home/jenkins/workspace/Test_openjdk25_hs_extended.functional_ppc64le_linux/aqa-tests/TKG'
[2025-01-09T22:34:04.150Z] make: *** [makefile:66: _extended.functional] Error 2
[Pipeline] sh
[2025-01-09T22:34:04.633Z] + uname
[2025-01-09T22:34:04.633Z] + [ Linux = AIX ]
[2025-01-09T22:34:04.633Z] + uname
[2025-01-09T22:34:04.633Z] + [ Linux = SunOS ]
[2025-01-09T22:34:04.633Z] + uname
[2025-01-09T22:34:04.633Z] + [ Linux = *BSD ]
[2025-01-09T22:34:04.633Z] + MAKE=make
[2025-01-09T22:34:04.633Z] + make -f ./aqa-tests/TKG/testEnv.mk testEnvTeardown
[2025-01-09T22:34:04.633Z] make: Nothing to be done for 'testEnvTeardown'.
[Pipeline] }
[2025-01-09T22:34:04.683Z] Xvfb stopping
[Pipeline] // wrap
[Pipeline] echo
[2025-01-09T22:34:04.849Z] There were test failures, set build result to UNSTABLE.
[Pipeline] }
[Pipeline] // stage
[Pipeline] stage
[Pipeline] { (Post)
[Pipeline] step
[2025-01-09T22:34:04.942Z] TAP Reports Processing: START
[2025-01-09T22:34:04.943Z] Looking for TAP results report in workspace using pattern: aqa-tests/TKG/**/*.tap
[2025-01-09T22:34:05.013Z] Saving reports...
[2025-01-09T22:34:05.114Z] Processing '/home/jenkins/.jenkins/jobs/Test_openjdk25_hs_extended.functional_ppc64le_linux/builds/2/tap-master-files/aqa-tests/TKG/output_17364610603831/Test_openjdk25_hs_extended.functional_ppc64le_linux.tap'
[2025-01-09T22:34:05.114Z] Parsing TAP test result [/home/jenkins/.jenkins/jobs/Test_openjdk25_hs_extended.functional_ppc64le_linux/builds/2/tap-master-files/aqa-tests/TKG/output_17364610603831/Test_openjdk25_hs_extended.functional_ppc64le_linux.tap].
[2025-01-09T22:34:05.212Z] There are failed test cases. Marking build as UNSTABLE
[2025-01-09T22:34:05.212Z] TAP Reports Processing: FINISH
[Pipeline] echo
[2025-01-09T22:34:05.220Z] Saving aqa-tests/testenv/testenv.properties file on jenkins.
[Pipeline] archiveArtifacts
[2025-01-09T22:34:05.245Z] Archiving artifacts
[2025-01-09T22:34:05.281Z] Recording fingerprints
[Pipeline] echo
[2025-01-09T22:34:05.314Z] Saving aqa-tests/TKG/**/*.tap file on jenkins.
[Pipeline] archiveArtifacts
[2025-01-09T22:34:05.340Z] Archiving artifacts
[2025-01-09T22:34:05.445Z] Recording fingerprints
[Pipeline] sh
[2025-01-09T22:34:05.930Z] + pigz -9
[2025-01-09T22:34:05.930Z] + gzip -9
[2025-01-09T22:34:05.930Z] + tar -cf - ./aqa-tests/TKG/output_17364610603831
[Pipeline] echo
[2025-01-09T22:34:05.985Z] ARTIFACTORY_SERVER is not set. Saving artifacts on jenkins.
[Pipeline] archiveArtifacts
[2025-01-09T22:34:06.012Z] Archiving artifacts
[2025-01-09T22:34:06.097Z] Recording fingerprints
[Pipeline] findFiles
[Pipeline] echo
[2025-01-09T22:34:06.723Z] Tap file found: aqa-tests/TKG/output_17364610603831/Test_openjdk25_hs_extended.functional_ppc64le_linux.tap...
[Pipeline] readFile
[Pipeline] echo
[2025-01-09T22:34:06.973Z] Rerun in Grinder with failed test targets: https://ci.adoptium.net/job/Grinder/parambuild/?SDK_RESOURCE=upstream&TARGET=testList+TESTLIST=CryptoTests_jtreg_0,MockitoMockTest_0&BASE_DOCKER_REGISTRY_CREDENTIAL_ID=&TEST_FLAG=&UPSTREAM_TEST_JOB_NAME=&DOCKER_REQUIRED=false&ACTIVE_NODE_TIMEOUT=5&VENDOR_TEST_DIRS=&EXTRA_DOCKER_ARGS=&TKG_OWNER_BRANCH=adoptium%3Amaster&OPENJ9_SYSTEMTEST_OWNER_BRANCH=eclipse%3Amaster&PLATFORM=ppc64le_linux&GENERATE_JOBS=true&KEEP_REPORTDIR=false&PERSONAL_BUILD=false&DOCKER_REGISTRY_DIR=&RERUN_ITERATIONS=0&ADOPTOPENJDK_REPO=https%3A%2F%2Fgithub.com%2Fadoptium%2Faqa-tests.git&SETUP_JCK_RUN=false&DOCKER_REGISTRY_URL_CREDENTIAL_ID=&LABEL=&EXTRA_OPTIONS=&CUSTOMIZED_SDK_URL=&BUILD_IDENTIFIER=&JENKINS_KEY=&ADOPTOPENJDK_BRANCH=master&LIGHT_WEIGHT_CHECKOUT=false&USE_JRE=false&ARTIFACTORY_SERVER=&KEEP_WORKSPACE=false&USER_CREDENTIALS_ID=&JDK_VERSION=25&DOCKER_REGISTRY_URL=&ITERATIONS=1&VENDOR_TEST_REPOS=&JDK_REPO=https%3A%2F%2Fgithub.com%2Fadoptium%2Fjdk&JCK_GIT_BRANCH=master&OPENJ9_BRANCH=master&OPENJ9_SHA=&JCK_GIT_REPO=&VENDOR_TEST_BRANCHES=&UPSTREAM_JOB_NAME=build-scripts%2Fjobs%2Fjdk%2Fjdk-linux-ppc64le-temurin&OPENJ9_REPO=https%3A%2F%2Fgithub.com%2Feclipse-openj9%2Fopenj9.git&CLOUD_PROVIDER=&CUSTOM_TARGET=&VENDOR_TEST_SHAS=&JDK_BRANCH=jdk-25%2B5_adopt&LABEL_ADDITION=&ARTIFACTORY_REPO=&ARTIFACTORY_ROOT_DIR=&UPSTREAM_TEST_JOB_NUMBER=&DOCKERIMAGE_TAG=&TEST_TIME=120&JDK_IMPL=hotspot&SSH_AGENT_CREDENTIAL=&AUTO_DETECT=true&SLACK_CHANNEL=aqavit-bot&DYNAMIC_COMPILE=true&RELATED_NODES=&ADOPTOPENJDK_SYSTEMTEST_OWNER_BRANCH=adoptium%3Amaster&APPLICATION_OPTIONS=&CUSTOMIZED_SDK_URL_CREDENTIAL_ID=eclipse_temurin_bot_email_and_token&ARCHIVE_TEST_RESULTS=false&NUM_MACHINES=&OPENJDK_SHA=&TRSS_URL=&RERUN_FAILURE=true&USE_TESTENV_PROPERTIES=false&BUILD_LIST=functional&ADDITIONAL_ARTIFACTS_REQUIRED=&UPSTREAM_JOB_NUMBER=330&STF_OWNER_BRANCH=adoptium%3Amaster&TIME_LIMIT=25&JVM_OPTIONS=&PARALLEL=None
[Pipeline] junit
[2025-01-09T22:34:07.027Z] Recording test results
[2025-01-09T22:34:07.772Z] [Checks API] No suitable checks publisher found.
[Pipeline] }
[Pipeline] // stage
[Pipeline] echo
[2025-01-09T22:34:07.864Z] PROCESSCATCH: Terminating any hung/left over test processes:
[Pipeline] sh
[2025-01-09T22:34:08.295Z] + aqa-tests/terminateTestProcesses.sh jenkins
[2025-01-09T22:34:08.295Z] Unix type machine..
[2025-01-09T22:34:08.295Z] Running in a Linux docker container
[2025-01-09T22:34:08.295Z] Woohoo - no rogue processes detected!
[Pipeline] cleanWs
[2025-01-09T22:34:08.408Z] [WS-CLEANUP] Deleting project workspace...
[2025-01-09T22:34:08.408Z] [WS-CLEANUP] Deferred wipeout is disabled by the job configuration...
[2025-01-09T22:34:10.353Z] [WS-CLEANUP] done
[Pipeline] sh
[2025-01-09T22:34:10.776Z] + find /tmp -name *core* -print -exec rm -f {} ;
[Pipeline] }
[Pipeline] // timeout
[Pipeline] timeout
[2025-01-09T22:34:10.908Z] Timeout set to expire in 5 min 0 sec
[Pipeline] {
[Pipeline] }
[Pipeline] // timeout
[Pipeline] }
[Pipeline] // node
[Pipeline] }
[Pipeline] // stage
[Pipeline] echo
[2025-01-09T22:34:11.307Z] SETUP_LABEL: ci.role.test
[Pipeline] stage
[Pipeline] { (Parallel Tests)
[Pipeline] parallel
[2025-01-09T22:34:11.389Z] No branches to run
[Pipeline] // parallel
[Pipeline] node
[2025-01-09T22:34:11.479Z] Running on test-docker-ubuntu2004-armv7l-2 in /home/jenkins/workspace/Test_openjdk25_hs_extended.functional_ppc64le_linux
[Pipeline] {
[Pipeline] cleanWs
[2025-01-09T22:34:11.800Z] [WS-CLEANUP] Deleting project workspace...
[2025-01-09T22:34:11.800Z] [WS-CLEANUP] Deferred wipeout is disabled by the job configuration...
[2025-01-09T22:34:11.934Z] [WS-CLEANUP] done
[Pipeline] findFiles
[Pipeline] cleanWs
[2025-01-09T22:34:12.354Z] [WS-CLEANUP] Deleting project workspace...
[2025-01-09T22:34:12.354Z] [WS-CLEANUP] Deferred wipeout is disabled by the job configuration...
[2025-01-09T22:34:12.489Z] [WS-CLEANUP] done
[Pipeline] }
[Pipeline] // node
[Pipeline] }
[Pipeline] // stage
[Pipeline] stage
[Pipeline] { (Rerun)
[Pipeline] echo
[2025-01-09T22:34:12.785Z] allocate a node for generating rerun job ...
[Pipeline] node
[2025-01-09T22:34:12.813Z] Running on test-rise-ubuntu2404-riscv64-5 in /home/jenkins/workspace/Test_openjdk25_hs_extended.functional_ppc64le_linux
[Pipeline] {
[Pipeline] echo
[2025-01-09T22:34:12.936Z] Generating rerun Test_openjdk25_hs_extended.functional_ppc64le_linux_rerun job for running failed test(s) ...
[Pipeline] parallel
[Pipeline] { (Branch: Test_openjdk25_hs_extended.functional_ppc64le_linux_rerun)
[Pipeline] echo
[2025-01-09T22:34:13.009Z] GENERATE_JOBS is set to true, set test job Test_openjdk25_hs_extended.functional_ppc64le_linux_rerun params for generating the job
[Pipeline] fileExists
[Pipeline] sh
[2025-01-09T22:34:13.624Z] + curl -Os https://raw.githubusercontent.com/adoptium/aqa-tests/master/buildenv/jenkins/testJobTemplate
[Pipeline] jobDsl
[2025-01-09T22:34:13.849Z] Processing DSL script testJobTemplate
[2025-01-09T22:35:01.868Z] LEVELS: [extended]
[2025-01-09T22:35:01.868Z] JDK_VERSIONS: [8]
[2025-01-09T22:35:01.868Z] GROUPS: [functional]
[2025-01-09T22:35:01.868Z] ARCH_OS_LIST: [ppc64le_linux]
[2025-01-09T22:35:02.294Z] Existing items:
[2025-01-09T22:35:02.294Z] GeneratedJob{name='Test_openjdk25_hs_extended.functional_ppc64le_linux_rerun'}
[Pipeline] }
[Pipeline] // parallel
[Pipeline] }
[Pipeline] // node
[Pipeline] echo
[2025-01-09T22:35:05.392Z] Triggering rerun jobs in parallel ...
[Pipeline] parallel
[Pipeline] { (Branch: Test_openjdk25_hs_extended.functional_ppc64le_linux_rerun)
[Pipeline] build
[2025-01-09T22:35:05.460Z] Scheduling project: Test_openjdk25_hs_extended.functional_ppc64le_linux_rerun
[2025-01-09T22:35:10.745Z] Starting building: Test_openjdk25_hs_extended.functional_ppc64le_linux_rerun #2
[2025-01-09T22:53:30.984Z] Build Test_openjdk25_hs_extended.functional_ppc64le_linux_rerun #2 completed: UNSTABLE
[Pipeline] }
[Pipeline] // parallel
[Pipeline] node
[2025-01-09T22:53:31.107Z] Running on test-docker-ubuntu2204-ppc64le-2 in /home/jenkins/workspace/Test_openjdk25_hs_extended.functional_ppc64le_linux
[Pipeline] {
[Pipeline] cleanWs
[2025-01-09T22:53:31.191Z] [WS-CLEANUP] Deleting project workspace...
[2025-01-09T22:53:31.191Z] [WS-CLEANUP] Deferred wipeout is disabled by the job configuration...
[2025-01-09T22:53:31.206Z] [WS-CLEANUP] done
[Pipeline] echo
[2025-01-09T22:53:31.214Z] Test_openjdk25_hs_extended.functional_ppc64le_linux_rerun #2 completed with status UNSTABLE
[Pipeline] timeout
[2025-01-09T22:53:31.216Z] Timeout set to expire in 1 hr 0 min
[Pipeline] {
[Pipeline] copyArtifacts
[2025-01-09T22:53:31.439Z] Copied 1 artifact from "Test_openjdk25_hs_extended.functional_ppc64le_linux_rerun" build number 2
[Pipeline] }
[Pipeline] // timeout
[Pipeline] step
[2025-01-09T22:53:31.558Z] TAP Reports Processing: START
[2025-01-09T22:53:31.559Z] Looking for TAP results report in workspace using pattern: Test_openjdk25_hs_extended.functional_ppc64le_linux_rerun/2/**/*.tap
[2025-01-09T22:53:31.575Z] Saving reports...
[2025-01-09T22:53:31.663Z] Processing '/home/jenkins/.jenkins/jobs/Test_openjdk25_hs_extended.functional_ppc64le_linux/builds/2/tap-master-files/Test_openjdk25_hs_extended.functional_ppc64le_linux_rerun/2/aqa-tests/TKG/output_17364622507867/Test_openjdk25_hs_extended.functional_ppc64le_linux_rerun.tap'
[2025-01-09T22:53:31.663Z] Parsing TAP test result [/home/jenkins/.jenkins/jobs/Test_openjdk25_hs_extended.functional_ppc64le_linux/builds/2/tap-master-files/Test_openjdk25_hs_extended.functional_ppc64le_linux_rerun/2/aqa-tests/TKG/output_17364622507867/Test_openjdk25_hs_extended.functional_ppc64le_linux_rerun.tap].
[2025-01-09T22:53:31.790Z] There are failed test cases. Marking build as UNSTABLE
[2025-01-09T22:53:31.856Z] TAP Reports Processing: FINISH
[Pipeline] echo
[2025-01-09T22:53:31.865Z] Saving Test_openjdk25_hs_extended.functional_ppc64le_linux_rerun/2/**/*.tap file on jenkins.
[Pipeline] archiveArtifacts
[2025-01-09T22:53:31.889Z] Archiving artifacts
[2025-01-09T22:53:31.971Z] Recording fingerprints
[Pipeline] findFiles
[Pipeline] readFile
[Pipeline] cleanWs
[2025-01-09T22:53:37.946Z] [WS-CLEANUP] Deleting project workspace...
[2025-01-09T22:53:37.946Z] [WS-CLEANUP] Deferred wipeout is disabled by the job configuration...
[2025-01-09T22:53:37.962Z] [WS-CLEANUP] done
[Pipeline] }
[Pipeline] // node
[Pipeline] }
[Pipeline] // stage
[Pipeline] }
[Pipeline] // timestamps
[Pipeline] End of Pipeline
/home/jenkins/.jenkins/workspace/Test_openjdk25_hs_extended.functional_ppc64le_linux@tmp/jfrog/2/.jfrog deleted
Finished: UNSTABLE