testXXArgumentTesting_0
[2024-08-30T21:03:29.376Z] Running test testXXArgumentTesting_0 ...
[2024-08-30T21:03:29.376Z] ===============================================
[2024-08-30T21:03:29.376Z] testXXArgumentTesting_0 Start Time: Fri Aug 30 21:03:28 2024 Epoch Time (ms): 1725051808673
[2024-08-30T21:03:29.376Z] variation: Mode150
[2024-08-30T21:03:29.376Z] JVM_OPTIONS: -XX:+UseCompressedOops
[2024-08-30T21:03:29.376Z] { \
[2024-08-30T21:03:29.376Z] echo ""; echo "TEST SETUP:"; \
[2024-08-30T21:03:29.376Z] echo "Nothing to be done for setup."; \
[2024-08-30T21:03:29.376Z] mkdir -p "/home/jenkins/workspace/Test_openjdk21_hs_sanity.functional_aarch64_alpine-linux/aqa-tests/TKG/../TKG/output_17250517825975/testXXArgumentTesting_0"; \
[2024-08-30T21:03:29.376Z] cd "/home/jenkins/workspace/Test_openjdk21_hs_sanity.functional_aarch64_alpine-linux/aqa-tests/TKG/../TKG/output_17250517825975/testXXArgumentTesting_0"; \
[2024-08-30T21:03:29.376Z] echo ""; echo "TESTING:"; \
[2024-08-30T21:03:29.376Z] "/home/jenkins/workspace/Test_openjdk21_hs_sanity.functional_aarch64_alpine-linux/jdkbinary/j2sdk-image/bin/java" -DEXE='"/home/jenkins/workspace/Test_openjdk21_hs_sanity.functional_aarch64_alpine-linux/jdkbinary/j2sdk-image/bin/java" ' -jar "/home/jenkins/workspace/Test_openjdk21_hs_sanity.functional_aarch64_alpine-linux/aqa-tests/TKG/../../jvmtest/functional/cmdline_options_tester/cmdlinetester.jar" \
[2024-08-30T21:03:29.376Z] -config "/home/jenkins/workspace/Test_openjdk21_hs_sanity.functional_aarch64_alpine-linux/aqa-tests/TKG/../../jvmtest/functional/cmdLineTests/xxargtest/XXArgumentTesting.xml"; \
[2024-08-30T21:03:29.376Z] if [ $? -eq 0 ]; then echo "-----------------------------------"; echo "testXXArgumentTesting_0""_PASSED"; echo "-----------------------------------"; cd /home/jenkins/workspace/Test_openjdk21_hs_sanity.functional_aarch64_alpine-linux/aqa-tests/TKG/..; rm -f -r "/home/jenkins/workspace/Test_openjdk21_hs_sanity.functional_aarch64_alpine-linux/aqa-tests/TKG/../TKG/output_17250517825975/testXXArgumentTesting_0"; else echo "-----------------------------------"; echo "testXXArgumentTesting_0""_FAILED"; echo "-----------------------------------"; fi; \
[2024-08-30T21:03:29.376Z] echo ""; echo "TEST TEARDOWN:"; \
[2024-08-30T21:03:29.376Z] echo "Nothing to be done for teardown."; \
[2024-08-30T21:03:29.376Z] } 2>&1 | tee -a "/home/jenkins/workspace/Test_openjdk21_hs_sanity.functional_aarch64_alpine-linux/aqa-tests/TKG/../TKG/output_17250517825975/TestTargetResult";
[2024-08-30T21:03:29.376Z]
[2024-08-30T21:03:29.376Z] TEST SETUP:
[2024-08-30T21:03:29.376Z] Nothing to be done for setup.
[2024-08-30T21:03:29.376Z]
[2024-08-30T21:03:29.376Z] TESTING:
[2024-08-30T21:03:29.376Z] *** Starting test suite: XXArgumentTesting.xml ***
[2024-08-30T21:03:29.376Z] Testing: Ensure -XXnosuballoc32bitmem is recognized on all platforms
[2024-08-30T21:03:30.149Z] Test start time: 2024/08/30 21:03:29 Greenwich Mean Time
[2024-08-30T21:03:30.149Z] Running command: "/home/jenkins/workspace/Test_openjdk21_hs_sanity.functional_aarch64_alpine-linux/jdkbinary/j2sdk-image/bin/java" -Xcompressedrefs -XXnosuballoc32bitmem -version
[2024-08-30T21:03:30.149Z] Time spent starting: 183 milliseconds
[2024-08-30T21:03:30.149Z] Time spent executing: 246 milliseconds
[2024-08-30T21:03:30.149Z] Test result: FAILED
[2024-08-30T21:03:30.149Z] Output from test:
[2024-08-30T21:03:30.149Z] [ERR] Unrecognized option: -Xcompressedrefs
[2024-08-30T21:03:30.149Z] [ERR] Error: Could not create the Java Virtual Machine.
[2024-08-30T21:03:30.149Z] [ERR] Error: A fatal exception has occurred. Program will exit.
[2024-08-30T21:03:30.149Z] >> Success condition was not found: [Output match: (java|openjdk|semeru) version]
[2024-08-30T21:03:30.149Z] >> Failure condition was not found: [Output match: Command-line option unrecognised]
[2024-08-30T21:03:30.149Z] >> Failure condition was not found: [Output match: Unhandled Exception]
[2024-08-30T21:03:30.149Z] >> Failure condition was not found: [Output match: Exception:]
[2024-08-30T21:03:30.150Z] >> Failure condition was not found: [Output match: Processing dump event]
[2024-08-30T21:03:30.150Z]
[2024-08-30T21:03:30.150Z] Executing command: rm -f testjavacore.txt
[2024-08-30T21:03:30.150Z]
[2024-08-30T21:03:30.150Z] Testing: Generate a javacore without -XXnosuballoc32bitmem
[2024-08-30T21:03:30.150Z] Test start time: 2024/08/30 21:03:29 Greenwich Mean Time
[2024-08-30T21:03:30.150Z] Running command: "/home/jenkins/workspace/Test_openjdk21_hs_sanity.functional_aarch64_alpine-linux/jdkbinary/j2sdk-image/bin/java" -Xcompressedrefs -Xdump:java:events=vmstop,file=testjavacore.txt -version
[2024-08-30T21:03:30.150Z] Time spent starting: 41 milliseconds
[2024-08-30T21:03:30.150Z] Time spent executing: 67 milliseconds
[2024-08-30T21:03:30.150Z] Test result: FAILED
[2024-08-30T21:03:30.150Z] Output from test:
[2024-08-30T21:03:30.150Z] [ERR] Unrecognized option: -Xcompressedrefs
[2024-08-30T21:03:30.150Z] [ERR] Error: Could not create the Java Virtual Machine.
[2024-08-30T21:03:30.150Z] [ERR] Error: A fatal exception has occurred. Program will exit.
[2024-08-30T21:03:30.150Z] >> Success condition was not found: [Output match: (java|openjdk|semeru) version]
[2024-08-30T21:03:30.150Z] >> Failure condition was not found: [Output match: Command-line option unrecognised]
[2024-08-30T21:03:30.150Z] >> Failure condition was not found: [Output match: Unhandled Exception]
[2024-08-30T21:03:30.150Z] >> Failure condition was not found: [Output match: Exception:]
[2024-08-30T21:03:30.150Z]
[2024-08-30T21:03:30.150Z] Testing: Verify that the sub allocator memory is listed in the javacore
[2024-08-30T21:03:30.150Z] Test start time: 2024/08/30 21:03:29 Greenwich Mean Time
[2024-08-30T21:03:30.150Z] Running command: cat testjavacore.txt
[2024-08-30T21:03:30.150Z] Time spent starting: 3 milliseconds
[2024-08-30T21:03:30.150Z] Time spent executing: 7 milliseconds
[2024-08-30T21:03:30.150Z] Test result: FAILED
[2024-08-30T21:03:30.150Z] Output from test:
[2024-08-30T21:03:30.150Z] [ERR] cat: can't open 'testjavacore.txt': No such file or directory
[2024-08-30T21:03:30.150Z] >> Success condition was not found: [Output match: 32bit allocation regions]
[2024-08-30T21:03:30.150Z]
[2024-08-30T21:03:30.150Z] Executing command: rm -f testjavacore.txt
[2024-08-30T21:03:30.150Z]
[2024-08-30T21:03:30.150Z] Testing: Generate a javacore with -XXnosuballoc32bitmem
[2024-08-30T21:03:30.150Z] Test start time: 2024/08/30 21:03:29 Greenwich Mean Time
[2024-08-30T21:03:30.150Z] Running command: "/home/jenkins/workspace/Test_openjdk21_hs_sanity.functional_aarch64_alpine-linux/jdkbinary/j2sdk-image/bin/java" -Xcompressedrefs -XXnosuballoc32bitmem -Xdump:java:events=vmstop,file=testjavacore.txt -version
[2024-08-30T21:03:30.150Z] Time spent starting: 2 milliseconds
[2024-08-30T21:03:30.150Z] Time spent executing: 54 milliseconds
[2024-08-30T21:03:30.150Z] Test result: FAILED
[2024-08-30T21:03:30.150Z] Output from test:
[2024-08-30T21:03:30.150Z] [ERR] Unrecognized option: -Xcompressedrefs
[2024-08-30T21:03:30.150Z] [ERR] Error: Could not create the Java Virtual Machine.
[2024-08-30T21:03:30.150Z] [ERR] Error: A fatal exception has occurred. Program will exit.
[2024-08-30T21:03:30.150Z] >> Success condition was not found: [Output match: (java|openjdk|semeru) version]
[2024-08-30T21:03:30.150Z] >> Failure condition was not found: [Output match: Command-line option unrecognised]
[2024-08-30T21:03:30.150Z] >> Failure condition was not found: [Output match: Unhandled Exception]
[2024-08-30T21:03:30.150Z] >> Failure condition was not found: [Output match: Exception:]
[2024-08-30T21:03:30.150Z]
[2024-08-30T21:03:30.150Z] Testing: Verify that the sub allocator memory is not listed in the javacore on z/OS. All other platforms should use the sub-allocator when -XXnosuballoc32bitmem is used.
[2024-08-30T21:03:30.150Z] Test start time: 2024/08/30 21:03:30 Greenwich Mean Time
[2024-08-30T21:03:30.150Z] Running command: cat testjavacore.txt
[2024-08-30T21:03:30.150Z] Time spent starting: 2 milliseconds
[2024-08-30T21:03:30.150Z] Time spent executing: 24 milliseconds
[2024-08-30T21:03:30.150Z] Test result: FAILED
[2024-08-30T21:03:30.150Z] Output from test:
[2024-08-30T21:03:30.150Z] [ERR] cat: can't open 'testjavacore.txt': No such file or directory
[2024-08-30T21:03:30.150Z] >> Success condition was not found: [Output match: Javacore filename]
[2024-08-30T21:03:30.150Z]
[2024-08-30T21:03:30.150Z] Testing: Verify -XX:MaxHeapSize -XX:InitialHeapSize -XX:ThreadStackSize
[2024-08-30T21:03:30.150Z] Test start time: 2024/08/30 21:03:30 Greenwich Mean Time
[2024-08-30T21:03:30.150Z] Running command: "/home/jenkins/workspace/Test_openjdk21_hs_sanity.functional_aarch64_alpine-linux/jdkbinary/j2sdk-image/bin/java" -XX:MaxHeapSize=234m -XX:InitialHeapSize=11m -verbose:sizes -version
[2024-08-30T21:03:30.150Z] Time spent starting: 1 milliseconds
[2024-08-30T21:03:30.934Z] Time spent executing: 255 milliseconds
[2024-08-30T21:03:30.934Z] Test result: FAILED
[2024-08-30T21:03:30.934Z] Output from test:
[2024-08-30T21:03:30.934Z] [ERR] openjdk version "21.0.5-beta" 2024-10-15
[2024-08-30T21:03:30.934Z] [ERR] OpenJDK Runtime Environment Temurin-21.0.5+5-202408301903 (build 21.0.5-beta+5-ea)
[2024-08-30T21:03:30.934Z] [ERR] OpenJDK 64-Bit Server VM Temurin-21.0.5+5-202408301903 (build 21.0.5-beta+5-ea, mixed mode, sharing)
[2024-08-30T21:03:30.934Z] >> Success condition was not found: [Output match: OpenJ9]
[2024-08-30T21:03:30.934Z] >> Required condition was not found: [Output match: -Xmx234M]
[2024-08-30T21:03:30.934Z] >> Required condition was not found: [Output match: -Xms11M]
[2024-08-30T21:03:30.934Z]
[2024-08-30T21:03:30.934Z] Testing: Verify -XX:+PrintFlagsFinal
[2024-08-30T21:03:30.934Z] Test start time: 2024/08/30 21:03:30 Greenwich Mean Time
[2024-08-30T21:03:30.934Z] Running command: "/home/jenkins/workspace/Test_openjdk21_hs_sanity.functional_aarch64_alpine-linux/jdkbinary/j2sdk-image/bin/java" -XX:+PrintFlagsFinal -version
[2024-08-30T21:03:30.934Z] Time spent starting: 5 milliseconds
[2024-08-30T21:03:30.934Z] Time spent executing: 367 milliseconds
[2024-08-30T21:03:30.934Z] Test result: PASSED
[2024-08-30T21:03:30.934Z]
[2024-08-30T21:03:30.934Z] Testing: Verify rightmost -XX:+PrintFlagsFinal overrides earlier -XX:-PrintFlagsFinal
[2024-08-30T21:03:30.934Z] Test start time: 2024/08/30 21:03:30 Greenwich Mean Time
[2024-08-30T21:03:30.934Z] Running command: "/home/jenkins/workspace/Test_openjdk21_hs_sanity.functional_aarch64_alpine-linux/jdkbinary/j2sdk-image/bin/java" -XX:-PrintFlagsFinal -XX:+PrintFlagsFinal -version
[2024-08-30T21:03:30.934Z] Time spent starting: 2 milliseconds
[2024-08-30T21:03:31.699Z] Time spent executing: 473 milliseconds
[2024-08-30T21:03:31.699Z] Test result: PASSED
[2024-08-30T21:03:31.699Z]
[2024-08-30T21:03:31.699Z] Testing: Verify rightmost -XX:-PrintFlagsFinal overrides earlier -XX:+PrintFlagsFinal
[2024-08-30T21:03:31.699Z] Test start time: 2024/08/30 21:03:31 Greenwich Mean Time
[2024-08-30T21:03:31.699Z] Running command: "/home/jenkins/workspace/Test_openjdk21_hs_sanity.functional_aarch64_alpine-linux/jdkbinary/j2sdk-image/bin/java" -XX:+PrintFlagsFinal -XX:-PrintFlagsFinal -version
[2024-08-30T21:03:31.699Z] Time spent starting: 6 milliseconds
[2024-08-30T21:03:31.699Z] Time spent executing: 238 milliseconds
[2024-08-30T21:03:31.699Z] Test result: PASSED
[2024-08-30T21:03:31.699Z]
[2024-08-30T21:03:31.699Z]
[2024-08-30T21:03:31.699Z] ---TEST RESULTS---
[2024-08-30T21:03:31.699Z] Number of PASSED tests: 3 out of 9
[2024-08-30T21:03:31.699Z] Number of FAILED tests: 6 out of 9
[2024-08-30T21:03:31.699Z]
[2024-08-30T21:03:31.699Z] ---SUMMARY OF FAILED TESTS---
[2024-08-30T21:03:31.699Z] Ensure -XXnosuballoc32bitmem is recognized on all platforms
[2024-08-30T21:03:31.699Z] Generate a javacore without -XXnosuballoc32bitmem
[2024-08-30T21:03:31.699Z] Verify that the sub allocator memory is listed in the javacore
[2024-08-30T21:03:31.699Z] Generate a javacore with -XXnosuballoc32bitmem
[2024-08-30T21:03:31.699Z] Verify that the sub allocator memory is not listed in the javacore on z/OS. All other platforms should use the sub-allocator when -XXnosuballoc32bitmem is used.
[2024-08-30T21:03:31.699Z] Verify -XX:MaxHeapSize -XX:InitialHeapSize -XX:ThreadStackSize
[2024-08-30T21:03:31.699Z] -----------------------------
[2024-08-30T21:03:31.699Z]
[2024-08-30T21:03:31.699Z] -----------------------------------
[2024-08-30T21:03:31.699Z] testXXArgumentTesting_0_PASSED
[2024-08-30T21:03:31.699Z] -----------------------------------
[2024-08-30T21:03:31.699Z]
[2024-08-30T21:03:31.699Z] TEST TEARDOWN:
[2024-08-30T21:03:31.699Z] Nothing to be done for teardown.
[2024-08-30T21:03:31.699Z] testXXArgumentTesting_0 Finish Time: Fri Aug 30 21:03:31 2024 Epoch Time (ms): 1725051811477